incubator-cloudstack-dev mailing list archives

Site index · List index
Message view « Date » · « Thread »
Top « Date » · « Thread »
From Edison Su <Edison...@citrix.com>
Subject RE: mvn install doesn't work any more?
Date Wed, 05 Sep 2012 20:33:56 GMT
It works for me yesterday(on my fresh build machine).

> -----Original Message-----
> From: Chip Childers [mailto:chip.childers@sungard.com]
> Sent: Wednesday, September 05, 2012 1:01 PM
> To: cloudstack-dev@incubator.apache.org
> Subject: Re: mvn install doesn't work any more?
> 
> Edison,
> 
> Are we sure that this ever worked?  Searching the maven central repo
> doesn't show much with the name "vmware":
> http://search.maven.org/#search%7Cga%7C1%7Cvmware
> 
> Is it possible you had them cached locally?
> 
> -chip
> 
> On Wed, Sep 5, 2012 at 2:38 PM, Edison Su <Edison.su@citrix.com> wrote:
> > Does anybody move/remove this files? Who is responsible for these
> files?
> >
> >> -----Original Message-----
> >> From: Edison Su [mailto:Edison.su@citrix.com]
> >> Sent: Wednesday, September 05, 2012 10:20 AM
> >> To: cloudstack-dev@incubator.apache.org
> >> Subject: mvn install doesn't work any more?
> >>
> >> Work for me half an hour ago.
> >>
> >> [INFO] -------------------------------------------------------------
> ---
> >> --------
> >> [INFO] BUILD FAILURE
> >> [INFO] -------------------------------------------------------------
> ---
> >> --------
> >> [INFO] Total time: 5.744s
> >> [INFO] Finished at: Wed Sep 05 13:10:27 EDT 2012
> >> [INFO] Final Memory: 8M/102M
> >> [INFO] -------------------------------------------------------------
> ---
> >> --------
> >> [ERROR] Failed to execute goal on project cloud-deps: Could not
> resolve
> >> dependencies for project org.apache.cloudstack:cloud-deps:jar:4.0.0-
> >> SNAPSHOT: The following artifacts could not be resolved:
> >> com.cloud.com.vmware:vmware-vim:jar:1.0,
> com.cloud.com.vmware:vmware-
> >> vim25:jar:1.0, com.cloud.com.vmware:vmware-apputils:jar:1.0,
> >> com.cloud.com.f5:icontrol:jar:1.0,
> >> com.cloud.com.netapp:manageontap:jar:1.0,
> >> com.cloud.com.citrix:netscaler:jar:1.0,
> com.cloud.com.citrix:netscaler-
> >> sdx:jar:1.0: Could not find artifact com.cloud.com.vmware:vmware-
> >> vim:jar:1.0 in central (http://repo1.maven.org/maven2) -> [Help 1]
> >> org.apache.maven.lifecycle.LifecycleExecutionException: Failed to
> >> execute goal on project cloud-deps: Could not resolve dependencies
> for
> >> project org.apache.cloudstack:cloud-deps:jar:4.0.0-SNAPSHOT: The
> >> following artifacts could not be resolved:
> com.cloud.com.vmware:vmware-
> >> vim:jar:1.0, com.cloud.com.vmware:vmware-vim25:jar:1.0,
> >> com.cloud.com.vmware:vmware-apputils:jar:1.0,
> >> com.cloud.com.f5:icontrol:jar:1.0,
> >> com.cloud.com.netapp:manageontap:jar:1.0,
> >> com.cloud.com.citrix:netscaler:jar:1.0,
> com.cloud.com.citrix:netscaler-
> >> sdx:jar:1.0: Could not find artifact com.cloud.com.vmware:vmware-
> >> vim:jar:1.0 in central (http://repo1.maven.org/maven2)
> >>       at
> >>
> org.apache.maven.lifecycle.internal.LifecycleDependencyResolver.getDepe
> >> ndencies(LifecycleDependencyResolver.java:196)
> >>       at
> >>
> org.apache.maven.lifecycle.internal.LifecycleDependencyResolver.resolve
> >> ProjectDependencies(LifecycleDependencyResolver.java:108)
> >>       at
> >>
> org.apache.maven.lifecycle.internal.MojoExecutor.ensureDependenciesAreR
> >> esolved(MojoExecutor.java:258)
> >>       at
> >>
> org.apache.maven.lifecycle.internal.MojoExecutor.execute(MojoExecutor.j
> >> ava:201)
> >>       at
> >>
> org.apache.maven.lifecycle.internal.MojoExecutor.execute(MojoExecutor.j
> >> ava:153)
> >>       at
> >>
> org.apache.maven.lifecycle.internal.MojoExecutor.execute(MojoExecutor.j
> >> ava:145)
> >>       at
> >>
> org.apache.maven.lifecycle.internal.LifecycleModuleBuilder.buildProject
> >> (LifecycleModuleBuilder.java:84)
> >>       at
> >>
> org.apache.maven.lifecycle.internal.LifecycleModuleBuilder.buildProject
> >> (LifecycleModuleBuilder.java:59)
> >>       at
> >>
> org.apache.maven.lifecycle.internal.LifecycleStarter.singleThreadedBuil
> >> d(LifecycleStarter.java:183)
> >>       at
> >>
> org.apache.maven.lifecycle.internal.LifecycleStarter.execute(LifecycleS
> >> tarter.java:161)
> >>       at
> org.apache.maven.DefaultMaven.doExecute(DefaultMaven.java:319)
> >>       at org.apache.maven.DefaultMaven.execute(DefaultMaven.java:156)
> >>       at org.apache.maven.cli.MavenCli.execute(MavenCli.java:537)
> >>       at org.apache.maven.cli.MavenCli.doMain(MavenCli.java:196)
> >>       at org.apache.maven.cli.MavenCli.main(MavenCli.java:141)
> >>       at sun.reflect.NativeMethodAccessorImpl.invoke0(Native Method)
> >>       at
> >>
> sun.reflect.NativeMethodAccessorImpl.invoke(NativeMethodAccessorImpl.ja
> >> va:57)
> >>       at
> >>
> sun.reflect.DelegatingMethodAccessorImpl.invoke(DelegatingMethodAccesso
> >> rImpl.java:43)
> >>       at java.lang.reflect.Method.invoke(Method.java:616)
> >>       at
> >>
> org.codehaus.plexus.classworlds.launcher.Launcher.launchEnhanced(Launch
> >> er.java:290)
> >>       at
> >>
> org.codehaus.plexus.classworlds.launcher.Launcher.launch(Launcher.java:
> >> 230)
> >>       at
> >>
> org.codehaus.plexus.classworlds.launcher.Launcher.mainWithExitCode(Laun
> >> cher.java:409)
> >>       at
> >>
> org.codehaus.plexus.classworlds.launcher.Launcher.main(Launcher.java:35
> >> 2)
> >> Caused by: org.apache.maven.project.DependencyResolutionException:
> >> Could not resolve dependencies for project
> org.apache.cloudstack:cloud-
> >> deps:jar:4.0.0-SNAPSHOT: The following artifacts could not be
> resolved:
> >> com.cloud.com.vmware:vmware-vim:jar:1.0,
> com.cloud.com.vmware:vmware-
> >> vim25:jar:1.0, com.cloud.com.vmware:vmware-apputils:jar:1.0,
> >> com.cloud.com.f5:icontrol:jar:1.0,
> >> com.cloud.com.netapp:manageontap:jar:1.0,
> >> com.cloud.com.citrix:netscaler:jar:1.0,
> com.cloud.com.citrix:netscaler-
> >> sdx:jar:1.0: Could not find artifact com.cloud.com.vmware:vmware-
> >> vim:jar:1.0 in central (http://repo1.maven.org/maven2)
> >>       at
> >>
> org.apache.maven.project.DefaultProjectDependenciesResolver.resolve(Def
> >> aultProjectDependenciesResolver.java:170)
> >>       at
> >>
> org.apache.maven.lifecycle.internal.LifecycleDependencyResolver.getDepe
> >> ndencies(LifecycleDependencyResolver.java:171)
> >>       ... 22 more
> >> Caused by:
> org.sonatype.aether.resolution.DependencyResolutionException:
> >> The following artifacts could not be resolved:
> >> com.cloud.com.vmware:vmware-vim:jar:1.0,
> com.cloud.com.vmware:vmware-
> >> vim25:jar:1.0, com.cloud.com.vmware:vmware-apputils:jar:1.0,
> >> com.cloud.com.f5:icontrol:jar:1.0,
> >> com.cloud.com.netapp:manageontap:jar:1.0,
> >> com.cloud.com.citrix:netscaler:jar:1.0,
> com.cloud.com.citrix:netscaler-
> >> sdx:jar:1.0: Could not find artifact com.cloud.com.vmware:vmware-
> >> vim:jar:1.0 in central (http://repo1.maven.org/maven2)
> >>       at
> >>
> org.sonatype.aether.impl.internal.DefaultRepositorySystem.resolveDepend
> >> encies(DefaultRepositorySystem.java:412)
> >>       at
> >>
> org.apache.maven.project.DefaultProjectDependenciesResolver.resolve(Def
> >> aultProjectDependenciesResolver.java:164)
> >>       ... 23 more
> >> Caused by:
> org.sonatype.aether.resolution.ArtifactResolutionException:
> >> The following artifacts could not be resolved:
> >> com.cloud.com.vmware:vmware-vim:jar:1.0,
> com.cloud.com.vmware:vmware-
> >> vim25:jar:1.0, com.cloud.com.vmware:vmware-apputils:jar:1.0,
> >> com.cloud.com.f5:icontrol:jar:1.0,
> >> com.cloud.com.netapp:manageontap:jar:1.0,
> >> com.cloud.com.citrix:netscaler:jar:1.0,
> com.cloud.com.citrix:netscaler-
> >> sdx:jar:1.0: Could not find artifact com.cloud.com.vmware:vmware-
> >> vim:jar:1.0 in central (http://repo1.maven.org/maven2)
> >>       at
> >>
> org.sonatype.aether.impl.internal.DefaultArtifactResolver.resolve(Defau
> >> ltArtifactResolver.java:541)
> >>       at
> >>
> org.sonatype.aether.impl.internal.DefaultArtifactResolver.resolveArtifa
> >> cts(DefaultArtifactResolver.java:220)
> >>       at
> >>
> org.sonatype.aether.impl.internal.DefaultRepositorySystem.resolveDepend
> >> encies(DefaultRepositorySystem.java:395)
> >>       ... 24 more
> >> Caused by: org.sonatype.aether.transfer.ArtifactNotFoundException:
> >> Could not find artifact com.cloud.com.vmware:vmware-vim:jar:1.0 in
> >> central (http://repo1.maven.org/maven2)
> >>       at
> >>
> org.sonatype.aether.connector.wagon.WagonRepositoryConnector$4.wrap(Wag
> >> onRepositoryConnector.java:945)
> >>       at
> >>
> org.sonatype.aether.connector.wagon.WagonRepositoryConnector$4.wrap(Wag
> >> onRepositoryConnector.java:940)
> >>       at
> >>
> org.sonatype.aether.connector.wagon.WagonRepositoryConnector$GetTask.fl
> >> ush(WagonRepositoryConnector.java:695)
> >>       at
> >>
> org.sonatype.aether.connector.wagon.WagonRepositoryConnector$GetTask.fl
> >> ush(WagonRepositoryConnector.java:689)
> >>       at
> >>
> org.sonatype.aether.connector.wagon.WagonRepositoryConnector.get(WagonR
> >> epositoryConnector.java:445)
> >>       at
> >>
> org.sonatype.aether.impl.internal.DefaultArtifactResolver.resolve(Defau
> >> ltArtifactResolver.java:460)
> >

Mime
View raw message