incubator-cloudstack-dev mailing list archives

Site index · List index
Message view « Date » · « Thread »
Top « Date » · « Thread »
From coudstacks <cloudsta...@163.com>
Subject maven build error when compile-utils . steps follow cwiki.apache.org's instruction
Date Tue, 11 Sep 2012 14:56:39 GMT
so grieved,never build it correctly.

mybe the article  lacks something.

my environment, CentOS Linux release 6.0 .maven 3.0.4.

 mvn install -P deps
     [exec] [INFO] Building Apache CloudStack Dependencies 4.0.0-SNAPSHOT
     [exec] [INFO] ------------------------------------------------------------------------
     [exec] [WARNING] The POM for org.apache.rampart:rampart-policy:jar:1.5 is invalid, transitive
dependencies (if any) will not be available, enable debug logging for more details
     [exec] [WARNING] The POM for org.apache.rampart:rampart-trust:jar:1.5 is invalid, transitive
dependencies (if any) will not be available, enable debug logging for more details
     [exec] [WARNING] The POM for org.apache.axis2:axis2-kernel:jar:1.5.1 is invalid, transitive
dependencies (if any) will not be available, enable debug logging for more details
     [exec] [WARNING] The POM for org.apache.axis2:mex:jar:impl:1.5.1 is invalid, transitive
dependencies (if any) will not be available, enable debug logging for more details
     [exec] [WARNING] The POM for org.apache.axis2:axis2-mtompolicy:jar:1.5.1 is invalid,
transitive dependencies (if any) will not be available, enable debug logging for more details
     [exec] [WARNING] The POM for org.apache.ws.security:wss4j:jar:1.5.8 is invalid, transitive
dependencies (if any) will not be available, enable debug logging for more details
     [exec] [WARNING] The POM for opensaml:opensaml:jar:1.1 is invalid, transitive dependencies
(if any) will not be available, enable debug logging for more details
     [exec] [WARNING] The POM for bouncycastle:bcprov-jdk14:jar:140 is invalid, transitive
dependencies (if any) will not be available, enable debug logging for more details
     [exec] [INFO]
     [exec] [INFO] --- maven-remote-resources-plugin:1.3:process (default) @ cloud-deps ---
     [exec] [WARNING] Invalid POM for org.apache.rampart:rampart-policy:jar:1.5, transitive
dependencies (if any) will not be available, enable debug logging for more details
     [exec] [WARNING] Invalid POM for org.apache.rampart:rampart-trust:jar:1.5, transitive
dependencies (if any) will not be available, enable debug logging for more details
     [exec] [WARNING] Invalid POM for org.apache.axis2:axis2-kernel:jar:1.5.1, transitive
dependencies (if any) will not be available, enable debug logging for more details
     [exec] [WARNING] Invalid POM for org.apache.axis2:mex:jar:impl:1.5.1, transitive dependencies
(if any) will not be available, enable debug logging for more details
     [exec] [WARNING] Invalid POM for org.apache.axis2:axis2-mtompolicy:jar:1.5.1, transitive
dependencies (if any) will not be available, enable debug logging for more details

 

ant build-all
     [exec] [INFO] ------------------------------------------------------------------------
     [exec] [INFO] BUILD SUCCESS
     [exec] [INFO] ------------------------------------------------------------------------
     [exec] [INFO] Total time: 15.174s
     [exec] [INFO] Finished at: Tue Sep 11 22:21:54 CST 2012
     [exec] [INFO] Final Memory: 17M/52M
     [exec] [INFO] ------------------------------------------------------------------------

compile-utils:
    [mkdir] Created dir: /mnt/incubator-cloudstack/target/classes/cloud-utils.jar
     [echo] Compiling /mnt/incubator-cloudstack/utils/src
    [javac] Compiling 149 source files to /mnt/incubator-cloudstack/target/classes/cloud-utils.jar
    [javac] error: error reading /mnt/incubator-cloudstack/deps/axis2-mtompolicy-1.5.1.jar;
error in opening zip file
    [javac] error: error reading /mnt/incubator-cloudstack/deps/bcprov-jdk14-140.jar; error
in opening zip file
    [javac] error: error reading /mnt/incubator-cloudstack/deps/mex-1.5.1-impl.jar; error
in opening zip file
    [javac] 3 errors

BUILD FAILED
/mnt/incubator-cloudstack/build/build-cloud.xml:186: The following error occurred while executing
this line:
/mnt/incubator-cloudstack/build/build-common.xml:65: Compile failed; see the compiler error
output for details.

Total time: 19 seconds
Mime
  • Unnamed multipart/alternative (inline, None, 0 bytes)
View raw message