incubator-cloudstack-commits mailing list archives

Site index · List index
Message view « Date » · « Thread »
Top « Date » · « Thread »
From Apache Jenkins Server <jenk...@builds.apache.org>
Subject Build failed in Jenkins: cloudstack-apidocs-master #225
Date Sat, 16 Feb 2013 04:54:21 GMT
See <https://builds.apache.org/job/cloudstack-apidocs-master/225/changes>

Changes:

[prachi] CLOUDSTACK-1307 Noticed NPE when we put host in maintenance mode in clustered management
setup

------------------------------------------
[...truncated 3112 lines...]
[INFO] Installing <https://builds.apache.org/job/cloudstack-apidocs-master/ws/test/target/cloud-testclient-4.1.0-SNAPSHOT-tests.jar>
to /home/jenkins/jenkins-slave/maven-repositories/0/org/apache/cloudstack/cloud-testclient/4.1.0-SNAPSHOT/cloud-testclient-4.1.0-SNAPSHOT-tests.jar

[INFO] --- maven-install-plugin:2.3.1:install (default-install) @ cloud-testclient ---
[INFO]                                                                         
[INFO] ------------------------------------------------------------------------
[INFO] Building Apache CloudStack Client UI 4.1.0-SNAPSHOT
[INFO] ------------------------------------------------------------------------
[INFO] Deleting <https://builds.apache.org/job/cloudstack-apidocs-master/ws/client/target>
[INFO] 
[INFO] --- maven-clean-plugin:2.5:clean (default-clean) @ cloud-client-ui ---
[INFO] 
[INFO] --- maven-remote-resources-plugin:1.3:process (default) @ cloud-client-ui ---
Downloading: http://repo.maven.apache.org/maven2/org/libvirt/libvirt/0.4.9/libvirt-0.4.9.pom
[INFO] [INFO] Executing tasks

main:
     [copy] Copying 1 file to <https://builds.apache.org/job/cloudstack-apidocs-master/ws/client/target/generated-webapp/WEB-INF>

[INFO] --- maven-antrun-plugin:1.7:run (generate-resource) @ cloud-client-ui ---
     [copy] Copying 7 files to <https://builds.apache.org/job/cloudstack-apidocs-master/ws/client/target/generated-webapp/WEB-INF/classes>
     [copy] Copying 174 files to <https://builds.apache.org/job/cloudstack-apidocs-master/ws/client/target/generated-webapp/WEB-INF/classes/scripts>
     [copy] Copying 1 file to <https://builds.apache.org/job/cloudstack-apidocs-master/ws/client/target/generated-webapp/WEB-INF/classes/vms>
     [copy] Copying 183 files to <https://builds.apache.org/job/cloudstack-apidocs-master/ws/client/target/generated-webapp>
     [copy] Copying 24 files to <https://builds.apache.org/job/cloudstack-apidocs-master/ws/client/target/generated-webapp/WEB-INF/classes>
     [copy] Copying 24 files to <https://builds.apache.org/job/cloudstack-apidocs-master/ws/client/target/generated-webapp/WEB-INF/classes>
     [copy] Copying 6 files to <https://builds.apache.org/job/cloudstack-apidocs-master/ws/client/target/utilities/bin>
     [copy] Copying 2 files to <https://builds.apache.org/job/cloudstack-apidocs-master/ws/client/target/utilities/bin>
     [copy] Copying 59 files to <https://builds.apache.org/job/cloudstack-apidocs-master/ws/client/target/utilities/scripts/db>
[INFO] Executed tasks
[INFO] [debug] execute contextualize
[INFO] Using 'UTF-8' encoding to copy filtered resources.
[INFO] skip non existing resourceDirectory <https://builds.apache.org/job/cloudstack-apidocs-master/ws/client/src/main/resources>
[INFO] Copying 3 resources

[INFO] --- maven-resources-plugin:2.5:resources (default-resources) @ cloud-client-ui ---
[INFO] [INFO] Executing tasks

main:
[INFO] Executed tasks

[INFO] --- maven-antrun-plugin:1.7:run (process-nonoss) @ cloud-client-ui ---
[INFO] [INFO] Executing tasks

main:
[INFO] Executed tasks

[INFO] --- maven-antrun-plugin:1.7:run (process-nonoss-spring-context) @ cloud-client-ui ---
[INFO] No sources to compile
[INFO] 
[INFO] --- maven-compiler-plugin:2.5.1:compile (default-compile) @ cloud-client-ui ---
[INFO] [debug] execute contextualize
[INFO] Using 'UTF-8' encoding to copy filtered resources.
[INFO] skip non existing resourceDirectory <https://builds.apache.org/job/cloudstack-apidocs-master/ws/client/src/test/resources>
[INFO] Copying 3 resources

[INFO] --- maven-resources-plugin:2.5:testResources (default-testResources) @ cloud-client-ui
---
[INFO] No sources to compile
[INFO] 
[INFO] --- maven-compiler-plugin:2.5.1:testCompile (default-testCompile) @ cloud-client-ui
---
[INFO] [INFO] Surefire report directory: <https://builds.apache.org/job/cloudstack-apidocs-master/ws/client/target/surefire-reports>

-------------------------------------------------------
 T E S T S
-------------------------------------------------------

[INFO] --- maven-surefire-plugin:2.12:test (default-test) @ cloud-client-ui ---

Results :

Tests run: 0, Failures: 0, Errors: 0, Skipped: 0

[JENKINS] Recording test results
[INFO] 
[INFO] --- maven-war-plugin:2.3:war (default-war) @ cloud-client-ui ---
[INFO] Packaging webapp
[INFO] Assembling webapp [cloud-client-ui] in [<https://builds.apache.org/job/cloudstack-apidocs-master/ws/client/target/cloud-client-ui-4.1.0-SNAPSHOT]>
[INFO] Processing war project
[INFO] Copying webapp resources [<https://builds.apache.org/job/cloudstack-apidocs-master/ws/client/target/generated-webapp]>
[INFO] Webapp assembled in [791 msecs]
[INFO] Building war: <https://builds.apache.org/job/cloudstack-apidocs-master/ws/client/target/cloud-client-ui-4.1.0-SNAPSHOT.war>
[INFO] 
[INFO] --- maven-site-plugin:3.1:attach-descriptor (attach-descriptor) @ cloud-client-ui ---
[INFO] Configured Artifact: org.jasypt:jasypt:1.9.0:jar
[INFO] [INFO] Configured Artifact: org.jasypt:jasypt:1.8:jar
[INFO] Copying jasypt-1.9.0.jar to <https://builds.apache.org/job/cloudstack-apidocs-master/ws/client/target/pythonlibs/jasypt-1.9.0.jar>
[INFO] Copying jasypt-1.8.jar to <https://builds.apache.org/job/cloudstack-apidocs-master/ws/client/target/pythonlibs/jasypt-1.8.jar>

[INFO] --- maven-dependency-plugin:2.5.1:copy (copy) @ cloud-client-ui ---
[INFO] [INFO] Installing <https://builds.apache.org/job/cloudstack-apidocs-master/ws/client/target/cloud-client-ui-4.1.0-SNAPSHOT.war>
to /home/jenkins/jenkins-slave/maven-repositories/0/org/apache/cloudstack/cloud-client-ui/4.1.0-SNAPSHOT/cloud-client-ui-4.1.0-SNAPSHOT.war

[INFO] --- maven-install-plugin:2.3.1:install (default-install) @ cloud-client-ui ---
[INFO] Installing <https://builds.apache.org/job/cloudstack-apidocs-master/ws/client/pom.xml>
to /home/jenkins/jenkins-slave/maven-repositories/0/org/apache/cloudstack/cloud-client-ui/4.1.0-SNAPSHOT/cloud-client-ui-4.1.0-SNAPSHOT.pom
[INFO] ------------------------------------------------------------------------
[INFO] Reactor Summary:
[INFO] 
[INFO] Apache CloudStack ................................. SUCCESS [23.794s]
[INFO] Apache CloudStack Utils ........................... SUCCESS [18.864s]
[INFO] Apache CloudStack API ............................. SUCCESS [11.335s]
[INFO] Apache CloudStack Core ............................ SUCCESS [5.445s]
[INFO] Apache CloudStack Agents .......................... SUCCESS [5.785s]
[INFO] Apache CloudStack Framework ....................... SUCCESS [0.574s]
[INFO] Apache CloudStack Framework - IPC ................. SUCCESS [3.742s]
[INFO] Apache CloudStack Framework - REST ................ SUCCESS [3.495s]
[INFO] Apache CloudStack Cloud Engine .................... SUCCESS [1.003s]
[INFO] Apache CloudStack Cloud Engine API ................ SUCCESS [4.196s]
[INFO] Apache CloudStack Framework - Event Notification .. SUCCESS [3.188s]
[INFO] Apache CloudStack Server .......................... SUCCESS [18.201s]
[INFO] Apache CloudStack Usage Server .................... SUCCESS [5.667s]
[INFO] Apache XenSource XAPI ............................. SUCCESS [3.604s]
[INFO] Apache CloudStack Plugin POM ...................... SUCCESS [0.822s]
[INFO] Apache CloudStack Plugin - API Rate Limit ......... SUCCESS [6.103s]
[INFO] Apache CloudStack Plugin - API Discovery .......... SUCCESS [3.554s]
[INFO] Apache CloudStack Plugin - ACL Static Role Based .. SUCCESS [2.653s]
[INFO] Apache CloudStack Plugin - User Concentrated Pod Deployment Planner  SUCCESS [2.799s]
[INFO] Apache CloudStack Plugin - User Dispersing Deployment Planner  SUCCESS [2.912s]
[INFO] Apache CloudStack Plugin - Host Allocator Random .. SUCCESS [2.565s]
[INFO] Apache CloudStack Plugin - Hypervisor OracleVM .... SUCCESS [3.325s]
[INFO] Apache CloudStack Cloud Engine Internal Components API  SUCCESS [2.550s]
[INFO] Apache CloudStack Engine Storage Component ........ SUCCESS [3.474s]
[INFO] Apache CloudStack Plugin - Open vSwitch ........... SUCCESS [3.709s]
[INFO] Apache CloudStack Plugin - Hypervisor Xen ......... SUCCESS [4.297s]
[INFO] Apache CloudStack Plugin - Hypervisor KVM ......... SUCCESS [10.523s]
[INFO] Apache CloudStack Plugin - RabbitMQ Event Bus ..... SUCCESS [4.700s]
[INFO] Apache CloudStack Plugin - Hypervisor Simulator ... SUCCESS [3.773s]
[INFO] Apache CloudStack Plugin - Hypervisor Baremetal ... SUCCESS [3.655s]
[INFO] Apache CloudStack Plugin - Hypervisor UCS ......... SUCCESS [3.357s]
[INFO] Apache CloudStack Plugin - Network Elastic Load Balancer  SUCCESS [3.821s]
[INFO] Apache CloudStack Plugin - Network Nicira NVP ..... SUCCESS [6.254s]
[INFO] Apache CloudStack Plugin - BigSwitch Virtual Network Segment  SUCCESS [5.192s]
[INFO] Apache CloudStack Plugin - Storage Allocator Random  SUCCESS [2.706s]
[INFO] Apache CloudStack Plugin - User Authenticator LDAP  SUCCESS [2.586s]
[INFO] Apache CloudStack Plugin - User Authenticator MD5 . SUCCESS [2.518s]
[INFO] Apache CloudStack Plugin - User Authenticator Plain Text  SUCCESS [2.432s]
[INFO] Apache CloudStack Plugin - User Authenticator SHA256 Salted  SUCCESS [3.533s]
[INFO] Apache CloudStack Plugin - Dns Notifier Example ... SUCCESS [2.531s]
[INFO] Apache CloudStack Engine Storage Image Component .. SUCCESS [2.909s]
[INFO] Apache CloudStack Plugin - Storage Image S3 ....... SUCCESS [2.214s]
[INFO] Apache CloudStack Engine Storage Volume Component . SUCCESS [4.292s]
[INFO] Apache CloudStack Plugin - Storage Volume solidfire  SUCCESS [3.741s]
[INFO] Apache CloudStack SystemVM Patches ................ SUCCESS [1.002s]
[INFO] Apache CloudStack Cloud Engine Compute Component .. SUCCESS [2.311s]
[INFO] Apache CloudStack Cloud Engine Orchestration Component  SUCCESS [4.234s]
[INFO] Apache CloudStack Engine Storage Image Motion Component  SUCCESS [3.533s]
[INFO] Apache CloudStack Engine Storage Backup Component . SUCCESS [2.528s]
[INFO] Apache CloudStack Engine Storage Snapshot Component  SUCCESS [2.674s]
[INFO] Apache CloudStack Engine Storage integration test Component  SUCCESS [3.540s]
[INFO] Apache CloudStack Cloud Engine Schema Component ... SUCCESS [2.069s]
[INFO] Apache CloudStack Cloud Engine API ................ SUCCESS [3.056s]
[INFO] Apache CloudStack Cloud Engine Service ............ SUCCESS [7.525s]
[INFO] Apache CloudStack Cloud Services .................. SUCCESS [0.987s]
[INFO] Apache CloudStack Console Proxy Service ........... SUCCESS [0.956s]
[INFO] Apache CloudStack Console Proxy Plugin ............ SUCCESS [1.010s]
[INFO] Apache CloudStack Console Proxy ................... SUCCESS [7.127s]
[INFO] Apache CloudStack Test ............................ SUCCESS [3.930s]
[INFO] Apache CloudStack Client UI ....................... SUCCESS [10.910s]
[INFO] ------------------------------------------------------------------------
[INFO] BUILD SUCCESS
[INFO] ------------------------------------------------------------------------
[INFO] Total time: 4:48.168s
[INFO] Finished at: Sat Feb 16 04:53:47 UTC 2013
[INFO] Final Memory: 34M/135M
[INFO] ------------------------------------------------------------------------
[JENKINS] Archiving disabled
[JENKINS] Archiving disabled
[JENKINS] Archiving disabled
[JENKINS] Archiving disabled
[JENKINS] Archiving disabled
[JENKINS] Archiving disabled
[JENKINS] Archiving disabled
[JENKINS] Archiving disabled
[JENKINS] Archiving disabled
[JENKINS] Archiving disabled
[JENKINS] Archiving disabled
[JENKINS] Archiving disabled
[JENKINS] Archiving disabled
[JENKINS] Archiving disabled
[JENKINS] Archiving disabled
[JENKINS] Archiving disabled
[JENKINS] Archiving disabled
[JENKINS] Archiving disabled
[JENKINS] Archiving disabled
[JENKINS] Archiving disabled
[JENKINS] Archiving disabled
[JENKINS] Archiving disabled
[JENKINS] Archiving disabled
[JENKINS] Archiving disabled
[JENKINS] Archiving disabled
[JENKINS] Archiving disabled
[JENKINS] Archiving disabled
[JENKINS] Archiving disabled
[JENKINS] Archiving disabled
[JENKINS] Archiving disabled
[JENKINS] Archiving disabled
[JENKINS] Archiving disabled
[JENKINS] Archiving disabled
[JENKINS] Archiving disabled
[JENKINS] Archiving disabled
[JENKINS] Archiving disabled
[JENKINS] Archiving disabled
[JENKINS] Archiving disabled
[JENKINS] Archiving disabled
[JENKINS] Archiving disabled
[JENKINS] Archiving disabled
[JENKINS] Archiving disabled
[JENKINS] Archiving disabled
[JENKINS] Archiving disabled
[JENKINS] Archiving disabled
[JENKINS] Archiving disabled
[JENKINS] Archiving disabled
[JENKINS] Archiving disabled
[JENKINS] Archiving disabled
[JENKINS] Archiving disabled
[JENKINS] Archiving disabled
[JENKINS] Archiving disabled
[JENKINS] Archiving disabled
[JENKINS] Archiving disabled
[JENKINS] Archiving disabled
[JENKINS] Archiving disabled
[JENKINS] Archiving disabled
[JENKINS] Archiving disabled
[JENKINS] Archiving disabled
[JENKINS] Archiving disabled
Waiting for Jenkins to finish collecting data
channel stopped
[cloudstack-apidocs-master] $ /bin/bash -xe /tmp/hudson1085625498225516114.sh
+ mvn -P developer -pl :cloud-apidoc
[INFO] Scanning for projects...
[ERROR] The build could not read 4 projects -> [Help 1]
[ERROR]   
[ERROR]   The project org.apache.cloudstack:cloud-apidoc:4.1.0-SNAPSHOT (<https://builds.apache.org/job/cloudstack-apidocs-master/ws/tools/apidoc/pom.xml)>
has 1 error
[ERROR]     Non-resolvable parent POM: Could not find artifact org.apache.cloudstack:cloudstack:pom:4.1.0-SNAPSHOT
and 'parent.relativePath' points at wrong local POM @ line 17, column 13 -> [Help 2]
[ERROR]   
[ERROR]   The project org.apache.cloudstack:cloud-cli:4.1.0-SNAPSHOT (<https://builds.apache.org/job/cloudstack-apidocs-master/ws/tools/cli/pom.xml)>
has 1 error
[ERROR]     Non-resolvable parent POM: Could not find artifact org.apache.cloudstack:cloudstack:pom:4.1.0-SNAPSHOT
and 'parent.relativePath' points at wrong local POM @ line 25, column 11 -> [Help 2]
[ERROR]   
[ERROR]   The project org.apache.cloudstack:cloud-devcloud:4.1.0-SNAPSHOT (<https://builds.apache.org/job/cloudstack-apidocs-master/ws/tools/devcloud/pom.xml)>
has 1 error
[ERROR]     Non-resolvable parent POM: Could not find artifact org.apache.cloudstack:cloudstack:pom:4.1.0-SNAPSHOT
and 'parent.relativePath' points at wrong local POM @ line 17, column 11 -> [Help 2]
[ERROR]   
[ERROR]   The project org.apache.cloudstack:cloud-devcloud-kvm:4.1.0-SNAPSHOT (<https://builds.apache.org/job/cloudstack-apidocs-master/ws/tools/devcloud-kvm/pom.xml)>
has 1 error
[ERROR]     Non-resolvable parent POM: Could not find artifact org.apache.cloudstack:cloudstack:pom:4.1.0-SNAPSHOT
and 'parent.relativePath' points at wrong local POM @ line 17, column 11 -> [Help 2]
[ERROR] 
[ERROR] To see the full stack trace of the errors, re-run Maven with the -e switch.
[ERROR] Re-run Maven using the -X switch to enable full debug logging.
[ERROR] 
[ERROR] For more information about the errors and possible solutions, please read the following
articles:
[ERROR] [Help 1] http://cwiki.apache.org/confluence/display/MAVEN/ProjectBuildingException
[ERROR] [Help 2] http://cwiki.apache.org/confluence/display/MAVEN/UnresolvableModelException
Build step 'Execute shell' marked build as failure
Archiving artifacts

Mime
View raw message