incubator-clerezza-dev mailing list archives

Site index · List index
Message view « Date » · « Thread »
Top « Date » · « Thread »
From Tsuyoshi Ito <tsuy....@trialox.org>
Subject Build failure in Source Bundle Service
Date Thu, 27 Jan 2011 12:39:32 GMT
Hi reto

I tried to build clerezza on my computer (mac) the following error occured:

ERROR] Failed to execute goal
org.scala-tools:maven-scala-plugin:2.9.1:compile (default) on project
org.apache.clerezza.sourcebundle: command line returned non-zero
value:1 -> [Help 1]
org.apache.maven.lifecycle.LifecycleExecutionException: Failed to
execute goal org.scala-tools:maven-scala-plugin:2.9.1:compile
(default) on project org.apache.clerezza.sourcebundle: command line
returned non-zero value:1
	at org.apache.maven.lifecycle.internal.MojoExecutor.execute(MojoExecutor.java:213)
	at org.apache.maven.lifecycle.internal.MojoExecutor.execute(MojoExecutor.java:153)
	at org.apache.maven.lifecycle.internal.MojoExecutor.execute(MojoExecutor.java:145)
	at org.apache.maven.lifecycle.internal.LifecycleModuleBuilder.buildProject(LifecycleModuleBuilder.java:84)
	at org.apache.maven.lifecycle.internal.LifecycleModuleBuilder.buildProject(LifecycleModuleBuilder.java:59)
	at org.apache.maven.lifecycle.internal.LifecycleStarter.singleThreadedBuild(LifecycleStarter.java:183)
	at org.apache.maven.lifecycle.internal.LifecycleStarter.execute(LifecycleStarter.java:161)
	at org.apache.maven.DefaultMaven.doExecute(DefaultMaven.java:319)
	at org.apache.maven.DefaultMaven.execute(DefaultMaven.java:156)
	at org.apache.maven.cli.MavenCli.execute(MavenCli.java:534)
	at org.apache.maven.cli.MavenCli.doMain(MavenCli.java:196)
	at org.apache.maven.cli.MavenCli.main(MavenCli.java:141)
	at sun.reflect.NativeMethodAccessorImpl.invoke0(Native Method)
	at sun.reflect.NativeMethodAccessorImpl.invoke(NativeMethodAccessorImpl.java:39)
	at sun.reflect.DelegatingMethodAccessorImpl.invoke(DelegatingMethodAccessorImpl.java:25)
	at java.lang.reflect.Method.invoke(Method.java:597)
	at org.codehaus.plexus.classworlds.launcher.Launcher.launchEnhanced(Launcher.java:290)
	at org.codehaus.plexus.classworlds.launcher.Launcher.launch(Launcher.java:230)
	at org.codehaus.plexus.classworlds.launcher.Launcher.mainWithExitCode(Launcher.java:409)
	at org.codehaus.plexus.classworlds.launcher.Launcher.main(Launcher.java:352)
Caused by: org.apache.maven.plugin.MojoFailureException: command line
returned non-zero value:1
	at org.scala_tools.maven.JavaCommand.run(JavaCommand.java:196)
	at org.scala_tools.maven.ScalaCompilerSupport.compile(ScalaCompilerSupport.java:125)
	at org.scala_tools.maven.ScalaCompilerSupport.doExecute(ScalaCompilerSupport.java:54)
	at org.scala_tools.maven.ScalaMojoSupport.execute(ScalaMojoSupport.java:208)
	at org.scala_tools.maven.ScalaCompilerSupport.execute(ScalaCompilerSupport.java:29)
	at org.apache.maven.plugin.DefaultBuildPluginManager.executeMojo(DefaultBuildPluginManager.java:107)
	at org.apache.maven.lifecycle.internal.MojoExecutor.execute(MojoExecutor.java:209)
	... 19 more
[ERROR]
[ERROR]
[ERROR] For more information about the errors and possible solutions,
please read the following articles:
[ERROR] [Help 1]
http://cwiki.apache.org/confluence/display/MAVEN/MojoFailureException


Any ideas why I can't build clerezza on my mac.

Cheers
Tsuy

-- 
--trialox ag--------------------------------------

Tsuyoshi Ito
Binzmuehlestrasse 14
CH-8050 Z├╝rich
Tel. +41 44 635 75 77
URL: http://trialox.org

Mime
View raw message