incubator-clerezza-dev mailing list archives

Site index · List index
Message view « Date » · « Thread »
Top « Date » · « Thread »
From Reto Bachmann-Gmür (JIRA) <j...@apache.org>
Subject [jira] Closed: (CLEREZZA-298) test failure in org.apache.clerezza.utils.imageprocessing
Date Tue, 07 Sep 2010 12:42:32 GMT

     [ https://issues.apache.org/jira/browse/CLEREZZA-298?page=com.atlassian.jira.plugin.system.issuetabpanels:all-tabpanel
]

Reto Bachmann-Gmür closed CLEREZZA-298.
---------------------------------------

    Resolution: Fixed

removed assumption on parser behaviour in test

> test failure in org.apache.clerezza.utils.imageprocessing
> ---------------------------------------------------------
>
>                 Key: CLEREZZA-298
>                 URL: https://issues.apache.org/jira/browse/CLEREZZA-298
>             Project: Clerezza
>          Issue Type: Bug
>            Reporter: Reto Bachmann-Gmür
>            Assignee: Reto Bachmann-Gmür
>
> $ cat target/surefire-reports/org.apache.clerezza.utils.imageprocessing.metadataprocessing.MetaDataConversionTest.txt

> -------------------------------------------------------------------------------
> Test set: org.apache.clerezza.utils.imageprocessing.metadataprocessing.MetaDataConversionTest
> -------------------------------------------------------------------------------
> Tests run: 2, Failures: 2, Errors: 0, Skipped: 0, Time elapsed: 0.893 sec <<<
FAILURE!
> testIptcToXmp(org.apache.clerezza.utils.imageprocessing.metadataprocessing.MetaDataConversionTest)
 Time elapsed: 0.844 sec  <<< FAILURE!
> junit.framework.AssertionFailedError: null
> 	at junit.framework.Assert.fail(Assert.java:47)
> 	at junit.framework.Assert.assertTrue(Assert.java:20)
> 	at junit.framework.Assert.assertTrue(Assert.java:27)
> 	at org.apache.clerezza.utils.imageprocessing.metadataprocessing.MetaDataConversionTest.testIptcToXmp(MetaDataConversionTest.java:65)
> 	at sun.reflect.NativeMethodAccessorImpl.invoke0(Native Method)
> 	at sun.reflect.NativeMethodAccessorImpl.invoke(NativeMethodAccessorImpl.java:39)
> 	at sun.reflect.DelegatingMethodAccessorImpl.invoke(DelegatingMethodAccessorImpl.java:25)
> 	at java.lang.reflect.Method.invoke(Method.java:597)
> 	at org.junit.internal.runners.TestMethod.invoke(TestMethod.java:59)
> 	at org.junit.internal.runners.MethodRoadie.runTestMethod(MethodRoadie.java:98)
> 	at org.junit.internal.runners.MethodRoadie$2.run(MethodRoadie.java:79)
> 	at org.junit.internal.runners.MethodRoadie.runBeforesThenTestThenAfters(MethodRoadie.java:87)
> 	at org.junit.internal.runners.MethodRoadie.runTest(MethodRoadie.java:77)
> 	at org.junit.internal.runners.MethodRoadie.run(MethodRoadie.java:42)
> 	at org.junit.internal.runners.JUnit4ClassRunner.invokeTestMethod(JUnit4ClassRunner.java:88)
> 	at org.junit.internal.runners.JUnit4ClassRunner.runMethods(JUnit4ClassRunner.java:51)
> 	at org.junit.internal.runners.JUnit4ClassRunner$1.run(JUnit4ClassRunner.java:44)
> 	at org.junit.internal.runners.ClassRoadie.runUnprotected(ClassRoadie.java:27)
> 	at org.junit.internal.runners.ClassRoadie.runProtected(ClassRoadie.java:37)
> 	at org.junit.internal.runners.JUnit4ClassRunner.run(JUnit4ClassRunner.java:42)
> 	at org.apache.maven.surefire.junit4.JUnit4TestSet.execute(JUnit4TestSet.java:62)
> 	at org.apache.maven.surefire.suite.AbstractDirectoryTestSuite.executeTestSet(AbstractDirectoryTestSuite.java:140)
> 	at org.apache.maven.surefire.suite.AbstractDirectoryTestSuite.execute(AbstractDirectoryTestSuite.java:127)
> 	at org.apache.maven.surefire.Surefire.run(Surefire.java:177)
> 	at sun.reflect.NativeMethodAccessorImpl.invoke0(Native Method)
> 	at sun.reflect.NativeMethodAccessorImpl.invoke(NativeMethodAccessorImpl.java:39)
> 	at sun.reflect.DelegatingMethodAccessorImpl.invoke(DelegatingMethodAccessorImpl.java:25)
> 	at java.lang.reflect.Method.invoke(Method.java:597)
> 	at org.apache.maven.surefire.booter.SurefireBooter.runSuitesInProcess(SurefireBooter.java:345)
> 	at org.apache.maven.surefire.booter.SurefireBooter.main(SurefireBooter.java:1009)
> testExifToXmp(org.apache.clerezza.utils.imageprocessing.metadataprocessing.MetaDataConversionTest)
 Time elapsed: 0.019 sec  <<< FAILURE!
> junit.framework.AssertionFailedError: null
> 	at junit.framework.Assert.fail(Assert.java:47)
> 	at junit.framework.Assert.assertTrue(Assert.java:20)
> 	at junit.framework.Assert.assertTrue(Assert.java:27)
> 	at org.apache.clerezza.utils.imageprocessing.metadataprocessing.MetaDataConversionTest.testExifToXmp(MetaDataConversionTest.java:89)
> 	at sun.reflect.NativeMethodAccessorImpl.invoke0(Native Method)
> 	at sun.reflect.NativeMethodAccessorImpl.invoke(NativeMethodAccessorImpl.java:39)
> 	at sun.reflect.DelegatingMethodAccessorImpl.invoke(DelegatingMethodAccessorImpl.java:25)
> 	at java.lang.reflect.Method.invoke(Method.java:597)
> 	at org.junit.internal.runners.TestMethod.invoke(TestMethod.java:59)
> 	at org.junit.internal.runners.MethodRoadie.runTestMethod(MethodRoadie.java:98)
> 	at org.junit.internal.runners.MethodRoadie$2.run(MethodRoadie.java:79)
> 	at org.junit.internal.runners.MethodRoadie.runBeforesThenTestThenAfters(MethodRoadie.java:87)
> 	at org.junit.internal.runners.MethodRoadie.runTest(MethodRoadie.java:77)
> 	at org.junit.internal.runners.MethodRoadie.run(MethodRoadie.java:42)
> 	at org.junit.internal.runners.JUnit4ClassRunner.invokeTestMethod(JUnit4ClassRunner.java:88)
> 	at org.junit.internal.runners.JUnit4ClassRunner.runMethods(JUnit4ClassRunner.java:51)
> 	at org.junit.internal.runners.JUnit4ClassRunner$1.run(JUnit4ClassRunner.java:44)
> 	at org.junit.internal.runners.ClassRoadie.runUnprotected(ClassRoadie.java:27)
> 	at org.junit.internal.runners.ClassRoadie.runProtected(ClassRoadie.java:37)
> 	at org.junit.internal.runners.JUnit4ClassRunner.run(JUnit4ClassRunner.java:42)
> 	at org.apache.maven.surefire.junit4.JUnit4TestSet.execute(JUnit4TestSet.java:62)
> 	at org.apache.maven.surefire.suite.AbstractDirectoryTestSuite.executeTestSet(AbstractDirectoryTestSuite.java:140)
> 	at org.apache.maven.surefire.suite.AbstractDirectoryTestSuite.execute(AbstractDirectoryTestSuite.java:127)
> 	at org.apache.maven.surefire.Surefire.run(Surefire.java:177)
> 	at sun.reflect.NativeMethodAccessorImpl.invoke0(Native Method)
> 	at sun.reflect.NativeMethodAccessorImpl.invoke(NativeMethodAccessorImpl.java:39)
> 	at sun.reflect.DelegatingMethodAccessorImpl.invoke(DelegatingMethodAccessorImpl.java:25)
> 	at java.lang.reflect.Method.invoke(Method.java:597)
> 	at org.apache.maven.surefire.booter.SurefireBooter.runSuitesInProcess(SurefireBooter.java:345)
> 	at org.apache.maven.surefire.booter.SurefireBooter.main(SurefireBooter.java:1009)

-- 
This message is automatically generated by JIRA.
-
You can reply to this email to add a comment to the issue online.


Mime
View raw message