incubator-clerezza-dev mailing list archives

Site index · List index
Message view « Date » · « Thread »
Top « Date » · « Thread »
From Apache Hudson Server <hud...@hudson.zones.apache.org>
Subject Build failed in Hudson: clerezza-site #107
Date Mon, 05 Jul 2010 15:16:35 GMT
See <http://hudson.zones.apache.org/hudson/job/clerezza-site/107/changes>

Changes:

[ito] manually added permissions are displayed and BasePermissionRole is editable

------------------------------------------
Started by an SCM change
Building remotely on minerva.apache.org (Ubuntu)
Updating http://svn.apache.org/repos/asf/incubator/clerezza/trunk/org.apache.clerezza.parent
U         org.apache.clerezza.platform.usermanager.webinterface/src/main/resources/org/apache/clerezza/platform/usermanager/webinterface/staticweb/js/usermanager-role-overview.js
U         org.apache.clerezza.platform.usermanager.webinterface/src/main/resources/org/apache/clerezza/platform/usermanager/webinterface/role-permission-template.xhtml
U         org.apache.clerezza.platform.usermanager.webinterface/src/main/resources/org/apache/clerezza/platform/usermanager/webinterface/user-permission-template.xhtml
U         org.apache.clerezza.platform.usermanager.webinterface/src/main/resources/org/apache/clerezza/platform/usermanager/webinterface/role-overview-template.xhtml
At revision 960619
[locks-and-latches] Checking to see if we really have the locks
[locks-and-latches] Have all the locks, build can start
Parsing POMs
[trunk-1.6] $ /home/hudson/tools/java/latest1.6/bin/java -cp /home/hudson/hudson-slave/maven-agent.jar:/home/hudson/tools/maven/apache-maven-2.2.1/boot/classworlds-1.1.jar
hudson.maven.agent.Main /home/hudson/tools/maven/apache-maven-2.2.1 /home/hudson/hudson-slave/slave.jar
/home/hudson/hudson-slave/maven-interceptor.jar 42519 /home/hudson/hudson-slave/maven2.1-interceptor.jar
<channel started===[HUDSON REMOTING CAPACITY]===
>   Executing Maven:  -B -f <http://hudson.zones.apache.org/hudson/job/clerezza-site/ws/trunk-1.6/pom.xml>
-amd -pl org.apache.clerezza:org.apache.clerezza.platform.security.foafssl.core,org.apache.clerezza:org.apache.clerezza.platform.testing,org.apache.clerezza:org.apache.clerezza.platform.usermanager.webinterface,org.apache.clerezza:org.apache.clerezza.platform.users,org.apache.clerezza:org.apache.clerezza.platform.users.core,org.apache.clerezza:org.apache.clerezza.rdf.scala.utils,org.apache.clerezza.uima:org.apache.clerezza.uima.ontologies
clean site
[INFO] Scanning for projects...
[INFO] Reactor build order: 
[INFO]   Clerezza - SCB Scala Utilities
[INFO]   Clerezza - Platform Users
[INFO]   Clerezza - Platform Users Core
[INFO]   Clerezza - Platform Account Control Panel Core
[INFO]   Clerezza - Platform Usermanager Webinterface
[INFO]   Clerezza - Platform Security foaf+ssl Core
[INFO]   Clerezza - Platform Launcher Storageless Parent POM
[INFO]   Clerezza - Platform Launcher Storageless
[INFO]   Clerezza - Platform Launcher with Sesame Storage
[INFO]   Clerezza - Platform Launcher with Jena TDB
[INFO]   Clerezza - Platform Tests
[INFO]   Clerezza - Apache UIMA related ontologies
[INFO]   Clerezza - Apache UIMA extension utils
[INFO]   Clerezza - Apache Clerezza UIMA extension for metadata generation
[INFO] ------------------------------------------------------------------------
[INFO] Building Clerezza - SCB Scala Utilities
[INFO]    task-segment: [clean, site]
[INFO] ------------------------------------------------------------------------
[INFO] [clean:clean {execution: default-clean}]
[INFO] Deleting file set: <http://hudson.zones.apache.org/hudson/job/clerezza-site/ws/trunk-1.6/org.apache.clerezza.rdf.scala.utils/target>
(included: [**], excluded: [])
[INFO] Setting property: classpath.resource.loader.class => 'org.codehaus.plexus.velocity.ContextClassLoaderResourceLoader'.
[INFO] Setting property: velocimacro.messages.on => 'false'.
[INFO] Setting property: resource.loader => 'classpath'.
[INFO] Setting property: resource.manager.logwhenfound => 'false'.
[INFO] ************************************************************** 
[INFO] Starting Jakarta Velocity v1.4
[INFO] RuntimeInstance initializing.
[INFO] Default Properties File: org/apache/velocity/runtime/defaults/velocity.properties
[INFO] Default ResourceManager initializing. (class org.apache.velocity.runtime.resource.ResourceManagerImpl)
[INFO] Resource Loader Instantiated: org.codehaus.plexus.velocity.ContextClassLoaderResourceLoader
[INFO] ClasspathResourceLoader : initialization starting.
[INFO] ClasspathResourceLoader : initialization complete.
[INFO] ResourceCache : initialized. (class org.apache.velocity.runtime.resource.ResourceCacheImpl)
[INFO] Default ResourceManager initialization complete.
[INFO] Loaded System Directive: org.apache.velocity.runtime.directive.Literal
[INFO] Loaded System Directive: org.apache.velocity.runtime.directive.Macro
[INFO] Loaded System Directive: org.apache.velocity.runtime.directive.Parse
[INFO] Loaded System Directive: org.apache.velocity.runtime.directive.Include
[INFO] Loaded System Directive: org.apache.velocity.runtime.directive.Foreach
[INFO] Created: 20 parsers.
[INFO] Velocimacro : initialization starting.
[INFO] Velocimacro : adding VMs from VM library template : VM_global_library.vm
[ERROR] ResourceManager : unable to find resource 'VM_global_library.vm' in any resource loader.
[INFO] Velocimacro : error using  VM library template VM_global_library.vm : org.apache.velocity.exception.ResourceNotFoundException:
Unable to find resource 'VM_global_library.vm'
[INFO] Velocimacro :  VM library template macro registration complete.
[INFO] Velocimacro : allowInline = true : VMs can be defined inline in templates
[INFO] Velocimacro : allowInlineToOverride = false : VMs defined inline may NOT replace previous
VM definitions
[INFO] Velocimacro : allowInlineLocal = false : VMs defined inline will be  global in scope
if allowed.
[INFO] Velocimacro : initialization complete.
[INFO] Velocity successfully started.
[INFO] Preparing surefire-report:report
[INFO] snapshot org.apache.clerezza:org.apache.clerezza.rdf.core:0.12-incubating-SNAPSHOT:
checking for updates from ops4j
[INFO] snapshot org.apache.clerezza:org.apache.clerezza.rdf.core:0.12-incubating-SNAPSHOT:
checking for updates from apache
[INFO] snapshot org.apache.clerezza:org.apache.clerezza.rdf.utils:0.13-incubating-SNAPSHOT:
checking for updates from ops4j
[INFO] snapshot org.apache.clerezza:org.apache.clerezza.rdf.utils:0.13-incubating-SNAPSHOT:
checking for updates from apache
[INFO] snapshot org.apache.clerezza:org.apache.clerezza.rdf.ontologies:0.11-incubating-SNAPSHOT:
checking for updates from ops4j
[INFO] snapshot org.apache.clerezza:org.apache.clerezza.rdf.ontologies:0.11-incubating-SNAPSHOT:
checking for updates from apache
[INFO] snapshot org.apache.clerezza:org.apache.clerezza.utils:0.1-incubating-SNAPSHOT: checking
for updates from ops4j
[INFO] snapshot org.apache.clerezza:org.apache.clerezza.utils:0.1-incubating-SNAPSHOT: checking
for updates from apache
[INFO] snapshot org.apache.clerezza:org.apache.clerezza.rdf.core.test:0.13-incubating-SNAPSHOT:
checking for updates from ops4j
[INFO] snapshot org.apache.clerezza:org.apache.clerezza.rdf.core.test:0.13-incubating-SNAPSHOT:
checking for updates from apache
[HUDSON] Archiving <http://hudson.zones.apache.org/hudson/job/clerezza-site/ws/trunk-1.6/org.apache.clerezza.rdf.scala.utils/pom.xml>
to /export/home/hudson/hudson/jobs/clerezza-site/modules/org.apache.clerezza$org.apache.clerezza.rdf.scala.utils/builds/2010-07-05_15-15-06/archive/org.apache.clerezza/org.apache.clerezza.rdf.scala.utils/0.3-incubating-SNAPSHOT/pom.xml
[INFO] [scala:compile {execution: default}]
[INFO] suggestion: remove the scalaVersion from pom.xml
[ERROR] <http://hudson.zones.apache.org/hudson/job/clerezza-site/ws/trunk-1.6/org.apache.clerezza.rdf.scala.utils/src/main/java>
[ERROR] <http://hudson.zones.apache.org/hudson/job/clerezza-site/ws/trunk-1.6/org.apache.clerezza.rdf.scala.utils/src/main/scala>
[INFO] Compiling 3 source files to <http://hudson.zones.apache.org/hudson/job/clerezza-site/ws/trunk-1.6/org.apache.clerezza.rdf.scala.utils/target/classes>
[INFO] [scala:testCompile {execution: default}]
[INFO] suggestion: remove the scalaVersion from pom.xml
[ERROR] <http://hudson.zones.apache.org/hudson/job/clerezza-site/ws/trunk-1.6/org.apache.clerezza.rdf.scala.utils/src/test/java>
[ERROR] <http://hudson.zones.apache.org/hudson/job/clerezza-site/ws/trunk-1.6/org.apache.clerezza.rdf.scala.utils/src/test/java/../scala>
[INFO] Compiling 1 source files to <http://hudson.zones.apache.org/hudson/job/clerezza-site/ws/trunk-1.6/org.apache.clerezza.rdf.scala.utils/target/test-classes>
[WARNING] <http://hudson.zones.apache.org/hudson/job/clerezza-site/ws/trunk-1.6/org.apache.clerezza.rdf.scala.utils/src/test/scala/org/apache/clerezza/rdf/scala/utils/RichGraphNodeTest.scala>:61:
warning: method elements in trait IterableLike is deprecated: use `iterator' instead
[WARNING] 		val stringNames = (for(name <- (rNode/FOAF.name).elements) yield {
[WARNING]                                                                  ^
[WARNING] <http://hudson.zones.apache.org/hudson/job/clerezza-site/ws/trunk-1.6/org.apache.clerezza.rdf.scala.utils/src/test/scala/org/apache/clerezza/rdf/scala/utils/RichGraphNodeTest.scala>:111:
warning: method sort in class List is deprecated: use `sortWith' instead
[WARNING] 		Assert.assertEquals(new PlainLiteralImpl("bar"), (node/SKOS.related%0!!).sort((a,b)
=> ((a*) < (b*)))(0)!)
[WARNING]                                                                                
         ^
[WARNING] <http://hudson.zones.apache.org/hudson/job/clerezza-site/ws/trunk-1.6/org.apache.clerezza.rdf.scala.utils/src/test/scala/org/apache/clerezza/rdf/scala/utils/RichGraphNodeTest.scala>:112:
warning: method sort in class List is deprecated: use `sortWith' instead
[WARNING] 		Assert.assertEquals(johnUri, (node/SKOS.related%0!!).sort((a,b) => ((a*) >
(b*)))(0)!)
[WARNING]                                                                      ^
[WARNING] three warnings found
[INFO] [resources:resources {execution: default-resources}]
[INFO] Using 'utf-8' encoding to copy filtered resources.
[INFO] Copying 0 resource to META-INF
[INFO] skip non existing resourceDirectory <http://hudson.zones.apache.org/hudson/job/clerezza-site/ws/trunk-1.6/org.apache.clerezza.rdf.scala.utils/src/main/resources>
[INFO] [compiler:compile {execution: default-compile}]
[INFO] Nothing to compile - all classes are up to date
[INFO] [scr:scr {execution: generate-scr-scrdescriptor}]
[INFO] [resources:testResources {execution: default-testResources}]
[INFO] Using 'utf-8' encoding to copy filtered resources.
[INFO] skip non existing resourceDirectory <http://hudson.zones.apache.org/hudson/job/clerezza-site/ws/trunk-1.6/org.apache.clerezza.rdf.scala.utils/src/test/resources>
[INFO] [compiler:testCompile {execution: default-testCompile}]
[INFO] No sources to compile
[INFO] [surefire:test {execution: default-test}]
[INFO] Surefire report directory: <http://hudson.zones.apache.org/hudson/job/clerezza-site/ws/trunk-1.6/org.apache.clerezza.rdf.scala.utils/target/surefire-reports>

-------------------------------------------------------
 T E S T S
-------------------------------------------------------
Running org.apache.clerezza.rdf.scala.utils.RichGraphNodeTest
Tests run: 8, Failures: 0, Errors: 0, Skipped: 0, Time elapsed: 0.288 sec

Results :

Tests run: 8, Failures: 0, Errors: 0, Skipped: 0

[HUDSON] Recording test results
[INFO] Preparing surefire-report:report-only
[INFO] No goals needed for project - skipping
[INFO] Preparing plugin:report
[INFO] [scala:compile {execution: default}]
[INFO] suggestion: remove the scalaVersion from pom.xml
[ERROR] <http://hudson.zones.apache.org/hudson/job/clerezza-site/ws/trunk-1.6/org.apache.clerezza.rdf.scala.utils/src/main/java>
[ERROR] <http://hudson.zones.apache.org/hudson/job/clerezza-site/ws/trunk-1.6/org.apache.clerezza.rdf.scala.utils/src/main/scala>
[INFO] Nothing to compile - all classes are up to date
[INFO] [scala:testCompile {execution: default}]
[INFO] suggestion: remove the scalaVersion from pom.xml
[ERROR] <http://hudson.zones.apache.org/hudson/job/clerezza-site/ws/trunk-1.6/org.apache.clerezza.rdf.scala.utils/src/test/java>
[ERROR] <http://hudson.zones.apache.org/hudson/job/clerezza-site/ws/trunk-1.6/org.apache.clerezza.rdf.scala.utils/src/test/java/../scala>
[INFO] Nothing to compile - all classes are up to date
[INFO] [resources:resources {execution: default-resources}]
[INFO] Using 'utf-8' encoding to copy filtered resources.
[INFO] Copying 0 resource to META-INF
[INFO] skip non existing resourceDirectory <http://hudson.zones.apache.org/hudson/job/clerezza-site/ws/trunk-1.6/org.apache.clerezza.rdf.scala.utils/src/main/resources>
[INFO] [compiler:compile {execution: default-compile}]
[INFO] Nothing to compile - all classes are up to date
[INFO] [site:site {execution: default-site}]
[INFO] Skipped "Maven Surefire Report" report, file "surefire-report.html" already exists
for the English version.
[INFO] Generating "Issue Tracking" report.
[INFO] Generating "Project Team" report.
[INFO] Generating "Maven Surefire Report" report.
[WARNING] Unable to locate Test Source XRef to link to - DISABLED
[INFO] Generating "Dependency Management" report.
[INFO] snapshot org.apache.clerezza:org.apache.clerezza.platform.pagemanager:0.3-incubating-SNAPSHOT:
checking for updates from ops4j
[INFO] snapshot org.apache.clerezza:org.apache.clerezza.platform.pagemanager:0.3-incubating-SNAPSHOT:
checking for updates from apache
Downloading: http://repo1.maven.org/maven2//org/apache/clerezza/org.apache.clerezza.platform.pagemanager/0.3-incubating-SNAPSHOT/org.apache.clerezza.platform.pagemanager-0.3-incubating-SNAPSHOT.pom
[INFO] Unable to find resource 'org.apache.clerezza:org.apache.clerezza.platform.pagemanager:pom:0.3-incubating-SNAPSHOT'
in repository ops4j (http://repo1.maven.org/maven2/)
Downloading: http://repository.apache.org/content/groups/snapshots-group/org/apache/clerezza/org.apache.clerezza.platform.pagemanager/0.3-incubating-SNAPSHOT/org.apache.clerezza.platform.pagemanager-0.3-incubating-SNAPSHOT.pom
[INFO] Unable to find resource 'org.apache.clerezza:org.apache.clerezza.platform.pagemanager:pom:0.3-incubating-SNAPSHOT'
in repository apache (http://repository.apache.org/content/groups/snapshots-group)
[INFO] snapshot org.apache.clerezza:org.apache.clerezza.web.resources.extjs:0.4-incubating-SNAPSHOT:
checking for updates from ops4j
[INFO] snapshot org.apache.clerezza:org.apache.clerezza.web.resources.extjs:0.4-incubating-SNAPSHOT:
checking for updates from apache
Downloading: http://repo1.maven.org/maven2//org/apache/clerezza/org.apache.clerezza.web.resources.extjs/0.4-incubating-SNAPSHOT/org.apache.clerezza.web.resources.extjs-0.4-incubating-SNAPSHOT.pom
[INFO] Unable to find resource 'org.apache.clerezza:org.apache.clerezza.web.resources.extjs:pom:0.4-incubating-SNAPSHOT'
in repository ops4j (http://repo1.maven.org/maven2/)
Downloading: http://repository.apache.org/content/groups/snapshots-group/org/apache/clerezza/org.apache.clerezza.web.resources.extjs/0.4-incubating-SNAPSHOT/org.apache.clerezza.web.resources.extjs-0.4-incubating-SNAPSHOT.pom
[INFO] Unable to find resource 'org.apache.clerezza:org.apache.clerezza.web.resources.extjs:pom:0.4-incubating-SNAPSHOT'
in repository apache (http://repository.apache.org/content/groups/snapshots-group)
[INFO] snapshot org.apache.clerezza.scala:scala-compiler-osgi:0.1-incubating-SNAPSHOT: checking
for updates from ops4j
[INFO] snapshot org.apache.clerezza.scala:scala-compiler-osgi:0.1-incubating-SNAPSHOT: checking
for updates from apache
[INFO] snapshot org.apache.clerezza.scala:scala:0.1-incubating-SNAPSHOT: checking for updates
from ops4j
[INFO] snapshot org.apache.clerezza.scala:scala:0.1-incubating-SNAPSHOT: checking for updates
from apache
[INFO] snapshot org.apache.clerezza.scala:scala-library-osgi:0.1-incubating-SNAPSHOT: checking
for updates from ops4j
[INFO] snapshot org.apache.clerezza.scala:scala-library-osgi:0.1-incubating-SNAPSHOT: checking
for updates from apache
[INFO] snapshot org.apache.clerezza.scala:script-engine:0.1-incubating-SNAPSHOT: checking
for updates from ops4j
[INFO] snapshot org.apache.clerezza.scala:script-engine:0.1-incubating-SNAPSHOT: checking
for updates from apache
[INFO] Generating "Dependencies" report.
Downloading: http://repo1.maven.org/maven2//org/apache/clerezza/org.apache.clerezza.rdf.core.test/0.13-incubating-SNAPSHOT/org.apache.clerezza.rdf.core.test-0.13-incubating-SNAPSHOT.jar
[INFO] Unable to find resource 'org.apache.clerezza:org.apache.clerezza.rdf.core.test:jar:0.13-incubating-SNAPSHOT'
in repository ops4j-plugin-snapshot (http://repo1.maven.org/maven2/)
Downloading: http://repository.apache.org/content/groups/snapshots-group/org/apache/clerezza/org.apache.clerezza.rdf.core.test/0.13-incubating-SNAPSHOT/org.apache.clerezza.rdf.core.test-0.13-incubating-SNAPSHOT.jar
[INFO] Unable to find resource 'org.apache.clerezza:org.apache.clerezza.rdf.core.test:jar:0.13-incubating-SNAPSHOT'
in repository apache-plugin-snapshot (http://repository.apache.org/content/groups/snapshots-group)
Downloading: http://repo1.maven.org/maven2//org/apache/clerezza/org.apache.clerezza.rdf.core.test/0.13-incubating-SNAPSHOT/org.apache.clerezza.rdf.core.test-0.13-incubating-SNAPSHOT.jar
[INFO] Unable to find resource 'org.apache.clerezza:org.apache.clerezza.rdf.core.test:jar:0.13-incubating-SNAPSHOT'
in repository ops4j (http://repo1.maven.org/maven2/)
Downloading: http://repository.apache.org/content/groups/snapshots-group/org/apache/clerezza/org.apache.clerezza.rdf.core.test/0.13-incubating-SNAPSHOT/org.apache.clerezza.rdf.core.test-0.13-incubating-SNAPSHOT.jar
[INFO] Unable to find resource 'org.apache.clerezza:org.apache.clerezza.rdf.core.test:jar:0.13-incubating-SNAPSHOT'
in repository apache (http://repository.apache.org/content/groups/snapshots-group)
Downloading: http://repository.apache.org/content/groups/snapshots-group/org/apache/clerezza/org.apache.clerezza.rdf.ontologies/0.11-incubating-SNAPSHOT/org.apache.clerezza.rdf.ontologies-0.11-incubating-20100705.100301-77.jar
Downloading: http://repository.apache.org/content/groups/snapshots-group/org/apache/clerezza/org.apache.clerezza.utils/0.1-incubating-SNAPSHOT/org.apache.clerezza.utils-0.1-incubating-20100705.100301-61.jar
[INFO] Generating "Project Plugins" report.
[INFO] Generating "PMD Report" report.
[WARNING] Unable to locate Source XRef to link to - DISABLED
[INFO] Generating "Continuous Integration" report.
[INFO] Generating "JaxRs Report" report.
[INFO] Generating "Plugin Management" report.
Downloading: http://repo1.maven.org/maven2//org/apache/clerezza/org.apache.clerezza.maven-pladoc-plugin.core/0.2-incubating-SNAPSHOT/org.apache.clerezza.maven-pladoc-plugin.core-0.2-incubating-SNAPSHOT.pom
[INFO] Unable to find resource 'org.apache.clerezza:org.apache.clerezza.maven-pladoc-plugin.core:pom:0.2-incubating-SNAPSHOT'
in repository ops4j-plugin-snapshot (http://repo1.maven.org/maven2/)
Downloading: http://repository.apache.org/content/groups/snapshots-group/org/apache/clerezza/org.apache.clerezza.maven-pladoc-plugin.core/0.2-incubating-SNAPSHOT/org.apache.clerezza.maven-pladoc-plugin.core-0.2-incubating-SNAPSHOT.pom
[INFO] Unable to find resource 'org.apache.clerezza:org.apache.clerezza.maven-pladoc-plugin.core:pom:0.2-incubating-SNAPSHOT'
in repository apache-plugin-snapshot (http://repository.apache.org/content/groups/snapshots-group)
[INFO] Generating "Mailing Lists" report.
[INFO] Generating "Source Repository" report.
[INFO] Generating "Project Summary" report.
[INFO] Generating "About" report.
[INFO] Generating "ScalaDocs" report.
[WARNING] scalac error: Parameter '-bottom' is not recognised by Scalac.
[WARNING]   scalac -help  gives more information
[WARNING] scalac error: bad option: '-bottom'
[WARNING]   scalac -help  gives more information
[HUDSON] Archiving site from <http://hudson.zones.apache.org/hudson/job/clerezza-site/ws/trunk-1.6/org.apache.clerezza.rdf.scala.utils/target/site>
to /export/home/hudson/hudson/jobs/clerezza-site/site/org.apache.clerezza.rdf.scala.utils
[INFO] ------------------------------------------------------------------------
[ERROR] BUILD ERROR
[INFO] ------------------------------------------------------------------------
[INFO] Error during page generation

Embedded error: Error rendering Maven report: wrap: command line returned non-zero value:1
[INFO] ------------------------------------------------------------------------
[INFO] For more information, run Maven with the -e switch
[INFO] ------------------------------------------------------------------------
[INFO] Total time: 1 minute 14 seconds
[INFO] Finished at: Mon Jul 05 15:16:32 UTC 2010
[INFO] Final Memory: 72M/430M
[INFO] ------------------------------------------------------------------------
Waiting for Hudson to finish collecting data
Sending e-mails to: clerezza-dev@incubator.apache.org
channel stopped
[locks-and-latches] Releasing all the locks
[locks-and-latches] All the locks released


Mime
View raw message