incubator-clerezza-dev mailing list archives

Site index · List index
Message view « Date » · « Thread »
Top « Date » · « Thread »
From Apache Hudson Server <hud...@hudson.zones.apache.org>
Subject Build failed in Hudson: clerezza-site » Clerezza - SCB Scala Utilities #116
Date Tue, 13 Jul 2010 00:54:56 GMT
See <http://hudson.zones.apache.org/hudson/job/clerezza-site/org.apache.clerezza$org.apache.clerezza.rdf.scala.utils/116/>

------------------------------------------
[INFO] ------------------------------------------------------------------------
[INFO] Building Clerezza - SCB Scala Utilities
[INFO]    task-segment: [clean, site]
[INFO] ------------------------------------------------------------------------
[INFO] [clean:clean {execution: default-clean}]
[INFO] Deleting file set: <http://hudson.zones.apache.org/hudson/job/clerezza-site/org.apache.clerezza$org.apache.clerezza.rdf.scala.utils/ws/target>
(included: [**], excluded: [])
[INFO] Preparing surefire-report:report
[HUDSON] Archiving <http://hudson.zones.apache.org/hudson/job/clerezza-site/org.apache.clerezza$org.apache.clerezza.rdf.scala.utils/ws/pom.xml>
to /export/home/hudson/hudson/jobs/clerezza-site/modules/org.apache.clerezza$org.apache.clerezza.rdf.scala.utils/builds/2010-07-13_00-19-46/archive/org.apache.clerezza/org.apache.clerezza.rdf.scala.utils/0.3-incubating-SNAPSHOT/pom.xml
[INFO] [scala:compile {execution: default}]
[INFO] suggestion: remove the scalaVersion from pom.xml
[ERROR] <http://hudson.zones.apache.org/hudson/job/clerezza-site/org.apache.clerezza$org.apache.clerezza.rdf.scala.utils/ws/src/main/java>
[ERROR] <http://hudson.zones.apache.org/hudson/job/clerezza-site/org.apache.clerezza$org.apache.clerezza.rdf.scala.utils/ws/src/main/scala>
[INFO] Compiling 3 source files to <http://hudson.zones.apache.org/hudson/job/clerezza-site/org.apache.clerezza$org.apache.clerezza.rdf.scala.utils/ws/target/classes>
[INFO] [scala:testCompile {execution: default}]
[INFO] suggestion: remove the scalaVersion from pom.xml
[ERROR] <http://hudson.zones.apache.org/hudson/job/clerezza-site/org.apache.clerezza$org.apache.clerezza.rdf.scala.utils/ws/src/test/java>
[ERROR] <http://hudson.zones.apache.org/hudson/job/clerezza-site/org.apache.clerezza$org.apache.clerezza.rdf.scala.utils/ws/src/test/java/../scala>
[INFO] Compiling 1 source files to <http://hudson.zones.apache.org/hudson/job/clerezza-site/org.apache.clerezza$org.apache.clerezza.rdf.scala.utils/ws/target/test-classes>
[WARNING] <http://hudson.zones.apache.org/hudson/job/clerezza-site/org.apache.clerezza$org.apache.clerezza.rdf.scala.utils/ws/src/test/scala/org/apache/clerezza/rdf/scala/utils/RichGraphNodeTest.scala>:68:
warning: method elements in trait IterableLike is deprecated: use `iterator' instead
[WARNING] 		val stringNames = (for(name <- (rNode/FOAF.name).elements) yield {
[WARNING]                                                                  ^
[WARNING] <http://hudson.zones.apache.org/hudson/job/clerezza-site/org.apache.clerezza$org.apache.clerezza.rdf.scala.utils/ws/src/test/scala/org/apache/clerezza/rdf/scala/utils/RichGraphNodeTest.scala>:118:
warning: method sort in class List is deprecated: use `sortWith' instead
[WARNING] 		Assert.assertEquals(new PlainLiteralImpl("bar"), (node/SKOS.related%0!!).sort((a,b)
=> ((a*) < (b*)))(0)!)
[WARNING]                                                                                
         ^
[WARNING] <http://hudson.zones.apache.org/hudson/job/clerezza-site/org.apache.clerezza$org.apache.clerezza.rdf.scala.utils/ws/src/test/scala/org/apache/clerezza/rdf/scala/utils/RichGraphNodeTest.scala>:119:
warning: method sort in class List is deprecated: use `sortWith' instead
[WARNING] 		Assert.assertEquals(johnUri, (node/SKOS.related%0!!).sort((a,b) => ((a*) >
(b*)))(0)!)
[WARNING]                                                                      ^
[WARNING] three warnings found
[INFO] [resources:resources {execution: default-resources}]
[INFO] Using 'utf-8' encoding to copy filtered resources.
[INFO] Copying 0 resource to META-INF
[INFO] skip non existing resourceDirectory <http://hudson.zones.apache.org/hudson/job/clerezza-site/org.apache.clerezza$org.apache.clerezza.rdf.scala.utils/ws/src/main/resources>
[INFO] [compiler:compile {execution: default-compile}]
[INFO] Nothing to compile - all classes are up to date
[INFO] [scr:scr {execution: generate-scr-scrdescriptor}]
[INFO] [resources:testResources {execution: default-testResources}]
[INFO] Using 'utf-8' encoding to copy filtered resources.
[INFO] skip non existing resourceDirectory <http://hudson.zones.apache.org/hudson/job/clerezza-site/org.apache.clerezza$org.apache.clerezza.rdf.scala.utils/ws/src/test/resources>
[INFO] [compiler:testCompile {execution: default-testCompile}]
[INFO] No sources to compile
[INFO] [surefire:test {execution: default-test}]
[INFO] Surefire report directory: <http://hudson.zones.apache.org/hudson/job/clerezza-site/org.apache.clerezza$org.apache.clerezza.rdf.scala.utils/ws/target/surefire-reports>

-------------------------------------------------------
 T E S T S
-------------------------------------------------------
Running org.apache.clerezza.rdf.scala.utils.RichGraphNodeTest
Tests run: 9, Failures: 0, Errors: 0, Skipped: 0, Time elapsed: 0.312 sec

Results :

Tests run: 9, Failures: 0, Errors: 0, Skipped: 0

[HUDSON] Recording test results
[INFO] Preparing surefire-report:report-only
[INFO] No goals needed for project - skipping
[INFO] Preparing plugin:report
[INFO] [scala:compile {execution: default}]
[INFO] suggestion: remove the scalaVersion from pom.xml
[ERROR] <http://hudson.zones.apache.org/hudson/job/clerezza-site/org.apache.clerezza$org.apache.clerezza.rdf.scala.utils/ws/src/main/java>
[ERROR] <http://hudson.zones.apache.org/hudson/job/clerezza-site/org.apache.clerezza$org.apache.clerezza.rdf.scala.utils/ws/src/main/scala>
[INFO] Nothing to compile - all classes are up to date
[INFO] [scala:testCompile {execution: default}]
[INFO] suggestion: remove the scalaVersion from pom.xml
[ERROR] <http://hudson.zones.apache.org/hudson/job/clerezza-site/org.apache.clerezza$org.apache.clerezza.rdf.scala.utils/ws/src/test/java>
[ERROR] <http://hudson.zones.apache.org/hudson/job/clerezza-site/org.apache.clerezza$org.apache.clerezza.rdf.scala.utils/ws/src/test/java/../scala>
[INFO] Nothing to compile - all classes are up to date
[INFO] [resources:resources {execution: default-resources}]
[INFO] Using 'utf-8' encoding to copy filtered resources.
[INFO] Copying 0 resource to META-INF
[INFO] skip non existing resourceDirectory <http://hudson.zones.apache.org/hudson/job/clerezza-site/org.apache.clerezza$org.apache.clerezza.rdf.scala.utils/ws/src/main/resources>
[INFO] [compiler:compile {execution: default-compile}]
[INFO] Nothing to compile - all classes are up to date
[INFO] [site:site {execution: default-site}]
[INFO] Skipped "Maven Surefire Report" report, file "surefire-report.html" already exists
for the English version.
[INFO] Generating "Issue Tracking" report.
[INFO] Generating "Project Team" report.
[INFO] Generating "Maven Surefire Report" report.
[WARNING] Unable to locate Test Source XRef to link to - DISABLED
[INFO] Generating "Dependency Management" report.
[INFO] Generating "Dependencies" report.
Downloading: http://repo1.maven.org/maven2//org/apache/clerezza/org.apache.clerezza.rdf.core.test/0.13-incubating-SNAPSHOT/org.apache.clerezza.rdf.core.test-0.13-incubating-SNAPSHOT.jar
[INFO] Unable to find resource 'org.apache.clerezza:org.apache.clerezza.rdf.core.test:jar:0.13-incubating-SNAPSHOT'
in repository ops4j-plugin-snapshot (http://repo1.maven.org/maven2/)
Downloading: http://repository.apache.org/content/groups/snapshots-group/org/apache/clerezza/org.apache.clerezza.rdf.core.test/0.13-incubating-SNAPSHOT/org.apache.clerezza.rdf.core.test-0.13-incubating-SNAPSHOT.jar
[INFO] Unable to find resource 'org.apache.clerezza:org.apache.clerezza.rdf.core.test:jar:0.13-incubating-SNAPSHOT'
in repository apache-plugin-snapshot (http://repository.apache.org/content/groups/snapshots-group)
Downloading: http://repo1.maven.org/maven2//org/apache/clerezza/org.apache.clerezza.rdf.core.test/0.13-incubating-SNAPSHOT/org.apache.clerezza.rdf.core.test-0.13-incubating-SNAPSHOT.jar
[INFO] Unable to find resource 'org.apache.clerezza:org.apache.clerezza.rdf.core.test:jar:0.13-incubating-SNAPSHOT'
in repository ops4j (http://repo1.maven.org/maven2/)
Downloading: http://repository.apache.org/content/groups/snapshots-group/org/apache/clerezza/org.apache.clerezza.rdf.core.test/0.13-incubating-SNAPSHOT/org.apache.clerezza.rdf.core.test-0.13-incubating-SNAPSHOT.jar
[INFO] Unable to find resource 'org.apache.clerezza:org.apache.clerezza.rdf.core.test:jar:0.13-incubating-SNAPSHOT'
in repository apache (http://repository.apache.org/content/groups/snapshots-group)
Downloading: http://repo1.maven.org/maven2//org/apache/clerezza/org.apache.clerezza.rdf.ontologies/0.11-incubating-SNAPSHOT/org.apache.clerezza.rdf.ontologies-0.11-incubating-SNAPSHOT.jar
[INFO] Unable to find resource 'org.apache.clerezza:org.apache.clerezza.rdf.ontologies:jar:0.11-incubating-SNAPSHOT'
in repository ops4j-plugin-snapshot (http://repo1.maven.org/maven2/)
Downloading: http://repository.apache.org/content/groups/snapshots-group/org/apache/clerezza/org.apache.clerezza.rdf.ontologies/0.11-incubating-SNAPSHOT/org.apache.clerezza.rdf.ontologies-0.11-incubating-SNAPSHOT.jar
[INFO] Unable to find resource 'org.apache.clerezza:org.apache.clerezza.rdf.ontologies:jar:0.11-incubating-SNAPSHOT'
in repository apache-plugin-snapshot (http://repository.apache.org/content/groups/snapshots-group)
Downloading: http://repo1.maven.org/maven2//org/apache/clerezza/org.apache.clerezza.rdf.ontologies/0.11-incubating-SNAPSHOT/org.apache.clerezza.rdf.ontologies-0.11-incubating-SNAPSHOT.jar
[INFO] Unable to find resource 'org.apache.clerezza:org.apache.clerezza.rdf.ontologies:jar:0.11-incubating-SNAPSHOT'
in repository ops4j (http://repo1.maven.org/maven2/)
Downloading: http://repository.apache.org/content/groups/snapshots-group/org/apache/clerezza/org.apache.clerezza.rdf.ontologies/0.11-incubating-SNAPSHOT/org.apache.clerezza.rdf.ontologies-0.11-incubating-SNAPSHOT.jar
[INFO] Unable to find resource 'org.apache.clerezza:org.apache.clerezza.rdf.ontologies:jar:0.11-incubating-SNAPSHOT'
in repository apache (http://repository.apache.org/content/groups/snapshots-group)
Downloading: http://repo1.maven.org/maven2//org/apache/clerezza/org.apache.clerezza.utils/0.1-incubating-SNAPSHOT/org.apache.clerezza.utils-0.1-incubating-SNAPSHOT.jar
[INFO] Unable to find resource 'org.apache.clerezza:org.apache.clerezza.utils:jar:0.1-incubating-SNAPSHOT'
in repository ops4j-plugin-snapshot (http://repo1.maven.org/maven2/)
Downloading: http://repository.apache.org/content/groups/snapshots-group/org/apache/clerezza/org.apache.clerezza.utils/0.1-incubating-SNAPSHOT/org.apache.clerezza.utils-0.1-incubating-SNAPSHOT.jar
[INFO] Unable to find resource 'org.apache.clerezza:org.apache.clerezza.utils:jar:0.1-incubating-SNAPSHOT'
in repository apache-plugin-snapshot (http://repository.apache.org/content/groups/snapshots-group)
Downloading: http://repo1.maven.org/maven2//org/apache/clerezza/org.apache.clerezza.utils/0.1-incubating-SNAPSHOT/org.apache.clerezza.utils-0.1-incubating-SNAPSHOT.jar
[INFO] Unable to find resource 'org.apache.clerezza:org.apache.clerezza.utils:jar:0.1-incubating-SNAPSHOT'
in repository ops4j (http://repo1.maven.org/maven2/)
Downloading: http://repository.apache.org/content/groups/snapshots-group/org/apache/clerezza/org.apache.clerezza.utils/0.1-incubating-SNAPSHOT/org.apache.clerezza.utils-0.1-incubating-SNAPSHOT.jar
[INFO] Unable to find resource 'org.apache.clerezza:org.apache.clerezza.utils:jar:0.1-incubating-SNAPSHOT'
in repository apache (http://repository.apache.org/content/groups/snapshots-group)
[INFO] Generating "Project Plugins" report.
[INFO] Generating "PMD Report" report.
[WARNING] Unable to locate Source XRef to link to - DISABLED
[INFO] Generating "Continuous Integration" report.
[INFO] Generating "JaxRs Report" report.
[INFO] Generating "Plugin Management" report.
[INFO] Generating "Mailing Lists" report.
[INFO] Generating "Source Repository" report.
[INFO] Generating "Project Summary" report.
[INFO] Generating "About" report.
[INFO] Generating "ScalaDocs" report.
[WARNING] scalac error: Parameter '-bottom' is not recognised by Scalac.
[WARNING]   scalac -help  gives more information
[WARNING] scalac error: bad option: '-bottom'
[WARNING]   scalac -help  gives more information
[HUDSON] Archiving site from <http://hudson.zones.apache.org/hudson/job/clerezza-site/org.apache.clerezza$org.apache.clerezza.rdf.scala.utils/ws/target/site>
to /export/home/hudson/hudson/jobs/clerezza-site/site/org.apache.clerezza.rdf.scala.utils
[INFO] ------------------------------------------------------------------------
[ERROR] BUILD ERROR
[INFO] ------------------------------------------------------------------------
[INFO] Error during page generation

Embedded error: Error rendering Maven report: wrap: command line returned non-zero value:1
[INFO] ------------------------------------------------------------------------
[INFO] For more information, run Maven with the -e switch
[INFO] ------------------------------------------------------------------------
[INFO] Total time: 34 minutes 54 seconds
[INFO] Finished at: Tue Jul 13 00:54:48 UTC 2010
[INFO] Final Memory: 121M/454M
[INFO] ------------------------------------------------------------------------


Mime
View raw message