incubator-clerezza-dev mailing list archives

Site index · List index
Message view « Date » · « Thread »
Top « Date » · « Thread »
From Apache Hudson Server <hud...@hudson.zones.apache.org>
Subject Build failed in Hudson: clerezza-trunk-1.6 #216
Date Sat, 24 Apr 2010 03:56:46 GMT
See <http://hudson.zones.apache.org/hudson/job/clerezza-trunk-1.6/216/changes>

Changes:

[reto] setting only fields for which a non-null value is available

------------------------------------------
[...truncated 8191 lines...]
[WARNING] repository metadata for: 'snapshot org.apache.clerezza:org.apache.clerezza.utils.imageprocessing:0.7-incubating-SNAPSHOT'
could not be retrieved from repository: ops4j due to an error: Error transferring file
[INFO] Repository 'ops4j' will be blacklisted
[INFO] snapshot org.apache.clerezza:org.apache.clerezza.utils.imageprocessing:0.7-incubating-SNAPSHOT:
checking for updates from apache
[INFO] snapshot org.apache.clerezza:org.apache.clerezza.utils.imageprocessing:0.7-incubating-SNAPSHOT:
checking for updates from scala-tools.org
[INFO] snapshot org.apache.clerezza:org.apache.clerezza.utils.imageprocessing:0.7-incubating-SNAPSHOT:
checking for updates from sonatype.snapshots
[INFO] snapshot org.apache.clerezza:org.apache.clerezza.web.resources.style:0.4-incubating-SNAPSHOT:
checking for updates from apache
[INFO] snapshot org.apache.clerezza:org.apache.clerezza.web.resources.style:0.4-incubating-SNAPSHOT:
checking for updates from scala-tools.org
[INFO] snapshot org.apache.clerezza:org.apache.clerezza.web.resources.style:0.4-incubating-SNAPSHOT:
checking for updates from sonatype.snapshots
[INFO] snapshot org.apache.clerezza:org.apache.clerezza.platform.content.representations.ontologies:0.1-incubating-SNAPSHOT:
checking for updates from apache
[INFO] snapshot org.apache.clerezza:org.apache.clerezza.platform.content.representations.ontologies:0.1-incubating-SNAPSHOT:
checking for updates from scala-tools.org
[INFO] snapshot org.apache.clerezza:org.apache.clerezza.platform.content.representations.ontologies:0.1-incubating-SNAPSHOT:
checking for updates from sonatype.snapshots
[INFO] [compiler:compile]
[INFO] Compiling 2 source files to <http://hudson.zones.apache.org/hudson/job/clerezza-trunk-1.6/ws/trunk-1.6/org.apache.clerezza.platform.content.representations/org.apache.clerezza.platform.content.representations.core/target/classes>
[INFO] [scr:scr {execution: generate-scr-scrdescriptor}]
[INFO] Generating 2 MetaType Descriptors to <http://hudson.zones.apache.org/hudson/job/clerezza-trunk-1.6/ws/trunk-1.6/org.apache.clerezza.platform.content.representations/org.apache.clerezza.platform.content.representations.core/target/scr-plugin-generated/OSGI-INF/metatype/metatype.xml>
[INFO] Writing abstract service descriptor <http://hudson.zones.apache.org/hudson/job/clerezza-trunk-1.6/ws/trunk-1.6/org.apache.clerezza.platform.content.representations/org.apache.clerezza.platform.content.representations.core/target/scr-plugin-generated/OSGI-INF/scr-plugin/scrinfo.xml>
with 2 entries.
[INFO] Generating 2 Service Component Descriptors to <http://hudson.zones.apache.org/hudson/job/clerezza-trunk-1.6/ws/trunk-1.6/org.apache.clerezza.platform.content.representations/org.apache.clerezza.platform.content.representations.core/target/scr-plugin-generated/OSGI-INF/serviceComponents.xml>
[INFO] [resources:testResources]
[INFO] Using 'utf-8' encoding to copy filtered resources.
[INFO] skip non existing resourceDirectory <http://hudson.zones.apache.org/hudson/job/clerezza-trunk-1.6/ws/trunk-1.6/org.apache.clerezza.platform.content.representations/org.apache.clerezza.platform.content.representations.core/src/test/resources>
[INFO] [compiler:testCompile]
[INFO] No sources to compile
[INFO] [surefire:test]
[INFO] No tests to run.
[HUDSON] Recording test results
[INFO] [bundle:bundle]
[INFO] Preparing source:jar
[WARNING] Removing: jar from forked lifecycle, to prevent recursive invocation.
[INFO] No goals needed for project - skipping
[INFO] [source:jar {execution: default}]
[INFO] Building jar: <http://hudson.zones.apache.org/hudson/job/clerezza-trunk-1.6/ws/trunk-1.6/org.apache.clerezza.platform.content.representations/org.apache.clerezza.platform.content.representations.core/target/org.apache.clerezza.platform.content.representations.core-0.1-incubating-SNAPSHOT-sources.jar>
[INFO] [install:install]
[INFO] Installing <http://hudson.zones.apache.org/hudson/job/clerezza-trunk-1.6/ws/trunk-1.6/org.apache.clerezza.platform.content.representations/org.apache.clerezza.platform.content.representations.core/target/org.apache.clerezza.platform.content.representations.core-0.1-incubating-SNAPSHOT.jar>
to /home/hudson/.m2/repository/org/apache/clerezza/org.apache.clerezza.platform.content.representations.core/0.1-incubating-SNAPSHOT/org.apache.clerezza.platform.content.representations.core-0.1-incubating-SNAPSHOT.jar
[INFO] Installing <http://hudson.zones.apache.org/hudson/job/clerezza-trunk-1.6/ws/trunk-1.6/org.apache.clerezza.platform.content.representations/org.apache.clerezza.platform.content.representations.core/target/org.apache.clerezza.platform.content.representations.core-0.1-incubating-SNAPSHOT-sources.jar>
to /home/hudson/.m2/repository/org/apache/clerezza/org.apache.clerezza.platform.content.representations.core/0.1-incubating-SNAPSHOT/org.apache.clerezza.platform.content.representations.core-0.1-incubating-SNAPSHOT-sources.jar
[INFO] [bundle:install]
[WARNING] Exception while updating local OBR: Unable to read repository xml: file:/home/hudson/.m2/repository/repository.xml
org.apache.maven.plugin.MojoExecutionException: Unable to read repository xml: file:/home/hudson/.m2/repository/repository.xml
	at org.apache.felix.obrplugin.ObrUpdate.parseRepositoryXml(ObrUpdate.java:295)
	at org.apache.felix.obrplugin.ObrInstall.execute(ObrInstall.java:140)
	at org.apache.maven.plugin.DefaultPluginManager.executeMojo(DefaultPluginManager.java:451)
	at hudson.maven.agent.PluginManagerInterceptor.executeMojo(PluginManagerInterceptor.java:182)
	at org.apache.maven.lifecycle.DefaultLifecycleExecutor.executeGoals(DefaultLifecycleExecutor.java:558)
	at org.apache.maven.lifecycle.DefaultLifecycleExecutor.executeGoalWithLifecycle(DefaultLifecycleExecutor.java:499)
	at org.apache.maven.lifecycle.DefaultLifecycleExecutor.executeGoal(DefaultLifecycleExecutor.java:478)
	at org.apache.maven.lifecycle.DefaultLifecycleExecutor.executeGoalAndHandleFailures(DefaultLifecycleExecutor.java:330)
	at org.apache.maven.lifecycle.DefaultLifecycleExecutor.executeTaskSegments(DefaultLifecycleExecutor.java:291)
	at org.apache.maven.lifecycle.DefaultLifecycleExecutor.execute(DefaultLifecycleExecutor.java:142)
	at org.apache.maven.lifecycle.LifecycleExecutorInterceptor.execute(LifecycleExecutorInterceptor.java:65)
	at org.apache.maven.DefaultMaven.doExecute(DefaultMaven.java:336)
	at org.apache.maven.DefaultMaven.execute(DefaultMaven.java:129)
	at org.apache.maven.cli.MavenCli.main(MavenCli.java:287)
	at sun.reflect.NativeMethodAccessorImpl.invoke0(Native Method)
	at sun.reflect.NativeMethodAccessorImpl.invoke(NativeMethodAccessorImpl.java:39)
	at sun.reflect.DelegatingMethodAccessorImpl.invoke(DelegatingMethodAccessorImpl.java:25)
	at java.lang.reflect.Method.invoke(Method.java:597)
	at org.codehaus.classworlds.Launcher.launchEnhanced(Launcher.java:315)
	at org.codehaus.classworlds.Launcher.launch(Launcher.java:255)
	at hudson.maven.agent.Main.launch(Main.java:165)
	at hudson.maven.MavenBuilder.call(MavenBuilder.java:159)
	at hudson.maven.MavenModuleSetBuild$Builder.call(MavenModuleSetBuild.java:688)
	at hudson.maven.MavenModuleSetBuild$Builder.call(MavenModuleSetBuild.java:632)
	at hudson.remoting.UserRequest.perform(UserRequest.java:104)
	at hudson.remoting.UserRequest.perform(UserRequest.java:48)
	at hudson.remoting.Request$2.run(Request.java:236)
	at java.util.concurrent.Executors$RunnableAdapter.call(Executors.java:441)
	at java.util.concurrent.FutureTask$Sync.innerRun(FutureTask.java:303)
	at java.util.concurrent.FutureTask.run(FutureTask.java:138)
	at java.util.concurrent.ThreadPoolExecutor$Worker.runTask(ThreadPoolExecutor.java:886)
	at java.util.concurrent.ThreadPoolExecutor$Worker.run(ThreadPoolExecutor.java:908)
	at java.lang.Thread.run(Thread.java:619)
Caused by: org.xmlpull.v1.XmlPullParserException: unexpected type (position:END_DOCUMENT null@3:1
in java.io.InputStreamReader@984a8d) 
	at org.kxml2.io.KXmlParser.exception(Unknown Source)
	at org.kxml2.io.KXmlParser.nextTag(Unknown Source)
	at org.apache.felix.bundlerepository.impl.PullParser.parseRepository(PullParser.java:43)
	at org.apache.felix.bundlerepository.impl.DataModelHelperImpl.repository(DataModelHelperImpl.java:147)
	at org.apache.felix.bundlerepository.impl.DataModelHelperImpl.repository(DataModelHelperImpl.java:118)
	at org.apache.felix.obrplugin.ObrUpdate.parseRepositoryXml(ObrUpdate.java:291)
	... 32 more
[INFO] [deploy:deploy]
[INFO] Retrieving previous build number from apache.snapshots.https
Uploading: https://repository.apache.org/content/repositories/snapshots/org/apache/clerezza/org.apache.clerezza.platform.content.representations.core/0.1-incubating-SNAPSHOT/org.apache.clerezza.platform.content.representations.core-0.1-incubating-20100424.020313-46.jar
16K uploaded
[INFO] Retrieving previous metadata from apache.snapshots.https
[INFO] Uploading repository metadata for: 'artifact org.apache.clerezza:org.apache.clerezza.platform.content.representations.core'
[INFO] Uploading project information for org.apache.clerezza.platform.content.representations.core
0.1-incubating-20100424.020313-46
[INFO] Retrieving previous metadata from apache.snapshots.https
[INFO] Uploading repository metadata for: 'snapshot org.apache.clerezza:org.apache.clerezza.platform.content.representations.core:0.1-incubating-SNAPSHOT'
[INFO] Retrieving previous build number from apache.snapshots.https
Uploading: https://repository.apache.org/content/repositories/snapshots/org/apache/clerezza/org.apache.clerezza.platform.content.representations.core/0.1-incubating-SNAPSHOT/org.apache.clerezza.platform.content.representations.core-0.1-incubating-20100424.020313-46-sources.jar
6K uploaded
[INFO] [bundle:deploy]
[INFO] Remote OBR update disabled (enable with -DremoteOBR)
[HUDSON] Archiving <http://hudson.zones.apache.org/hudson/job/clerezza-trunk-1.6/ws/trunk-1.6/org.apache.clerezza.platform.content.representations/org.apache.clerezza.platform.content.representations.core/pom.xml>
to /export/home/hudson/hudson/jobs/clerezza-trunk-1.6/modules/org.apache.clerezza$org.apache.clerezza.platform.content.representations.core/builds/2010-04-24_01-56-33/archive/org.apache.clerezza/org.apache.clerezza.platform.content.representations.core/0.1-incubating-SNAPSHOT/pom.xml
[HUDSON] Archiving <http://hudson.zones.apache.org/hudson/job/clerezza-trunk-1.6/ws/trunk-1.6/org.apache.clerezza.platform.content.representations/org.apache.clerezza.platform.content.representations.core/target/org.apache.clerezza.platform.content.representations.core-0.1-incubating-SNAPSHOT.jar>
to /export/home/hudson/hudson/jobs/clerezza-trunk-1.6/modules/org.apache.clerezza$org.apache.clerezza.platform.content.representations.core/builds/2010-04-24_01-56-33/archive/org.apache.clerezza/org.apache.clerezza.platform.content.representations.core/0.1-incubating-20100424.020313-46/org.apache.clerezza.platform.content.representations.core-0.1-incubating-SNAPSHOT.jar
[HUDSON] Archiving <http://hudson.zones.apache.org/hudson/job/clerezza-trunk-1.6/ws/trunk-1.6/org.apache.clerezza.platform.content.representations/org.apache.clerezza.platform.content.representations.core/target/org.apache.clerezza.platform.content.representations.core-0.1-incubating-SNAPSHOT-sources.jar>
to /export/home/hudson/hudson/jobs/clerezza-trunk-1.6/modules/org.apache.clerezza$org.apache.clerezza.platform.content.representations.core/builds/2010-04-24_01-56-33/archive/org.apache.clerezza/org.apache.clerezza.platform.content.representations.core/0.1-incubating-20100424.020313-46/org.apache.clerezza.platform.content.representations.core-0.1-incubating-SNAPSHOT-sources.jar
[INFO] ------------------------------------------------------------------------
[INFO] Building Clerezza - Platform Dashboard Tests
[INFO]    task-segment: [clean, deploy]
[INFO] ------------------------------------------------------------------------
[INFO] snapshot org.ops4j.pax.exam:maven-paxexam-plugin:1.2.1-SNAPSHOT: checking for updates
from ops4j-plugin-snapshot
[WARNING] repository metadata for: 'snapshot org.ops4j.pax.exam:maven-paxexam-plugin:1.2.1-SNAPSHOT'
could not be retrieved from repository: ops4j-plugin-snapshot due to an error: Error transferring
file
[INFO] Repository 'ops4j-plugin-snapshot' will be blacklisted
[INFO] snapshot org.ops4j.pax.exam:maven-paxexam-plugin:1.2.1-SNAPSHOT: checking for updates
from apache-plugin-snapshot
[INFO] snapshot org.ops4j.pax.exam:maven-paxexam-plugin:1.2.1-SNAPSHOT: checking for updates
from ops4j
[WARNING] repository metadata for: 'snapshot org.ops4j.pax.exam:maven-paxexam-plugin:1.2.1-SNAPSHOT'
could not be retrieved from repository: ops4j due to an error: Error transferring file
[INFO] Repository 'ops4j' will be blacklisted
[INFO] snapshot org.ops4j.pax.exam:maven-paxexam-plugin:1.2.1-SNAPSHOT: checking for updates
from apache
[INFO] snapshot org.ops4j.pax.exam:maven-paxexam-plugin:1.2.1-SNAPSHOT: checking for updates
from scala-tools.org
[INFO] snapshot org.ops4j.pax.exam:maven-paxexam-plugin:1.2.1-SNAPSHOT: checking for updates
from sonatype.snapshots
[INFO] snapshot org.ops4j.pax:exam:1.2.1-SNAPSHOT: checking for updates from apache-plugin-snapshot
[INFO] snapshot org.ops4j.pax:exam:1.2.1-SNAPSHOT: checking for updates from apache
[INFO] snapshot org.ops4j.pax:exam:1.2.1-SNAPSHOT: checking for updates from scala-tools.org
[INFO] snapshot org.ops4j.pax:exam:1.2.1-SNAPSHOT: checking for updates from sonatype.snapshots
[INFO] [clean:clean]
[INFO] Deleting file set: <http://hudson.zones.apache.org/hudson/job/clerezza-trunk-1.6/ws/trunk-1.6/org.apache.clerezza.platform.dashboard/org.apache.clerezza.platform.dashboard.tests/target>
(included: [**], excluded: [])
[INFO] snapshot org.ops4j.pax.exam:pax-exam:1.2.1-SNAPSHOT: checking for updates from apache
[INFO] snapshot org.ops4j.pax.exam:pax-exam:1.2.1-SNAPSHOT: checking for updates from scala-tools.org
[INFO] snapshot org.ops4j.pax.exam:pax-exam:1.2.1-SNAPSHOT: checking for updates from sonatype.snapshots
[INFO] snapshot org.ops4j.pax.exam:pax-exam-junit:1.2.1-SNAPSHOT: checking for updates from
apache
[INFO] snapshot org.ops4j.pax.exam:pax-exam-junit:1.2.1-SNAPSHOT: checking for updates from
scala-tools.org
[INFO] snapshot org.ops4j.pax.exam:pax-exam-junit:1.2.1-SNAPSHOT: checking for updates from
sonatype.snapshots
[INFO] snapshot org.ops4j.pax.exam:pax-exam-runtime:1.2.1-SNAPSHOT: checking for updates from
apache
[INFO] snapshot org.ops4j.pax.exam:pax-exam-runtime:1.2.1-SNAPSHOT: checking for updates from
scala-tools.org
[INFO] snapshot org.ops4j.pax.exam:pax-exam-runtime:1.2.1-SNAPSHOT: checking for updates from
sonatype.snapshots
[INFO] snapshot org.ops4j.pax.exam:pax-exam-spi:1.2.1-SNAPSHOT: checking for updates from
apache
[INFO] snapshot org.ops4j.pax.exam:pax-exam-spi:1.2.1-SNAPSHOT: checking for updates from
scala-tools.org
[INFO] snapshot org.ops4j.pax.exam:pax-exam-spi:1.2.1-SNAPSHOT: checking for updates from
sonatype.snapshots
[INFO] snapshot org.ops4j.pax.exam:pax-exam-junit-extender:1.2.1-SNAPSHOT: checking for updates
from apache
[INFO] snapshot org.ops4j.pax.exam:pax-exam-junit-extender:1.2.1-SNAPSHOT: checking for updates
from scala-tools.org
[INFO] snapshot org.ops4j.pax.exam:pax-exam-junit-extender:1.2.1-SNAPSHOT: checking for updates
from sonatype.snapshots
[INFO] snapshot org.ops4j.pax.exam:pax-exam-container-default:1.2.1-SNAPSHOT: checking for
updates from apache
[INFO] snapshot org.ops4j.pax.exam:pax-exam-container-default:1.2.1-SNAPSHOT: checking for
updates from scala-tools.org
[INFO] snapshot org.ops4j.pax.exam:pax-exam-container-default:1.2.1-SNAPSHOT: checking for
updates from sonatype.snapshots
[INFO] snapshot org.ops4j.pax.exam:pax-exam-container-rbc-client:1.2.1-SNAPSHOT: checking
for updates from apache
[INFO] snapshot org.ops4j.pax.exam:pax-exam-container-rbc-client:1.2.1-SNAPSHOT: checking
for updates from scala-tools.org
[INFO] snapshot org.ops4j.pax.exam:pax-exam-container-rbc-client:1.2.1-SNAPSHOT: checking
for updates from sonatype.snapshots
[INFO] snapshot org.ops4j.pax.exam:pax-exam-container-rbc:1.2.1-SNAPSHOT: checking for updates
from apache
[INFO] snapshot org.ops4j.pax.runner:pax-runner-no-jcl:1.5.0-SNAPSHOT: checking for updates
from apache
[INFO] snapshot org.ops4j.pax.runner:pax-runner-no-jcl:1.5.0-SNAPSHOT: checking for updates
from scala-tools.org
[INFO] snapshot org.ops4j.pax.runner:pax-runner-no-jcl:1.5.0-SNAPSHOT: checking for updates
from sonatype.snapshots
[INFO] snapshot org.ops4j.pax:runner:1.5.0-SNAPSHOT: checking for updates from apache
[INFO] snapshot org.ops4j.pax:runner:1.5.0-SNAPSHOT: checking for updates from scala-tools.org
[INFO] snapshot org.ops4j.pax:runner:1.5.0-SNAPSHOT: checking for updates from sonatype.snapshots
[INFO] [paxexam:generate-depends-file {execution: generate-depends-file}]
[INFO] Created: <http://hudson.zones.apache.org/hudson/job/clerezza-trunk-1.6/ws/trunk-1.6/org.apache.clerezza.platform.dashboard/org.apache.clerezza.platform.dashboard.tests/target/classes/META-INF/maven/dependencies.properties>
[INFO] [paxexam:generate-config {execution: generate-config}]
[INFO] Adding dependencies in scope provided
[INFO] Generated configuration as Pax Runner arguments file <http://hudson.zones.apache.org/hudson/job/clerezza-trunk-1.6/ws/trunk-1.6/org.apache.clerezza.platform.dashboard/org.apache.clerezza.platform.dashboard.tests/target/test-classes/META-INF/maven/paxexam-config.args>
[INFO] [resources:resources]
[INFO] Using 'utf-8' encoding to copy filtered resources.
[INFO] Copying 0 resource to META-INF
[INFO] skip non existing resourceDirectory <http://hudson.zones.apache.org/hudson/job/clerezza-trunk-1.6/ws/trunk-1.6/org.apache.clerezza.platform.dashboard/org.apache.clerezza.platform.dashboard.tests/src/main/resources>
[INFO] [compiler:compile]
[INFO] No sources to compile
[INFO] [scr:scr {execution: generate-scr-scrdescriptor}]
[INFO] [resources:testResources]
[INFO] Using 'utf-8' encoding to copy filtered resources.
[INFO] skip non existing resourceDirectory <http://hudson.zones.apache.org/hudson/job/clerezza-trunk-1.6/ws/trunk-1.6/org.apache.clerezza.platform.dashboard/org.apache.clerezza.platform.dashboard.tests/src/test/resources>
[INFO] [compiler:testCompile]
[INFO] Compiling 2 source files to <http://hudson.zones.apache.org/hudson/job/clerezza-trunk-1.6/ws/trunk-1.6/org.apache.clerezza.platform.dashboard/org.apache.clerezza.platform.dashboard.tests/target/test-classes>
[INFO] [surefire:test]
[INFO] Surefire report directory: <http://hudson.zones.apache.org/hudson/job/clerezza-trunk-1.6/ws/trunk-1.6/org.apache.clerezza.platform.dashboard/org.apache.clerezza.platform.dashboard.tests/target/surefire-reports>

-------------------------------------------------------
 T E S T S
-------------------------------------------------------
Running org.apache.clerezza.platform.dashboard.blackbox.osgi.FelixContextualMenuGeneratorTest
__________                 ___________
\______   \_____  ___  ___ \_   _____/__  ________    _____
 |     ___/\__  \ \  \/  /  |    __)_\  \/  /\__  \  /     \
 |    |     / __ \_>    <   |        \>    <  / __ \|  Y Y  \
 |____|    (____  /__/\_ \ /_______  /__/\_ \(____  /__|_|  /
                \/      \/         \/      \/     \/      \/

Pax Exam 1.2.1-SNAPSHOT from OPS4J - http://www.ops4j.org
---------------------------------------------------------

[              JUnit4TestMethod] - Starting test checkMenu [felix](org.apache.clerezza.platform.dashboard.blackbox.osgi.FelixContextualMenuGeneratorTest)
[        PaxRunnerTestContainer] - Starting up the test container (Pax Runner 1.3.0 )
[        PaxRunnerTestContainer] - Acquire lock for new Pax Runner instance on /tmp/paxexam_runner_hudson/paxexam.lock
[             ConfigurationImpl] - Using config [classpath:META-INF/runner.properties]
[                           Run] - Using arguments from command line and <http://hudson.zones.apache.org/hudson/job/clerezza-trunk-1.6/ws/trunk-1.6/org.apache.clerezza.platform.dashboard/org.apache.clerezza.platform.dashboard.tests/target/test-classes/META-INF/maven/paxexam-config.args>
[          ProvisionServiceImpl] - Scan bundles from [scan-bundle:mvn:org.ops4j.pax.exam/pax-exam/1.2.1-SNAPSHOT@update@1]
[          ProvisionServiceImpl] - Scan bundles from [scan-bundle:mvn:org.ops4j.pax.exam/pax-exam-junit-extender/1.2.1-SNAPSHOT@update@1]
[          ProvisionServiceImpl] - Scan bundles from [scan-bundle:mvn:org.ops4j.pax.exam/pax-exam-junit-extender-impl/1.2.1-SNAPSHOT@update@1]
[          ProvisionServiceImpl] - Scan bundles from [scan-bundle:mvn:org.apache.felix/org.apache.felix.scr/1.0.6]
[          ProvisionServiceImpl] - Scan bundles from [scan-bundle:mvn:org.apache.felix/org.apache.felix.eventadmin/1.0.0]
[          ProvisionServiceImpl] - Scan bundles from [scan-bundle:mvn:org.apache.felix/org.apache.felix.metatype/1.0.2]
[          ProvisionServiceImpl] - Scan bundles from [scan-bundle:mvn:org.junit/com.springsource.org.junit/4.4.0@1]
[          ProvisionServiceImpl] - Scan bundles from [scan-bundle:mvn:org.ops4j.pax.exam/pax-exam-container-rbc/1.2.1-SNAPSHOT@update@1]
[          ProvisionServiceImpl] - Scan bundles from [scan-bundle:file:/home/hudson/.m2/repository/org/apache/clerezza/org.apache.clerezza.triaxrs/0.11-incubating-SNAPSHOT/org.apache.clerezza.triaxrs-0.11-incubating-SNAPSHOT.jar@update]
[          ProvisionServiceImpl] - Scan bundles from [scan-bundle:file:/home/hudson/.m2/repository/org/apache/clerezza/org.apache.clerezza.rdf.core/0.12-incubating-SNAPSHOT/org.apache.clerezza.rdf.core-0.12-incubating-SNAPSHOT.jar@update]
[          ProvisionServiceImpl] - Scan bundles from [scan-bundle:file:/home/hudson/.m2/repository/org/apache/clerezza/org.apache.clerezza.jaxrs.utils/0.6-incubating-SNAPSHOT/org.apache.clerezza.jaxrs.utils-0.6-incubating-SNAPSHOT.jar@update]
[          ProvisionServiceImpl] - Scan bundles from [scan-bundle:file:/home/hudson/.m2/repository/org/apache/clerezza/org.apache.clerezza.platform.typerendering.core/0.2-incubating-SNAPSHOT/org.apache.clerezza.platform.typerendering.core-0.2-incubating-SNAPSHOT.jar@update]
[          ProvisionServiceImpl] - Scan bundles from [scan-bundle:file:/home/hudson/.m2/repository/org/apache/clerezza/org.apache.clerezza.platform.typerendering.ontologies/0.2-incubating-SNAPSHOT/org.apache.clerezza.platform.typerendering.ontologies-0.2-incubating-SNAPSHOT.jar@update]
[          ProvisionServiceImpl] - Scan bundles from [scan-bundle:file:/home/hudson/.m2/repository/org/apache/clerezza/org.apache.clerezza.platform.typerendering.scalaserverpages/0.3-incubating-SNAPSHOT/org.apache.clerezza.platform.typerendering.scalaserverpages-0.3-incubating-SNAPSHOT.jar@update]
[          ProvisionServiceImpl] - Scan bundles from [scan-bundle:file:/home/hudson/.m2/repository/org/apache/clerezza/org.apache.clerezza.platform.graphprovider.content/0.6-incubating-SNAPSHOT/org.apache.clerezza.platform.graphprovider.content-0.6-incubating-SNAPSHOT.jar@update]
[          ProvisionServiceImpl] - Scan bundles from [scan-bundle:file:/home/hudson/.m2/repository/org/apache/clerezza/org.apache.clerezza.rdf.utils/0.13-incubating-SNAPSHOT/org.apache.clerezza.rdf.utils-0.13-incubating-SNAPSHOT.jar@update]
[          ProvisionServiceImpl] - Scan bundles from [scan-bundle:file:/home/hudson/.m2/repository/org/apache/clerezza/ext/org.json.simple/0.3-incubating-SNAPSHOT/org.json.simple-0.3-incubating-SNAPSHOT.jar@update]
[          ProvisionServiceImpl] - Scan bundles from [scan-bundle:file:/home/hudson/.m2/repository/org/apache/clerezza/org.apache.clerezza.platform.dashboard.core/0.2-incubating-SNAPSHOT/org.apache.clerezza.platform.dashboard.core-0.2-incubating-SNAPSHOT.jar@update]
[          ProvisionServiceImpl] - Scan bundles from [scan-bundle:file:/home/hudson/.m2/repository/org/apache/clerezza/org.apache.clerezza.platform.dashboard.ontologies/0.2-incubating-SNAPSHOT/org.apache.clerezza.platform.dashboard.ontologies-0.2-incubating-SNAPSHOT.jar@update]
[          ProvisionServiceImpl] - Scan bundles from [scan-bundle:file:/home/hudson/.m2/repository/org/apache/clerezza/org.apache.clerezza.rdf.ontologies/0.11-incubating-SNAPSHOT/org.apache.clerezza.rdf.ontologies-0.11-incubating-SNAPSHOT.jar@update]
[          ProvisionServiceImpl] - Scan bundles from [scan-bundle:file:/home/hudson/.m2/repository/org/apache/clerezza/org.apache.clerezza.templating/0.8-incubating-SNAPSHOT/org.apache.clerezza.templating-0.8-incubating-SNAPSHOT.jar@update]
[          ProvisionServiceImpl] - Scan bundles from [scan-bundle:file:/home/hudson/.m2/repository/org/apache/clerezza/org.apache.clerezza.templating.seedsnipe/0.8-incubating-SNAPSHOT/org.apache.clerezza.templating.seedsnipe-0.8-incubating-SNAPSHOT.jar@update]
[          ProvisionServiceImpl] - Scan bundles from [scan-bundle:file:/home/hudson/.m2/repository/org/osgi/org.osgi.compendium/4.1.0/org.osgi.compendium-4.1.0.jar@update]
[          ProvisionServiceImpl] - Scan bundles from [scan-bundle:file:/home/hudson/.m2/repository/javax/ws/rs/jsr311-api/1.0/jsr311-api-1.0.jar@update]
[          ProvisionServiceImpl] - Scan bundles from [scan-bundle:file:/home/hudson/.m2/repository/org/apache/clerezza/org.apache.clerezza.jaxrs.extensions/0.5-incubating-SNAPSHOT/org.apache.clerezza.jaxrs.extensions-0.5-incubating-SNAPSHOT.jar@update]
[          ProvisionServiceImpl] - Scan bundles from [scan-bundle:file:/home/hudson/.m2/repository/org/wymiwyg/wrhapi/0.8.2-SNAPSHOT/wrhapi-0.8.2-SNAPSHOT.jar@update]
[          ProvisionServiceImpl] - Scan bundles from [scan-bundle:file:/home/hudson/.m2/repository/org/wymiwyg/wymiwyg-commons-core/0.7.5/wymiwyg-commons-core-0.7.5.jar@update]
[          ProvisionServiceImpl] - Scan bundles from [scan-bundle:file:/home/hudson/.m2/repository/org/apache/clerezza/org.apache.clerezza.utils/0.1-incubating-SNAPSHOT/org.apache.clerezza.utils-0.1-incubating-SNAPSHOT.jar@update]
[          ProvisionServiceImpl] - Scan bundles from [scan-bundle:file:/home/hudson/.m2/repository/org/apache/httpcomponents/httpcore-osgi/4.0.1/httpcore-osgi-4.0.1.jar@update]
[          ProvisionServiceImpl] - Scan bundles from [scan-bundle:file:/home/hudson/.m2/repository/org/wymiwyg/wrhapi-osgi/0.3/wrhapi-osgi-0.3.jar@update]
[          ProvisionServiceImpl] - Scan bundles from [scan-bundle:file:/home/hudson/.m2/repository/org/apache/clerezza/ext/com.ibm.icu/0.5-incubating-SNAPSHOT/com.ibm.icu-0.5-incubating-SNAPSHOT.jar@update]
[          ProvisionServiceImpl] - Scan bundles from [scan-bundle:file:/home/hudson/.m2/repository/org/apache/clerezza/org.apache.clerezza.scala/0.3-incubating-SNAPSHOT/org.apache.clerezza.scala-0.3-incubating-SNAPSHOT.jar@update]
[          ProvisionServiceImpl] - Scan bundles from [scan-bundle:file:/home/hudson/.m2/repository/asm/asm-all/3.2/asm-all-3.2.jar@update]
[          ProvisionServiceImpl] - Scan bundles from [scan-bundle:file:/home/hudson/.m2/repository/org/apache/httpcomponents/httpclient-osgi/4.0.1/httpclient-osgi-4.0.1.jar@update]
[          ProvisionServiceImpl] - Scan bundles from [scan-bundle:file:/home/hudson/.m2/repository/org/scala-lang-osgi/scala-library/2.7.5/scala-library-2.7.5.jar@update]
[          ProvisionServiceImpl] - Scan bundles from [scan-bundle:file:/home/hudson/.m2/repository/org/scala-lang-osgi/scala-compiler/2.7.5/scala-compiler-2.7.5.jar@update]
[          ProvisionServiceImpl] - Scan bundles from [scan-composite:mvn:org.ops4j.pax.runner.profiles/config//composite]
Build timed out. Aborting
killed.
[HUDSON] Recording test results
[INFO] ------------------------------------------------------------------------
[ERROR] FATAL ERROR
[INFO] ------------------------------------------------------------------------
[INFO] Unable to call isArchivingDisabled. Invalid object ID 33
[INFO] ------------------------------------------------------------------------
[INFO] Trace
java.lang.IllegalStateException: Unable to call isArchivingDisabled. Invalid object ID 33
	at hudson.remoting.RemoteInvocationHandler$RPCRequest.perform(RemoteInvocationHandler.java:268)
	at hudson.remoting.RemoteInvocationHandler$RPCRequest.call(RemoteInvocationHandler.java:255)
	at hudson.remoting.RemoteInvocationHandler$RPCRequest.call(RemoteInvocationHandler.java:215)
	at hudson.remoting.UserRequest.perform(UserRequest.java:114)
	at hudson.remoting.UserRequest.perform(UserRequest.java:48)
	at hudson.remoting.Request$2.run(Request.java:270)
	at java.util.concurrent.Executors$RunnableAdapter.call(Executors.java:441)
	at java.util.concurrent.FutureTask$Sync.innerRun(FutureTask.java:303)
	at java.util.concurrent.FutureTask.run(FutureTask.java:138)
	at java.util.concurrent.ThreadPoolExecutor$Worker.runTask(ThreadPoolExecutor.java:885)
	at java.util.concurrent.ThreadPoolExecutor$Worker.run(ThreadPoolExecutor.java:907)
	at java.lang.Thread.run(Thread.java:619)
[INFO] ------------------------------------------------------------------------
[INFO] Total time: 119 minutes 52 seconds
[INFO] Finished at: Sat Apr 24 03:56:32 UTC 2010
[INFO] Final Memory: 115M/411M
[INFO] ------------------------------------------------------------------------
channel stopped
[locks-and-latches] Releasing all the locks
[locks-and-latches] All the locks released


Mime
View raw message