incubator-clerezza-dev mailing list archives

Site index · List index
Message view « Date » · « Thread »
Top « Date » · « Thread »
From Apache Hudson Server <hud...@hudson.zones.apache.org>
Subject Build failed in Hudson: clerezza-trunk-1.6 #82
Date Tue, 09 Feb 2010 10:06:00 GMT
See <http://hudson.zones.apache.org/hudson/job/clerezza-trunk-1.6/82/changes>

Changes:

[reto] CLEREZZA-63: closing

------------------------------------------
[...truncated 2146 lines...]
	at java.util.concurrent.FutureTask$Sync.innerRun(FutureTask.java:303)
	at java.util.concurrent.FutureTask.run(FutureTask.java:138)
	at java.util.concurrent.ThreadPoolExecutor$Worker.runTask(ThreadPoolExecutor.java:886)
	at java.util.concurrent.ThreadPoolExecutor$Worker.run(ThreadPoolExecutor.java:908)
	at java.lang.Thread.run(Thread.java:619)
[INFO] Writing OBR metadata
[HUDSON] Archiving <http://hudson.zones.apache.org/hudson/job/clerezza-trunk-1.6/ws/trunk-1.6/org.apache.clerezza.webapp.parent/org.apache.clerezza.web.fileserver/pom.xml>
to /export/home/hudson/hudson/jobs/clerezza-trunk-1.6/modules/org.apache.clerezza$org.apache.clerezza.web.fileserver/builds/2010-02-09_10-01-47/archive/org.apache.clerezza/org.apache.clerezza.web.fileserver/0.9-incubating-SNAPSHOT/pom.xml
[HUDSON] Archiving <http://hudson.zones.apache.org/hudson/job/clerezza-trunk-1.6/ws/trunk-1.6/org.apache.clerezza.webapp.parent/org.apache.clerezza.web.fileserver/target/org.apache.clerezza.web.fileserver-0.9-incubating-SNAPSHOT.jar>
to /export/home/hudson/hudson/jobs/clerezza-trunk-1.6/modules/org.apache.clerezza$org.apache.clerezza.web.fileserver/builds/2010-02-09_10-01-47/archive/org.apache.clerezza/org.apache.clerezza.web.fileserver/0.9-incubating-SNAPSHOT/org.apache.clerezza.web.fileserver-0.9-incubating-SNAPSHOT.jar
[HUDSON] Archiving <http://hudson.zones.apache.org/hudson/job/clerezza-trunk-1.6/ws/trunk-1.6/org.apache.clerezza.webapp.parent/org.apache.clerezza.web.fileserver/target/org.apache.clerezza.web.fileserver-0.9-incubating-SNAPSHOT-sources.jar>
to /export/home/hudson/hudson/jobs/clerezza-trunk-1.6/modules/org.apache.clerezza$org.apache.clerezza.web.fileserver/builds/2010-02-09_10-01-47/archive/org.apache.clerezza/org.apache.clerezza.web.fileserver/0.9-incubating-SNAPSHOT/org.apache.clerezza.web.fileserver-0.9-incubating-SNAPSHOT-sources.jar
[INFO] ------------------------------------------------------------------------
[INFO] Building Clerezza - Web GUI Examples
[INFO]    task-segment: [clean, install]
[INFO] ------------------------------------------------------------------------
[INFO] [clean:clean]
[INFO] Deleting file set: <http://hudson.zones.apache.org/hudson/job/clerezza-trunk-1.6/ws/trunk-1.6/org.apache.clerezza.app.webguiexamples/target>
(included: [**], excluded: [])
[INFO] [resources:resources]
[INFO] Using 'utf-8' encoding to copy filtered resources.
[INFO] Copying 1 resource to META-INF
[INFO] Copying 16 resources
[INFO] snapshot org.apache.clerezza:org.apache.clerezza.platform.typerendering.scalaserverpages:0.3-incubating-SNAPSHOT:
checking for updates from sun
[INFO] snapshot org.apache.clerezza:org.apache.clerezza.platform.typerendering.scalaserverpages:0.3-incubating-SNAPSHOT:
checking for updates from wymiwyg
[INFO] snapshot org.apache.clerezza:org.apache.clerezza.platform.typerendering.scalaserverpages:0.3-incubating-SNAPSHOT:
checking for updates from aduna
[INFO] snapshot org.apache.clerezza:org.apache.clerezza.platform.typerendering.scalaserverpages:0.3-incubating-SNAPSHOT:
checking for updates from ops4j
[INFO] snapshot org.apache.clerezza:org.apache.clerezza.platform.typerendering.scalaserverpages:0.3-incubating-SNAPSHOT:
checking for updates from apache
[INFO] snapshot org.apache.clerezza:org.apache.clerezza.platform.typerendering.scalaserverpages:0.3-incubating-SNAPSHOT:
checking for updates from clerezza-ext
[INFO] snapshot org.apache.clerezza:org.apache.clerezza.platform.typerendering.scalaserverpages:0.3-incubating-SNAPSHOT:
checking for updates from jena
[INFO] snapshot org.apache.clerezza:org.apache.clerezza.platform.typerendering.scalaserverpages:0.3-incubating-SNAPSHOT:
checking for updates from scala-tools.org
[INFO] snapshot org.apache.clerezza:org.apache.clerezza.web.fileserver:0.9-incubating-SNAPSHOT:
checking for updates from sun
[INFO] snapshot org.apache.clerezza:org.apache.clerezza.web.fileserver:0.9-incubating-SNAPSHOT:
checking for updates from wymiwyg
[INFO] snapshot org.apache.clerezza:org.apache.clerezza.web.fileserver:0.9-incubating-SNAPSHOT:
checking for updates from aduna
[INFO] snapshot org.apache.clerezza:org.apache.clerezza.web.fileserver:0.9-incubating-SNAPSHOT:
checking for updates from ops4j
[INFO] snapshot org.apache.clerezza:org.apache.clerezza.web.fileserver:0.9-incubating-SNAPSHOT:
checking for updates from apache
[INFO] snapshot org.apache.clerezza:org.apache.clerezza.web.fileserver:0.9-incubating-SNAPSHOT:
checking for updates from clerezza-ext
[INFO] snapshot org.apache.clerezza:org.apache.clerezza.web.fileserver:0.9-incubating-SNAPSHOT:
checking for updates from jena
[INFO] snapshot org.apache.clerezza:org.apache.clerezza.web.fileserver:0.9-incubating-SNAPSHOT:
checking for updates from scala-tools.org
[INFO] [compiler:compile]
[INFO] Compiling 1 source file to <http://hudson.zones.apache.org/hudson/job/clerezza-trunk-1.6/ws/trunk-1.6/org.apache.clerezza.app.webguiexamples/target/classes>
[INFO] [scr:scr {execution: generate-scr-scrdescriptor}]
[INFO] Writing abstract service descriptor <http://hudson.zones.apache.org/hudson/job/clerezza-trunk-1.6/ws/trunk-1.6/org.apache.clerezza.app.webguiexamples/target/scr-plugin-generated/OSGI-INF/scr-plugin/scrinfo.xml>
with 1 entries.
[INFO] Generating 1 Service Component Descriptors to <http://hudson.zones.apache.org/hudson/job/clerezza-trunk-1.6/ws/trunk-1.6/org.apache.clerezza.app.webguiexamples/target/scr-plugin-generated/OSGI-INF/serviceComponents.xml>
[INFO] [resources:testResources]
[INFO] Using 'utf-8' encoding to copy filtered resources.
[INFO] skip non existing resourceDirectory <http://hudson.zones.apache.org/hudson/job/clerezza-trunk-1.6/ws/trunk-1.6/org.apache.clerezza.app.webguiexamples/src/test/resources>
[INFO] [compiler:testCompile]
[INFO] No sources to compile
[INFO] [surefire:test]
[INFO] No tests to run.
[HUDSON] Recording test results[INFO] [bundle:bundle]

[INFO] Preparing source:jar
[WARNING] Removing: jar from forked lifecycle, to prevent recursive invocation.
[INFO] No goals needed for project - skipping
[INFO] [source:jar {execution: default}]
[INFO] Building jar: <http://hudson.zones.apache.org/hudson/job/clerezza-trunk-1.6/ws/trunk-1.6/org.apache.clerezza.app.webguiexamples/target/org.apache.clerezza.app.webguiexamples-0.2-incubating-SNAPSHOT-sources.jar>
[INFO] [install:install]
[INFO] Installing <http://hudson.zones.apache.org/hudson/job/clerezza-trunk-1.6/ws/trunk-1.6/org.apache.clerezza.app.webguiexamples/target/org.apache.clerezza.app.webguiexamples-0.2-incubating-SNAPSHOT.jar>
to /home/hudson/.m2/repository/org/apache/clerezza/org.apache.clerezza.app.webguiexamples/0.2-incubating-SNAPSHOT/org.apache.clerezza.app.webguiexamples-0.2-incubating-SNAPSHOT.jar
[INFO] Installing <http://hudson.zones.apache.org/hudson/job/clerezza-trunk-1.6/ws/trunk-1.6/org.apache.clerezza.app.webguiexamples/target/org.apache.clerezza.app.webguiexamples-0.2-incubating-SNAPSHOT-sources.jar>
to /home/hudson/.m2/repository/org/apache/clerezza/org.apache.clerezza.app.webguiexamples/0.2-incubating-SNAPSHOT/org.apache.clerezza.app.webguiexamples-0.2-incubating-SNAPSHOT-sources.jar
[INFO] [bundle:install]
[INFO] Parsing file:/home/hudson/.m2/repository/repository.xml
[Fatal Error] repository.xml:3:1: Premature end of file.
org.xml.sax.SAXParseException: Premature end of file.
	at com.sun.org.apache.xerces.internal.parsers.DOMParser.parse(DOMParser.java:239)
	at com.sun.org.apache.xerces.internal.jaxp.DocumentBuilderImpl.parse(DocumentBuilderImpl.java:283)
	at javax.xml.parsers.DocumentBuilder.parse(DocumentBuilder.java:208)
	at org.apache.felix.obrplugin.ObrUpdate.parseFile(ObrUpdate.java:347)
	at org.apache.felix.obrplugin.ObrUpdate.parseRepositoryXml(ObrUpdate.java:324)
	at org.apache.felix.obrplugin.ObrInstall.execute(ObrInstall.java:140)
	at org.apache.maven.plugin.DefaultPluginManager.executeMojo(DefaultPluginManager.java:451)
	at hudson.maven.agent.PluginManagerInterceptor.executeMojo(PluginManagerInterceptor.java:182)
	at org.apache.maven.lifecycle.DefaultLifecycleExecutor.executeGoals(DefaultLifecycleExecutor.java:558)
	at org.apache.maven.lifecycle.DefaultLifecycleExecutor.executeGoalWithLifecycle(DefaultLifecycleExecutor.java:499)
	at org.apache.maven.lifecycle.DefaultLifecycleExecutor.executeGoal(DefaultLifecycleExecutor.java:478)
	at org.apache.maven.lifecycle.DefaultLifecycleExecutor.executeGoalAndHandleFailures(DefaultLifecycleExecutor.java:330)
	at org.apache.maven.lifecycle.DefaultLifecycleExecutor.executeTaskSegments(DefaultLifecycleExecutor.java:291)
	at org.apache.maven.lifecycle.DefaultLifecycleExecutor.execute(DefaultLifecycleExecutor.java:142)
	at org.apache.maven.lifecycle.LifecycleExecutorInterceptor.execute(LifecycleExecutorInterceptor.java:65)
	at org.apache.maven.DefaultMaven.doExecute(DefaultMaven.java:336)
	at org.apache.maven.DefaultMaven.execute(DefaultMaven.java:129)
	at org.apache.maven.cli.MavenCli.main(MavenCli.java:287)
	at sun.reflect.NativeMethodAccessorImpl.invoke0(Native Method)
	at sun.reflect.NativeMethodAccessorImpl.invoke(NativeMethodAccessorImpl.java:39)
	at sun.reflect.DelegatingMethodAccessorImpl.invoke(DelegatingMethodAccessorImpl.java:25)
	at java.lang.reflect.Method.invoke(Method.java:597)
	at org.codehaus.classworlds.Launcher.launchEnhanced(Launcher.java:315)
	at org.codehaus.classworlds.Launcher.launch(Launcher.java:255)
	at hudson.maven.agent.Main.launch(Main.java:165)
	at hudson.maven.MavenBuilder.call(MavenBuilder.java:159)
	at hudson.maven.MavenModuleSetBuild$Builder.call(MavenModuleSetBuild.java:688)
	at hudson.maven.MavenModuleSetBuild$Builder.call(MavenModuleSetBuild.java:632)
	at hudson.remoting.UserRequest.perform(UserRequest.java:104)
	at hudson.remoting.UserRequest.perform(UserRequest.java:48)
	at hudson.remoting.Request$2.run(Request.java:236)
	at java.util.concurrent.Executors$RunnableAdapter.call(Executors.java:441)
	at java.util.concurrent.FutureTask$Sync.innerRun(FutureTask.java:303)
	at java.util.concurrent.FutureTask.run(FutureTask.java:138)
	at java.util.concurrent.ThreadPoolExecutor$Worker.runTask(ThreadPoolExecutor.java:886)
	at java.util.concurrent.ThreadPoolExecutor$Worker.run(ThreadPoolExecutor.java:908)
	at java.lang.Thread.run(Thread.java:619)
[INFO] Writing OBR metadata
[HUDSON] Archiving <http://hudson.zones.apache.org/hudson/job/clerezza-trunk-1.6/ws/trunk-1.6/org.apache.clerezza.app.webguiexamples/pom.xml>
to /export/home/hudson/hudson/jobs/clerezza-trunk-1.6/modules/org.apache.clerezza$org.apache.clerezza.app.webguiexamples/builds/2010-02-09_10-01-43/archive/org.apache.clerezza/org.apache.clerezza.app.webguiexamples/0.2-incubating-SNAPSHOT/pom.xml
[HUDSON] Archiving <http://hudson.zones.apache.org/hudson/job/clerezza-trunk-1.6/ws/trunk-1.6/org.apache.clerezza.app.webguiexamples/target/org.apache.clerezza.app.webguiexamples-0.2-incubating-SNAPSHOT.jar>
to /export/home/hudson/hudson/jobs/clerezza-trunk-1.6/modules/org.apache.clerezza$org.apache.clerezza.app.webguiexamples/builds/2010-02-09_10-01-43/archive/org.apache.clerezza/org.apache.clerezza.app.webguiexamples/0.2-incubating-SNAPSHOT/org.apache.clerezza.app.webguiexamples-0.2-incubating-SNAPSHOT.jar
[HUDSON] Archiving <http://hudson.zones.apache.org/hudson/job/clerezza-trunk-1.6/ws/trunk-1.6/org.apache.clerezza.app.webguiexamples/target/org.apache.clerezza.app.webguiexamples-0.2-incubating-SNAPSHOT-sources.jar>
to /export/home/hudson/hudson/jobs/clerezza-trunk-1.6/modules/org.apache.clerezza$org.apache.clerezza.app.webguiexamples/builds/2010-02-09_10-01-43/archive/org.apache.clerezza/org.apache.clerezza.app.webguiexamples/0.2-incubating-SNAPSHOT/org.apache.clerezza.app.webguiexamples-0.2-incubating-SNAPSHOT-sources.jar
[INFO] ------------------------------------------------------------------------
[INFO] Building Clerezza Ext - Jena OSGi Bundle
[INFO]    task-segment: [clean, install]
[INFO] ------------------------------------------------------------------------
[INFO] [clean:clean]
[INFO] Deleting file set: <http://hudson.zones.apache.org/hudson/job/clerezza-trunk-1.6/ws/trunk-1.6/org.apache.clerezza.ext.com.hp.hpl.jena/target>
(included: [**], excluded: [])
[INFO] [resources:resources]
[INFO] Using 'utf-8' encoding to copy filtered resources.
[INFO] Copying 0 resource to META-INF
[INFO] skip non existing resourceDirectory <http://hudson.zones.apache.org/hudson/job/clerezza-trunk-1.6/ws/trunk-1.6/org.apache.clerezza.ext.com.hp.hpl.jena/src/main/resources>
[INFO] [compiler:compile]
[INFO] No sources to compile
[INFO] [scr:scr {execution: generate-scr-scrdescriptor}]
[INFO] [resources:testResources]
[INFO] Using 'utf-8' encoding to copy filtered resources.
[INFO] skip non existing resourceDirectory <http://hudson.zones.apache.org/hudson/job/clerezza-trunk-1.6/ws/trunk-1.6/org.apache.clerezza.ext.com.hp.hpl.jena/src/test/resources>
[INFO] [compiler:testCompile]
[INFO] No sources to compile
[INFO] [surefire:test]
[INFO] No tests to run.
[HUDSON] Recording test results[INFO] [bundle:bundle]

[WARNING] Warning building bundle org.apache.clerezza.ext:com.hp.hpl.jena:bundle:0.6-incubating-SNAPSHOT
: Did not find matching referal for !antlr.parseview
[WARNING] Warning building bundle org.apache.clerezza.ext:com.hp.hpl.jena:bundle:0.6-incubating-SNAPSHOT
: Did not find matching referal for !com.hp.hpl.jena.graph.test
[WARNING] Warning building bundle org.apache.clerezza.ext:com.hp.hpl.jena:bundle:0.6-incubating-SNAPSHOT
: Did not find matching referal for !javax.mail.*
[WARNING] Warning building bundle org.apache.clerezza.ext:com.hp.hpl.jena:bundle:0.6-incubating-SNAPSHOT
: Did not find matching referal for !javax.xml.transform.stream
[WARNING] Warning building bundle org.apache.clerezza.ext:com.hp.hpl.jena:bundle:0.6-incubating-SNAPSHOT
: Did not find matching referal for !org.apache.avalon.*
[WARNING] Warning building bundle org.apache.clerezza.ext:com.hp.hpl.jena:bundle:0.6-incubating-SNAPSHOT
: Did not find matching referal for !org.apache.log
[WARNING] Warning building bundle org.apache.clerezza.ext:com.hp.hpl.jena:bundle:0.6-incubating-SNAPSHOT
: Did not find matching referal for !org.apache.xerces.impl.validation.*
[WARNING] Warning building bundle org.apache.clerezza.ext:com.hp.hpl.jena:bundle:0.6-incubating-SNAPSHOT
: Did not find matching referal for !org.w3c.dom.ls
[WARNING] Warning building bundle org.apache.clerezza.ext:com.hp.hpl.jena:bundle:0.6-incubating-SNAPSHOT
: Did not find matching referal for !org.xml.sax.*
[INFO] Preparing source:jar
[WARNING] Removing: jar from forked lifecycle, to prevent recursive invocation.
[INFO] No goals needed for project - skipping
[INFO] [source:jar {execution: default}]
[INFO] No sources in project. Archive not created.
[INFO] [install:install]
[INFO] Installing <http://hudson.zones.apache.org/hudson/job/clerezza-trunk-1.6/ws/trunk-1.6/org.apache.clerezza.ext.com.hp.hpl.jena/target/com.hp.hpl.jena-0.6-incubating-SNAPSHOT.jar>
to /home/hudson/.m2/repository/org/apache/clerezza/ext/com.hp.hpl.jena/0.6-incubating-SNAPSHOT/com.hp.hpl.jena-0.6-incubating-SNAPSHOT.jar
[INFO] [bundle:install]
[INFO] Parsing file:/home/hudson/.m2/repository/repository.xml
[Fatal Error] repository.xml:3:1: Premature end of file.
org.xml.sax.SAXParseException: Premature end of file.
	at com.sun.org.apache.xerces.internal.parsers.DOMParser.parse(DOMParser.java:239)
	at com.sun.org.apache.xerces.internal.jaxp.DocumentBuilderImpl.parse(DocumentBuilderImpl.java:283)
	at javax.xml.parsers.DocumentBuilder.parse(DocumentBuilder.java:208)
	at org.apache.felix.obrplugin.ObrUpdate.parseFile(ObrUpdate.java:347)
	at org.apache.felix.obrplugin.ObrUpdate.parseRepositoryXml(ObrUpdate.java:324)
	at org.apache.felix.obrplugin.ObrInstall.execute(ObrInstall.java:140)
	at org.apache.maven.plugin.DefaultPluginManager.executeMojo(DefaultPluginManager.java:451)
	at hudson.maven.agent.PluginManagerInterceptor.executeMojo(PluginManagerInterceptor.java:182)
	at org.apache.maven.lifecycle.DefaultLifecycleExecutor.executeGoals(DefaultLifecycleExecutor.java:558)
	at org.apache.maven.lifecycle.DefaultLifecycleExecutor.executeGoalWithLifecycle(DefaultLifecycleExecutor.java:499)
	at org.apache.maven.lifecycle.DefaultLifecycleExecutor.executeGoal(DefaultLifecycleExecutor.java:478)
	at org.apache.maven.lifecycle.DefaultLifecycleExecutor.executeGoalAndHandleFailures(DefaultLifecycleExecutor.java:330)
	at org.apache.maven.lifecycle.DefaultLifecycleExecutor.executeTaskSegments(DefaultLifecycleExecutor.java:291)
	at org.apache.maven.lifecycle.DefaultLifecycleExecutor.execute(DefaultLifecycleExecutor.java:142)
	at org.apache.maven.lifecycle.LifecycleExecutorInterceptor.execute(LifecycleExecutorInterceptor.java:65)
	at org.apache.maven.DefaultMaven.doExecute(DefaultMaven.java:336)
	at org.apache.maven.DefaultMaven.execute(DefaultMaven.java:129)
	at org.apache.maven.cli.MavenCli.main(MavenCli.java:287)
	at sun.reflect.NativeMethodAccessorImpl.invoke0(Native Method)
	at sun.reflect.NativeMethodAccessorImpl.invoke(NativeMethodAccessorImpl.java:39)
	at sun.reflect.DelegatingMethodAccessorImpl.invoke(DelegatingMethodAccessorImpl.java:25)
	at java.lang.reflect.Method.invoke(Method.java:597)
	at org.codehaus.classworlds.Launcher.launchEnhanced(Launcher.java:315)
	at org.codehaus.classworlds.Launcher.launch(Launcher.java:255)
	at hudson.maven.agent.Main.launch(Main.java:165)
	at hudson.maven.MavenBuilder.call(MavenBuilder.java:159)
	at hudson.maven.MavenModuleSetBuild$Builder.call(MavenModuleSetBuild.java:688)
	at hudson.maven.MavenModuleSetBuild$Builder.call(MavenModuleSetBuild.java:632)
	at hudson.remoting.UserRequest.perform(UserRequest.java:104)
	at hudson.remoting.UserRequest.perform(UserRequest.java:48)
	at hudson.remoting.Request$2.run(Request.java:236)
	at java.util.concurrent.Executors$RunnableAdapter.call(Executors.java:441)
	at java.util.concurrent.FutureTask$Sync.innerRun(FutureTask.java:303)
	at java.util.concurrent.FutureTask.run(FutureTask.java:138)
	at java.util.concurrent.ThreadPoolExecutor$Worker.runTask(ThreadPoolExecutor.java:886)
	at java.util.concurrent.ThreadPoolExecutor$Worker.run(ThreadPoolExecutor.java:908)
	at java.lang.Thread.run(Thread.java:619)
[INFO] Writing OBR metadata
[HUDSON] Archiving <http://hudson.zones.apache.org/hudson/job/clerezza-trunk-1.6/ws/trunk-1.6/org.apache.clerezza.ext.com.hp.hpl.jena/pom.xml>
to /export/home/hudson/hudson/jobs/clerezza-trunk-1.6/modules/org.apache.clerezza.ext$com.hp.hpl.jena/builds/2010-02-09_10-01-43/archive/org.apache.clerezza.ext/com.hp.hpl.jena/0.6-incubating-SNAPSHOT/pom.xml
[HUDSON] Archiving <http://hudson.zones.apache.org/hudson/job/clerezza-trunk-1.6/ws/trunk-1.6/org.apache.clerezza.ext.com.hp.hpl.jena/target/com.hp.hpl.jena-0.6-incubating-SNAPSHOT.jar>
to /export/home/hudson/hudson/jobs/clerezza-trunk-1.6/modules/org.apache.clerezza.ext$com.hp.hpl.jena/builds/2010-02-09_10-01-43/archive/org.apache.clerezza.ext/com.hp.hpl.jena/0.6-incubating-SNAPSHOT/com.hp.hpl.jena-0.6-incubating-SNAPSHOT.jar
[INFO] ------------------------------------------------------------------------
[INFO] Building Clerezza Ext - Jena TDB OSGi Bundle
[INFO]    task-segment: [clean, install]
[INFO] ------------------------------------------------------------------------
[INFO] [clean:clean]
[INFO] Deleting file set: <http://hudson.zones.apache.org/hudson/job/clerezza-trunk-1.6/ws/trunk-1.6/org.apache.clerezza.ext.com.hp.hpl.jena.tdb/target>
(included: [**], excluded: [])
[INFO] [resources:resources]
[INFO] Using 'utf-8' encoding to copy filtered resources.
[INFO] Copying 0 resource to META-INF
[INFO] skip non existing resourceDirectory <http://hudson.zones.apache.org/hudson/job/clerezza-trunk-1.6/ws/trunk-1.6/org.apache.clerezza.ext.com.hp.hpl.jena.tdb/src/main/resources>
[INFO] artifact log4j:log4j: checking for updates from sun
[INFO] artifact log4j:log4j: checking for updates from wymiwyg
[INFO] artifact log4j:log4j: checking for updates from aduna
[INFO] artifact log4j:log4j: checking for updates from ops4j
[INFO] artifact log4j:log4j: checking for updates from apache
[INFO] artifact log4j:log4j: checking for updates from clerezza-ext
[INFO] artifact log4j:log4j: checking for updates from jena
[INFO] artifact log4j:log4j: checking for updates from scala-tools.org
[INFO] artifact log4j:log4j: checking for updates from central
[WARNING] POM for 'javax.jms:jms:pom:1.1:compile' is invalid. It will be ignored for artifact
resolution. Reason: Not a v4.0.0 POM. for project javax.jms:jms at /home/hudson/.m2/repository/javax/jms/jms/1.1/jms-1.1.pom
[WARNING] POM for 'com.sun.jdmk:jmxtools:pom:1.2.1:compile' is invalid. It will be ignored
for artifact resolution. Reason: Not a v4.0.0 POM. for project com.sun.jdmk:jmxtools at /home/hudson/.m2/repository/com/sun/jdmk/jmxtools/1.2.1/jmxtools-1.2.1.pom
[WARNING] POM for 'com.sun.jmx:jmxri:pom:1.2.1:compile' is invalid. It will be ignored for
artifact resolution. Reason: Not a v4.0.0 POM. for project com.sun.jmx:jmxri at /home/hudson/.m2/repository/com/sun/jmx/jmxri/1.2.1/jmxri-1.2.1.pom
[INFO] [compiler:compile]
[INFO] No sources to compile
[WARNING] POM for 'javax.jms:jms:pom:1.1:compile' is invalid. It will be ignored for artifact
resolution. Reason: Not a v4.0.0 POM. for project javax.jms:jms at /home/hudson/.m2/repository/javax/jms/jms/1.1/jms-1.1.pom
[WARNING] POM for 'com.sun.jdmk:jmxtools:pom:1.2.1:compile' is invalid. It will be ignored
for artifact resolution. Reason: Not a v4.0.0 POM. for project com.sun.jdmk:jmxtools at /home/hudson/.m2/repository/com/sun/jdmk/jmxtools/1.2.1/jmxtools-1.2.1.pom
[WARNING] POM for 'com.sun.jmx:jmxri:pom:1.2.1:compile' is invalid. It will be ignored for
artifact resolution. Reason: Not a v4.0.0 POM. for project com.sun.jmx:jmxri at /home/hudson/.m2/repository/com/sun/jmx/jmxri/1.2.1/jmxri-1.2.1.pom
[INFO] [scr:scr {execution: generate-scr-scrdescriptor}]
[INFO] [resources:testResources]
[INFO] Using 'utf-8' encoding to copy filtered resources.
[INFO] skip non existing resourceDirectory <http://hudson.zones.apache.org/hudson/job/clerezza-trunk-1.6/ws/trunk-1.6/org.apache.clerezza.ext.com.hp.hpl.jena.tdb/src/test/resources>
[WARNING] POM for 'javax.jms:jms:pom:1.1:compile' is invalid. It will be ignored for artifact
resolution. Reason: Not a v4.0.0 POM. for project javax.jms:jms at /home/hudson/.m2/repository/javax/jms/jms/1.1/jms-1.1.pom
[WARNING] POM for 'com.sun.jdmk:jmxtools:pom:1.2.1:compile' is invalid. It will be ignored
for artifact resolution. Reason: Not a v4.0.0 POM. for project com.sun.jdmk:jmxtools at /home/hudson/.m2/repository/com/sun/jdmk/jmxtools/1.2.1/jmxtools-1.2.1.pom
[WARNING] POM for 'com.sun.jmx:jmxri:pom:1.2.1:compile' is invalid. It will be ignored for
artifact resolution. Reason: Not a v4.0.0 POM. for project com.sun.jmx:jmxri at /home/hudson/.m2/repository/com/sun/jmx/jmxri/1.2.1/jmxri-1.2.1.pom
[INFO] [compiler:testCompile]
[INFO] No sources to compile
[WARNING] POM for 'javax.jms:jms:pom:1.1:compile' is invalid. It will be ignored for artifact
resolution. Reason: Not a v4.0.0 POM. for project javax.jms:jms at /home/hudson/.m2/repository/javax/jms/jms/1.1/jms-1.1.pom
[WARNING] POM for 'com.sun.jdmk:jmxtools:pom:1.2.1:compile' is invalid. It will be ignored
for artifact resolution. Reason: Not a v4.0.0 POM. for project com.sun.jdmk:jmxtools at /home/hudson/.m2/repository/com/sun/jdmk/jmxtools/1.2.1/jmxtools-1.2.1.pom
[WARNING] POM for 'com.sun.jmx:jmxri:pom:1.2.1:compile' is invalid. It will be ignored for
artifact resolution. Reason: Not a v4.0.0 POM. for project com.sun.jmx:jmxri at /home/hudson/.m2/repository/com/sun/jmx/jmxri/1.2.1/jmxri-1.2.1.pom
[INFO] [surefire:test]
[INFO] No tests to run.
[HUDSON] Recording test results[WARNING] POM for 'javax.jms:jms:pom:1.1:compile' is invalid.
It will be ignored for artifact resolution. Reason: Not a v4.0.0 POM. for project javax.jms:jms
at /home/hudson/.m2/repository/javax/jms/jms/1.1/jms-1.1.pom
[WARNING] POM for 'com.sun.jdmk:jmxtools:pom:1.2.1:compile' is invalid. It will be ignored
for artifact resolution. Reason: Not a v4.0.0 POM. for project com.sun.jdmk:jmxtools at /home/hudson/.m2/repository/com/sun/jdmk/jmxtools/1.2.1/jmxtools-1.2.1.pom
[WARNING] POM for 'com.sun.jmx:jmxri:pom:1.2.1:compile' is invalid. It will be ignored for
artifact resolution. Reason: Not a v4.0.0 POM. for project com.sun.jmx:jmxri at /home/hudson/.m2/repository/com/sun/jmx/jmxri/1.2.1/jmxri-1.2.1.pom
[INFO] [bundle:bundle]

[HUDSON] Archiving <http://hudson.zones.apache.org/hudson/job/clerezza-trunk-1.6/ws/trunk-1.6/org.apache.clerezza.ext.com.hp.hpl.jena.tdb/pom.xml>
to /export/home/hudson/hudson/jobs/clerezza-trunk-1.6/modules/org.apache.clerezza.ext$com.hp.hpl.jena.tdb/builds/2010-02-09_10-01-43/archive/org.apache.clerezza.ext/com.hp.hpl.jena.tdb/0.3-incubating-SNAPSHOT/pom.xml
[INFO] ------------------------------------------------------------------------
[ERROR] BUILD ERROR
[INFO] ------------------------------------------------------------------------
[INFO] Error calculating classpath for project MavenProject: org.apache.clerezza.ext:com.hp.hpl.jena.tdb:0.3-incubating-SNAPSHOT
@ <http://hudson.zones.apache.org/hudson/job/clerezza-trunk-1.6/ws/trunk-1.6/org.apache.clerezza.ext.com.hp.hpl.jena.tdb/pom.xml>

Embedded error: error in opening zip file
[INFO] ------------------------------------------------------------------------
[INFO] For more information, run Maven with the -e switch
[INFO] ------------------------------------------------------------------------
[INFO] Total time: 3 minutes 47 seconds
[INFO] Finished at: Tue Feb 09 10:05:48 UTC 2010
[INFO] Final Memory: 87M/241M
[INFO] ------------------------------------------------------------------------
Waiting for Hudson to finish collecting data
Sending e-mails to: clerezza-dev@incubator.apache.org
channel stopped
[locks-and-latches] Releasing all the locks
[locks-and-latches] All the locks released


Mime
View raw message