incubator-clerezza-dev mailing list archives

Site index · List index
Message view « Date » · « Thread »
Top « Date » · « Thread »
From Apache Hudson Server <hud...@hudson.zones.apache.org>
Subject Build failed in Hudson: clerezza-trunk-1.6 #94
Date Wed, 10 Feb 2010 21:07:00 GMT
See <http://hudson.zones.apache.org/hudson/job/clerezza-trunk-1.6/94/>

------------------------------------------
[...truncated 1429 lines...]
[INFO] Using 'utf-8' encoding to copy filtered resources.
[INFO] skip non existing resourceDirectory <http://hudson.zones.apache.org/hudson/job/clerezza-trunk-1.6/ws/trunk-1.6/org.apache.clerezza.platform.typerendering.scalaserverpages/src/test/resources>
[INFO] [compiler:testCompile]
[INFO] No sources to compile
[INFO] [surefire:test]
[INFO] No tests to run.
[INFO] [bundle:bundle]
[HUDSON] Recording test results
[INFO] Preparing source:jar
[WARNING] Removing: jar from forked lifecycle, to prevent recursive invocation.
[INFO] No goals needed for project - skipping
[INFO] [source:jar {execution: default}]
[INFO] Building jar: <http://hudson.zones.apache.org/hudson/job/clerezza-trunk-1.6/ws/trunk-1.6/org.apache.clerezza.platform.typerendering.scalaserverpages/target/org.apache.clerezza.platform.typerendering.scalaserverpages-0.3-incubating-SNAPSHOT-sources.jar>
[INFO] [install:install]
[INFO] Installing <http://hudson.zones.apache.org/hudson/job/clerezza-trunk-1.6/ws/trunk-1.6/org.apache.clerezza.platform.typerendering.scalaserverpages/target/org.apache.clerezza.platform.typerendering.scalaserverpages-0.3-incubating-SNAPSHOT.jar>
to /home/hudson/.m2/repository/org/apache/clerezza/org.apache.clerezza.platform.typerendering.scalaserverpages/0.3-incubating-SNAPSHOT/org.apache.clerezza.platform.typerendering.scalaserverpages-0.3-incubating-SNAPSHOT.jar
[INFO] Installing <http://hudson.zones.apache.org/hudson/job/clerezza-trunk-1.6/ws/trunk-1.6/org.apache.clerezza.platform.typerendering.scalaserverpages/target/org.apache.clerezza.platform.typerendering.scalaserverpages-0.3-incubating-SNAPSHOT-sources.jar>
to /home/hudson/.m2/repository/org/apache/clerezza/org.apache.clerezza.platform.typerendering.scalaserverpages/0.3-incubating-SNAPSHOT/org.apache.clerezza.platform.typerendering.scalaserverpages-0.3-incubating-SNAPSHOT-sources.jar
[INFO] [bundle:install]
[INFO] Parsing file:/home/hudson/.m2/repository/repository.xml
[INFO] Installing org/apache/clerezza/org.apache.clerezza.platform.typerendering.scalaserverpages/0.3-incubating-SNAPSHOT/org.apache.clerezza.platform.typerendering.scalaserverpages-0.3-incubating-SNAPSHOT.jar
[INFO] Writing OBR metadata
[HUDSON] Archiving <http://hudson.zones.apache.org/hudson/job/clerezza-trunk-1.6/ws/trunk-1.6/org.apache.clerezza.platform.typerendering.scalaserverpages/pom.xml>
to /export/home/hudson/hudson/jobs/clerezza-trunk-1.6/modules/org.apache.clerezza$org.apache.clerezza.platform.typerendering.scalaserverpages/builds/2010-02-10_21-03-19/archive/org.apache.clerezza/org.apache.clerezza.platform.typerendering.scalaserverpages/0.3-incubating-SNAPSHOT/pom.xml
[HUDSON] Archiving <http://hudson.zones.apache.org/hudson/job/clerezza-trunk-1.6/ws/trunk-1.6/org.apache.clerezza.platform.typerendering.scalaserverpages/target/org.apache.clerezza.platform.typerendering.scalaserverpages-0.3-incubating-SNAPSHOT.jar>
to /export/home/hudson/hudson/jobs/clerezza-trunk-1.6/modules/org.apache.clerezza$org.apache.clerezza.platform.typerendering.scalaserverpages/builds/2010-02-10_21-03-19/archive/org.apache.clerezza/org.apache.clerezza.platform.typerendering.scalaserverpages/0.3-incubating-SNAPSHOT/org.apache.clerezza.platform.typerendering.scalaserverpages-0.3-incubating-SNAPSHOT.jar
[HUDSON] Archiving <http://hudson.zones.apache.org/hudson/job/clerezza-trunk-1.6/ws/trunk-1.6/org.apache.clerezza.platform.typerendering.scalaserverpages/target/org.apache.clerezza.platform.typerendering.scalaserverpages-0.3-incubating-SNAPSHOT-sources.jar>
to /export/home/hudson/hudson/jobs/clerezza-trunk-1.6/modules/org.apache.clerezza$org.apache.clerezza.platform.typerendering.scalaserverpages/builds/2010-02-10_21-03-19/archive/org.apache.clerezza/org.apache.clerezza.platform.typerendering.scalaserverpages/0.3-incubating-SNAPSHOT/org.apache.clerezza.platform.typerendering.scalaserverpages-0.3-incubating-SNAPSHOT-sources.jar
[INFO] ------------------------------------------------------------------------
[INFO] Building Clerezza - Parent for Web Applications
[INFO]    task-segment: [clean, install]
[INFO] ------------------------------------------------------------------------
[INFO] [clean:clean]
[INFO] [yuicompressor:compress {execution: default}]
[INFO] nb warnings: 0, nb errors: 0
[INFO] [scr:scr {execution: generate-scr-scrdescriptor}]
[INFO] [site:attach-descriptor]
[INFO] Preparing source:jar
[WARNING] Removing: jar from forked lifecycle, to prevent recursive invocation.
[INFO] No goals needed for project - skipping
[INFO] [source:jar {execution: default}]
[INFO] [install:install]
[INFO] Installing <http://hudson.zones.apache.org/hudson/job/clerezza-trunk-1.6/ws/trunk-1.6/org.apache.clerezza.webapp.parent/pom.xml>
to /home/hudson/.m2/repository/org/apache/clerezza/org.apache.clerezza.webapp.parent/0.2-incubating-SNAPSHOT/org.apache.clerezza.webapp.parent-0.2-incubating-SNAPSHOT.pom
[HUDSON] Archiving <http://hudson.zones.apache.org/hudson/job/clerezza-trunk-1.6/ws/trunk-1.6/org.apache.clerezza.webapp.parent/pom.xml>
to /export/home/hudson/hudson/jobs/clerezza-trunk-1.6/modules/org.apache.clerezza$org.apache.clerezza.webapp.parent/builds/2010-02-10_21-03-19/archive/org.apache.clerezza/org.apache.clerezza.webapp.parent/0.2-incubating-SNAPSHOT/pom.xml
[INFO] ------------------------------------------------------------------------
[INFO] Building Clerezza - Jax-Rs File Server
[INFO]    task-segment: [clean, install]
[INFO] ------------------------------------------------------------------------
[INFO] [clean:clean]
[INFO] Deleting file set: <http://hudson.zones.apache.org/hudson/job/clerezza-trunk-1.6/ws/trunk-1.6/org.apache.clerezza.webapp.parent/org.apache.clerezza.web.fileserver/target>
(included: [**], excluded: [])
[INFO] [resources:resources]
[INFO] Using 'utf-8' encoding to copy filtered resources.
[INFO] Copying 0 resource to META-INF
[INFO] Copying 1 resource
[INFO] [yuicompressor:compress {execution: default}]
[INFO] nb warnings: 0, nb errors: 0
[INFO] [compiler:compile]
[INFO] Compiling 5 source files to <http://hudson.zones.apache.org/hudson/job/clerezza-trunk-1.6/ws/trunk-1.6/org.apache.clerezza.webapp.parent/org.apache.clerezza.web.fileserver/target/classes>
[INFO] [scr:scr {execution: generate-scr-scrdescriptor}]
[INFO] Generating 2 MetaType Descriptors to <http://hudson.zones.apache.org/hudson/job/clerezza-trunk-1.6/ws/trunk-1.6/org.apache.clerezza.webapp.parent/org.apache.clerezza.web.fileserver/target/scr-plugin-generated/OSGI-INF/metatype/metatype.xml>
[INFO] Writing abstract service descriptor <http://hudson.zones.apache.org/hudson/job/clerezza-trunk-1.6/ws/trunk-1.6/org.apache.clerezza.webapp.parent/org.apache.clerezza.web.fileserver/target/scr-plugin-generated/OSGI-INF/scr-plugin/scrinfo.xml>
with 2 entries.
[INFO] Generating 2 Service Component Descriptors to <http://hudson.zones.apache.org/hudson/job/clerezza-trunk-1.6/ws/trunk-1.6/org.apache.clerezza.webapp.parent/org.apache.clerezza.web.fileserver/target/scr-plugin-generated/OSGI-INF/serviceComponents.xml>
[INFO] [resources:testResources]
[INFO] Using 'utf-8' encoding to copy filtered resources.
[INFO] Copying 1 resource
[INFO] [compiler:testCompile]
[INFO] Compiling 2 source files to <http://hudson.zones.apache.org/hudson/job/clerezza-trunk-1.6/ws/trunk-1.6/org.apache.clerezza.webapp.parent/org.apache.clerezza.web.fileserver/target/test-classes>
[INFO] [surefire:test]
[INFO] Surefire report directory: <http://hudson.zones.apache.org/hudson/job/clerezza-trunk-1.6/ws/trunk-1.6/org.apache.clerezza.webapp.parent/org.apache.clerezza.web.fileserver/target/surefire-reports>

-------------------------------------------------------
 T E S T S
-------------------------------------------------------
Running org.apache.clerezza.web.fileserver.util.TestMediaTypeGuesser
Tests run: 2, Failures: 0, Errors: 0, Skipped: 0, Time elapsed: 0.068 sec
Running org.apache.clerezza.web.fileserver.TestFileServer
Tests run: 1, Failures: 0, Errors: 0, Skipped: 0, Time elapsed: 0.009 sec

Results :

Tests run: 3, Failures: 0, Errors: 0, Skipped: 0

[HUDSON] Recording test results
[INFO] [bundle:bundle]
[INFO] Preparing source:jar
[WARNING] Removing: jar from forked lifecycle, to prevent recursive invocation.
[INFO] No goals needed for project - skipping
[INFO] [source:jar {execution: default}]
[INFO] Building jar: <http://hudson.zones.apache.org/hudson/job/clerezza-trunk-1.6/ws/trunk-1.6/org.apache.clerezza.webapp.parent/org.apache.clerezza.web.fileserver/target/org.apache.clerezza.web.fileserver-0.9-incubating-SNAPSHOT-sources.jar>
[INFO] [install:install]
[INFO] Installing <http://hudson.zones.apache.org/hudson/job/clerezza-trunk-1.6/ws/trunk-1.6/org.apache.clerezza.webapp.parent/org.apache.clerezza.web.fileserver/target/org.apache.clerezza.web.fileserver-0.9-incubating-SNAPSHOT.jar>
to /home/hudson/.m2/repository/org/apache/clerezza/org.apache.clerezza.web.fileserver/0.9-incubating-SNAPSHOT/org.apache.clerezza.web.fileserver-0.9-incubating-SNAPSHOT.jar
[INFO] Installing <http://hudson.zones.apache.org/hudson/job/clerezza-trunk-1.6/ws/trunk-1.6/org.apache.clerezza.webapp.parent/org.apache.clerezza.web.fileserver/target/org.apache.clerezza.web.fileserver-0.9-incubating-SNAPSHOT-sources.jar>
to /home/hudson/.m2/repository/org/apache/clerezza/org.apache.clerezza.web.fileserver/0.9-incubating-SNAPSHOT/org.apache.clerezza.web.fileserver-0.9-incubating-SNAPSHOT-sources.jar
[INFO] [bundle:install]
[INFO] Parsing file:/home/hudson/.m2/repository/repository.xml
[INFO] Installing org/apache/clerezza/org.apache.clerezza.web.fileserver/0.9-incubating-SNAPSHOT/org.apache.clerezza.web.fileserver-0.9-incubating-SNAPSHOT.jar
[INFO] Writing OBR metadata
[HUDSON] Archiving <http://hudson.zones.apache.org/hudson/job/clerezza-trunk-1.6/ws/trunk-1.6/org.apache.clerezza.webapp.parent/org.apache.clerezza.web.fileserver/pom.xml>
to /export/home/hudson/hudson/jobs/clerezza-trunk-1.6/modules/org.apache.clerezza$org.apache.clerezza.web.fileserver/builds/2010-02-10_21-03-19/archive/org.apache.clerezza/org.apache.clerezza.web.fileserver/0.9-incubating-SNAPSHOT/pom.xml
[HUDSON] Archiving <http://hudson.zones.apache.org/hudson/job/clerezza-trunk-1.6/ws/trunk-1.6/org.apache.clerezza.webapp.parent/org.apache.clerezza.web.fileserver/target/org.apache.clerezza.web.fileserver-0.9-incubating-SNAPSHOT.jar>
to /export/home/hudson/hudson/jobs/clerezza-trunk-1.6/modules/org.apache.clerezza$org.apache.clerezza.web.fileserver/builds/2010-02-10_21-03-19/archive/org.apache.clerezza/org.apache.clerezza.web.fileserver/0.9-incubating-SNAPSHOT/org.apache.clerezza.web.fileserver-0.9-incubating-SNAPSHOT.jar
[HUDSON] Archiving <http://hudson.zones.apache.org/hudson/job/clerezza-trunk-1.6/ws/trunk-1.6/org.apache.clerezza.webapp.parent/org.apache.clerezza.web.fileserver/target/org.apache.clerezza.web.fileserver-0.9-incubating-SNAPSHOT-sources.jar>
to /export/home/hudson/hudson/jobs/clerezza-trunk-1.6/modules/org.apache.clerezza$org.apache.clerezza.web.fileserver/builds/2010-02-10_21-03-19/archive/org.apache.clerezza/org.apache.clerezza.web.fileserver/0.9-incubating-SNAPSHOT/org.apache.clerezza.web.fileserver-0.9-incubating-SNAPSHOT-sources.jar
[INFO] ------------------------------------------------------------------------
[INFO] Building Clerezza - Web GUI Examples
[INFO]    task-segment: [clean, install]
[INFO] ------------------------------------------------------------------------
[INFO] [clean:clean]
[INFO] Deleting file set: <http://hudson.zones.apache.org/hudson/job/clerezza-trunk-1.6/ws/trunk-1.6/org.apache.clerezza.app.webguiexamples/target>
(included: [**], excluded: [])
[INFO] [resources:resources]
[INFO] Using 'utf-8' encoding to copy filtered resources.
[INFO] Copying 1 resource to META-INF
[INFO] Copying 16 resources
[INFO] snapshot org.apache.clerezza:org.apache.clerezza.platform.typerendering.scalaserverpages:0.3-incubating-SNAPSHOT:
checking for updates from ops4j
[INFO] snapshot org.apache.clerezza:org.apache.clerezza.platform.typerendering.scalaserverpages:0.3-incubating-SNAPSHOT:
checking for updates from apache
[INFO] snapshot org.apache.clerezza:org.apache.clerezza.web.fileserver:0.9-incubating-SNAPSHOT:
checking for updates from ops4j
[INFO] snapshot org.apache.clerezza:org.apache.clerezza.web.fileserver:0.9-incubating-SNAPSHOT:
checking for updates from apache
[INFO] [compiler:compile]
[INFO] Compiling 1 source file to <http://hudson.zones.apache.org/hudson/job/clerezza-trunk-1.6/ws/trunk-1.6/org.apache.clerezza.app.webguiexamples/target/classes>
[INFO] [scr:scr {execution: generate-scr-scrdescriptor}]
[INFO] Writing abstract service descriptor <http://hudson.zones.apache.org/hudson/job/clerezza-trunk-1.6/ws/trunk-1.6/org.apache.clerezza.app.webguiexamples/target/scr-plugin-generated/OSGI-INF/scr-plugin/scrinfo.xml>
with 1 entries.
[INFO] Generating 1 Service Component Descriptors to <http://hudson.zones.apache.org/hudson/job/clerezza-trunk-1.6/ws/trunk-1.6/org.apache.clerezza.app.webguiexamples/target/scr-plugin-generated/OSGI-INF/serviceComponents.xml>
[INFO] [resources:testResources]
[INFO] Using 'utf-8' encoding to copy filtered resources.
[INFO] skip non existing resourceDirectory <http://hudson.zones.apache.org/hudson/job/clerezza-trunk-1.6/ws/trunk-1.6/org.apache.clerezza.app.webguiexamples/src/test/resources>
[INFO] [compiler:testCompile]
[INFO] No sources to compile
[INFO] [surefire:test]
[INFO] No tests to run.
[INFO] [HUDSON] Recording test results[bundle:bundle]

[INFO] Preparing source:jar
[WARNING] Removing: jar from forked lifecycle, to prevent recursive invocation.
[INFO] No goals needed for project - skipping
[INFO] [source:jar {execution: default}]
[INFO] Building jar: <http://hudson.zones.apache.org/hudson/job/clerezza-trunk-1.6/ws/trunk-1.6/org.apache.clerezza.app.webguiexamples/target/org.apache.clerezza.app.webguiexamples-0.2-incubating-SNAPSHOT-sources.jar>
[INFO] [install:install]
[INFO] Installing <http://hudson.zones.apache.org/hudson/job/clerezza-trunk-1.6/ws/trunk-1.6/org.apache.clerezza.app.webguiexamples/target/org.apache.clerezza.app.webguiexamples-0.2-incubating-SNAPSHOT.jar>
to /home/hudson/.m2/repository/org/apache/clerezza/org.apache.clerezza.app.webguiexamples/0.2-incubating-SNAPSHOT/org.apache.clerezza.app.webguiexamples-0.2-incubating-SNAPSHOT.jar
[INFO] Installing <http://hudson.zones.apache.org/hudson/job/clerezza-trunk-1.6/ws/trunk-1.6/org.apache.clerezza.app.webguiexamples/target/org.apache.clerezza.app.webguiexamples-0.2-incubating-SNAPSHOT-sources.jar>
to /home/hudson/.m2/repository/org/apache/clerezza/org.apache.clerezza.app.webguiexamples/0.2-incubating-SNAPSHOT/org.apache.clerezza.app.webguiexamples-0.2-incubating-SNAPSHOT-sources.jar
[INFO] [bundle:install]
[INFO] Parsing file:/home/hudson/.m2/repository/repository.xml
[INFO] Installing org/apache/clerezza/org.apache.clerezza.app.webguiexamples/0.2-incubating-SNAPSHOT/org.apache.clerezza.app.webguiexamples-0.2-incubating-SNAPSHOT.jar
[INFO] Writing OBR metadata
[HUDSON] Archiving <http://hudson.zones.apache.org/hudson/job/clerezza-trunk-1.6/ws/trunk-1.6/org.apache.clerezza.app.webguiexamples/pom.xml>
to /export/home/hudson/hudson/jobs/clerezza-trunk-1.6/modules/org.apache.clerezza$org.apache.clerezza.app.webguiexamples/builds/2010-02-10_21-03-19/archive/org.apache.clerezza/org.apache.clerezza.app.webguiexamples/0.2-incubating-SNAPSHOT/pom.xml
[HUDSON] Archiving <http://hudson.zones.apache.org/hudson/job/clerezza-trunk-1.6/ws/trunk-1.6/org.apache.clerezza.app.webguiexamples/target/org.apache.clerezza.app.webguiexamples-0.2-incubating-SNAPSHOT.jar>
to /export/home/hudson/hudson/jobs/clerezza-trunk-1.6/modules/org.apache.clerezza$org.apache.clerezza.app.webguiexamples/builds/2010-02-10_21-03-19/archive/org.apache.clerezza/org.apache.clerezza.app.webguiexamples/0.2-incubating-SNAPSHOT/org.apache.clerezza.app.webguiexamples-0.2-incubating-SNAPSHOT.jar
[HUDSON] Archiving <http://hudson.zones.apache.org/hudson/job/clerezza-trunk-1.6/ws/trunk-1.6/org.apache.clerezza.app.webguiexamples/target/org.apache.clerezza.app.webguiexamples-0.2-incubating-SNAPSHOT-sources.jar>
to /export/home/hudson/hudson/jobs/clerezza-trunk-1.6/modules/org.apache.clerezza$org.apache.clerezza.app.webguiexamples/builds/2010-02-10_21-03-19/archive/org.apache.clerezza/org.apache.clerezza.app.webguiexamples/0.2-incubating-SNAPSHOT/org.apache.clerezza.app.webguiexamples-0.2-incubating-SNAPSHOT-sources.jar
[INFO] ------------------------------------------------------------------------
[INFO] Building Clerezza Ext - Jena OSGi Bundle
[INFO]    task-segment: [clean, install]
[INFO] ------------------------------------------------------------------------
[INFO] [clean:clean]
[INFO] Deleting file set: <http://hudson.zones.apache.org/hudson/job/clerezza-trunk-1.6/ws/trunk-1.6/org.apache.clerezza.ext.com.hp.hpl.jena/target>
(included: [**], excluded: [])
[INFO] [resources:resources]
[INFO] Using 'utf-8' encoding to copy filtered resources.
[INFO] Copying 0 resource to META-INF
[INFO] skip non existing resourceDirectory <http://hudson.zones.apache.org/hudson/job/clerezza-trunk-1.6/ws/trunk-1.6/org.apache.clerezza.ext.com.hp.hpl.jena/src/main/resources>
[INFO] [compiler:compile]
[INFO] No sources to compile
[INFO] [scr:scr {execution: generate-scr-scrdescriptor}]
[INFO] [resources:testResources]
[INFO] Using 'utf-8' encoding to copy filtered resources.
[INFO] skip non existing resourceDirectory <http://hudson.zones.apache.org/hudson/job/clerezza-trunk-1.6/ws/trunk-1.6/org.apache.clerezza.ext.com.hp.hpl.jena/src/test/resources>
[INFO] [compiler:testCompile]
[INFO] No sources to compile
[INFO] [surefire:test]
[INFO] No tests to run.
[INFO] [HUDSON] Recording test results[bundle:bundle]

[WARNING] Warning building bundle org.apache.clerezza.ext:com.hp.hpl.jena:bundle:0.6-incubating-SNAPSHOT
: Did not find matching referal for !antlr.parseview
[WARNING] Warning building bundle org.apache.clerezza.ext:com.hp.hpl.jena:bundle:0.6-incubating-SNAPSHOT
: Did not find matching referal for !com.hp.hpl.jena.graph.test
[WARNING] Warning building bundle org.apache.clerezza.ext:com.hp.hpl.jena:bundle:0.6-incubating-SNAPSHOT
: Did not find matching referal for !javax.mail.*
[WARNING] Warning building bundle org.apache.clerezza.ext:com.hp.hpl.jena:bundle:0.6-incubating-SNAPSHOT
: Did not find matching referal for !javax.xml.transform.stream
[WARNING] Warning building bundle org.apache.clerezza.ext:com.hp.hpl.jena:bundle:0.6-incubating-SNAPSHOT
: Did not find matching referal for !org.apache.avalon.*
[WARNING] Warning building bundle org.apache.clerezza.ext:com.hp.hpl.jena:bundle:0.6-incubating-SNAPSHOT
: Did not find matching referal for !org.apache.log
[WARNING] Warning building bundle org.apache.clerezza.ext:com.hp.hpl.jena:bundle:0.6-incubating-SNAPSHOT
: Did not find matching referal for !org.apache.xerces.impl.validation.*
[WARNING] Warning building bundle org.apache.clerezza.ext:com.hp.hpl.jena:bundle:0.6-incubating-SNAPSHOT
: Did not find matching referal for !org.w3c.dom.ls
[WARNING] Warning building bundle org.apache.clerezza.ext:com.hp.hpl.jena:bundle:0.6-incubating-SNAPSHOT
: Did not find matching referal for !org.xml.sax.*
[INFO] Preparing source:jar
[WARNING] Removing: jar from forked lifecycle, to prevent recursive invocation.
[INFO] No goals needed for project - skipping
[INFO] [source:jar {execution: default}]
[INFO] No sources in project. Archive not created.
[INFO] [install:install]
[INFO] Installing <http://hudson.zones.apache.org/hudson/job/clerezza-trunk-1.6/ws/trunk-1.6/org.apache.clerezza.ext.com.hp.hpl.jena/target/com.hp.hpl.jena-0.6-incubating-SNAPSHOT.jar>
to /home/hudson/.m2/repository/org/apache/clerezza/ext/com.hp.hpl.jena/0.6-incubating-SNAPSHOT/com.hp.hpl.jena-0.6-incubating-SNAPSHOT.jar
[INFO] [bundle:install]
[INFO] Parsing file:/home/hudson/.m2/repository/repository.xml
[INFO] Installing org/apache/clerezza/ext/com.hp.hpl.jena/0.6-incubating-SNAPSHOT/com.hp.hpl.jena-0.6-incubating-SNAPSHOT.jar
[INFO] Writing OBR metadata
[HUDSON] Archiving <http://hudson.zones.apache.org/hudson/job/clerezza-trunk-1.6/ws/trunk-1.6/org.apache.clerezza.ext.com.hp.hpl.jena/pom.xml>
to /export/home/hudson/hudson/jobs/clerezza-trunk-1.6/modules/org.apache.clerezza.ext$com.hp.hpl.jena/builds/2010-02-10_21-03-19/archive/org.apache.clerezza.ext/com.hp.hpl.jena/0.6-incubating-SNAPSHOT/pom.xml
[HUDSON] Archiving <http://hudson.zones.apache.org/hudson/job/clerezza-trunk-1.6/ws/trunk-1.6/org.apache.clerezza.ext.com.hp.hpl.jena/target/com.hp.hpl.jena-0.6-incubating-SNAPSHOT.jar>
to /export/home/hudson/hudson/jobs/clerezza-trunk-1.6/modules/org.apache.clerezza.ext$com.hp.hpl.jena/builds/2010-02-10_21-03-19/archive/org.apache.clerezza.ext/com.hp.hpl.jena/0.6-incubating-SNAPSHOT/com.hp.hpl.jena-0.6-incubating-SNAPSHOT.jar
[INFO] ------------------------------------------------------------------------
[INFO] Building Clerezza Ext - Jena TDB OSGi Bundle
[INFO]    task-segment: [clean, install]
[INFO] ------------------------------------------------------------------------
[INFO] [clean:clean]
[INFO] Deleting file set: <http://hudson.zones.apache.org/hudson/job/clerezza-trunk-1.6/ws/trunk-1.6/org.apache.clerezza.ext.com.hp.hpl.jena.tdb/target>
(included: [**], excluded: [])
[INFO] [resources:resources]
[INFO] Using 'utf-8' encoding to copy filtered resources.
[INFO] Copying 0 resource to META-INF
[INFO] skip non existing resourceDirectory <http://hudson.zones.apache.org/hudson/job/clerezza-trunk-1.6/ws/trunk-1.6/org.apache.clerezza.ext.com.hp.hpl.jena.tdb/src/main/resources>
Downloading: http://repository.ops4j.org/mvn-snapshots//javax/jms/jms/1.1/jms-1.1.pom
Downloading: http://repository.apache.org/content/groups/snapshots-group/javax/jms/jms/1.1/jms-1.1.pom
Downloading: http://repo1.maven.org/maven2/javax/jms/jms/1.1/jms-1.1.pom
[WARNING] POM for 'com.sun.jdmk:jmxtools:pom:1.2.1:compile' is invalid. It will be ignored
for artifact resolution. Reason: Not a v4.0.0 POM. for project com.sun.jdmk:jmxtools at /home/hudson/.m2/repository/com/sun/jdmk/jmxtools/1.2.1/jmxtools-1.2.1.pom
Downloading: http://repository.ops4j.org/mvn-snapshots//com/sun/jmx/jmxri/1.2.1/jmxri-1.2.1.pom
Downloading: http://repository.apache.org/content/groups/snapshots-group/com/sun/jmx/jmxri/1.2.1/jmxri-1.2.1.pom
Downloading: http://repo1.maven.org/maven2/com/sun/jmx/jmxri/1.2.1/jmxri-1.2.1.pom
Downloading: http://repository.ops4j.org/mvn-snapshots//javax/jms/jms/1.1/jms-1.1.jar
Downloading: http://repository.apache.org/content/groups/snapshots-group/javax/jms/jms/1.1/jms-1.1.jar
Downloading: https://maven-repository.dev.java.net/nonav/repository/javax.jms/jars/jms-1.1.jar
347b downloaded
[WARNING] *** CHECKSUM FAILED - Checksum failed on download: local = 'd0b7ce08d257e8fefdc6ad0f0f0368635bbeb3d0';
remote = '<!DOCTYPE' - RETRYING
Downloading: https://maven-repository.dev.java.net/nonav/repository/javax.jms/jars/jms-1.1.jar
347b downloaded
[WARNING] *** CHECKSUM FAILED - Checksum failed on download: local = 'd0b7ce08d257e8fefdc6ad0f0f0368635bbeb3d0';
remote = '<!DOCTYPE' - IGNORING
Downloading: http://repository.ops4j.org/mvn-snapshots//com/sun/jmx/jmxri/1.2.1/jmxri-1.2.1.jar
Downloading: http://repository.apache.org/content/groups/snapshots-group/com/sun/jmx/jmxri/1.2.1/jmxri-1.2.1.jar
Downloading: https://maven-repository.dev.java.net/nonav/repository/com.sun.jmx/jars/jmxri-1.2.1.jar
353b downloaded
[WARNING] *** CHECKSUM FAILED - Checksum failed on download: local = 'a55ce8e95c9bb027e78557acc9e2b973fe3c611e';
remote = '<!DOCTYPE' - RETRYING
Downloading: https://maven-repository.dev.java.net/nonav/repository/com.sun.jmx/jars/jmxri-1.2.1.jar
353b downloaded
[WARNING] *** CHECKSUM FAILED - Checksum failed on download: local = 'a55ce8e95c9bb027e78557acc9e2b973fe3c611e';
remote = '<!DOCTYPE' - IGNORING
[INFO] [compiler:compile]
[INFO] No sources to compile
[WARNING] POM for 'com.sun.jdmk:jmxtools:pom:1.2.1:compile' is invalid. It will be ignored
for artifact resolution. Reason: Not a v4.0.0 POM. for project com.sun.jdmk:jmxtools at /home/hudson/.m2/repository/com/sun/jdmk/jmxtools/1.2.1/jmxtools-1.2.1.pom
[INFO] [scr:scr {execution: generate-scr-scrdescriptor}]
[INFO] [resources:testResources]
[INFO] Using 'utf-8' encoding to copy filtered resources.
[INFO] skip non existing resourceDirectory <http://hudson.zones.apache.org/hudson/job/clerezza-trunk-1.6/ws/trunk-1.6/org.apache.clerezza.ext.com.hp.hpl.jena.tdb/src/test/resources>
[WARNING] POM for 'com.sun.jdmk:jmxtools:pom:1.2.1:compile' is invalid. It will be ignored
for artifact resolution. Reason: Not a v4.0.0 POM. for project com.sun.jdmk:jmxtools at /home/hudson/.m2/repository/com/sun/jdmk/jmxtools/1.2.1/jmxtools-1.2.1.pom
[INFO] [compiler:testCompile]
[INFO] No sources to compile
[WARNING] POM for 'com.sun.jdmk:jmxtools:pom:1.2.1:compile' is invalid. It will be ignored
for artifact resolution. Reason: Not a v4.0.0 POM. for project com.sun.jdmk:jmxtools at /home/hudson/.m2/repository/com/sun/jdmk/jmxtools/1.2.1/jmxtools-1.2.1.pom
[INFO] [surefire:test]
[INFO] No tests to run.
[WARNING] POM for 'com.sun.jdmk:jmxtools:pom:1.2.1:compile' is invalid. It will be ignored
for artifact resolution. Reason: Not a v4.0.0 POM. for project com.sun.jdmk:jmxtools at /home/hudson/.m2/repository/com/sun/jdmk/jmxtools/1.2.1/jmxtools-1.2.1.pom
[HUDSON] Recording test results[INFO] [bundle:bundle]

[HUDSON] Archiving <http://hudson.zones.apache.org/hudson/job/clerezza-trunk-1.6/ws/trunk-1.6/org.apache.clerezza.ext.com.hp.hpl.jena.tdb/pom.xml>
to /export/home/hudson/hudson/jobs/clerezza-trunk-1.6/modules/org.apache.clerezza.ext$com.hp.hpl.jena.tdb/builds/2010-02-10_21-03-19/archive/org.apache.clerezza.ext/com.hp.hpl.jena.tdb/0.3-incubating-SNAPSHOT/pom.xml
[INFO] ------------------------------------------------------------------------
[ERROR] BUILD ERROR
[INFO] ------------------------------------------------------------------------
[INFO] Error calculating classpath for project MavenProject: org.apache.clerezza.ext:com.hp.hpl.jena.tdb:0.3-incubating-SNAPSHOT
@ <http://hudson.zones.apache.org/hudson/job/clerezza-trunk-1.6/ws/trunk-1.6/org.apache.clerezza.ext.com.hp.hpl.jena.tdb/pom.xml>

Embedded error: error in opening zip file
[INFO] ------------------------------------------------------------------------
[INFO] For more information, run Maven with the -e switch
[INFO] ------------------------------------------------------------------------
[INFO] Total time: 3 minutes 6 seconds
[INFO] Finished at: Wed Feb 10 21:06:43 UTC 2010
[INFO] Final Memory: 83M/212M
[INFO] ------------------------------------------------------------------------
Waiting for Hudson to finish collecting data
Sending e-mails to: clerezza-dev@incubator.apache.org
channel stopped
[locks-and-latches] Releasing all the locks
[locks-and-latches] All the locks released


Mime
View raw message