incubator-clerezza-dev mailing list archives

Site index · List index
Message view « Date » · « Thread »
Top « Date » · « Thread »
From Reto Bachmann-Gmuer <r...@apache.org>
Subject Re: Build failed in Hudson: clerezza-trunk-1.6 #26
Date Tue, 05 Jan 2010 11:11:03 GMT
Wondering why these artifacts are missing, did the local repository get
wiped?

Having the snapshots deployed to a repo would probably solve this as well.
Should I add a subtask to CLEREZZA-1?

Cheers,
reto

On Tue, Jan 5, 2010 at 12:02 PM, Apache Hudson Server <
hudson@hudson.zones.apache.org> wrote:

> See <
> http://hudson.zones.apache.org/hudson/job/clerezza-trunk-1.6/26/changes>
>
> Changes:
>
> [reto] more comprehensive error message with stack trace
>
> ------------------------------------------
> [...truncated 4091 lines...]
> [INFO] Unable to find resource
> 'org.apache.clerezza.ext:com.ibm.icu:jar:0.5-incubating-SNAPSHOT' in
> repository trialox-plugin-snapshot (http://repo.trialox.org/snapshot)
> Downloading:
> http://repository.ops4j.org/mvn-snapshots//org/apache/clerezza/ext/com.ibm.icu/0.5-incubating-SNAPSHOT/com.ibm.icu-0.5-incubating-SNAPSHOT.jar
> [INFO] Unable to find resource
> 'org.apache.clerezza.ext:com.ibm.icu:jar:0.5-incubating-SNAPSHOT' in
> repository ops4j-plugin-snapshot (
> http://repository.ops4j.org/mvn-snapshots/)
> Downloading:
> http://repository.apache.org/content/groups/snapshots-group/org/apache/clerezza/ext/com.ibm.icu/0.5-incubating-SNAPSHOT/com.ibm.icu-0.5-incubating-SNAPSHOT.jar
> [INFO] Unable to find resource
> 'org.apache.clerezza.ext:com.ibm.icu:jar:0.5-incubating-SNAPSHOT' in
> repository apache-plugin-snapshot (
> http://repository.apache.org/content/groups/snapshots-group)
> Downloading:
> http://download.java.net/maven/2//org/apache/clerezza/ext/com.ibm.icu/0.5-incubating-SNAPSHOT/com.ibm.icu-0.5-incubating-SNAPSHOT.jar
> [INFO] Unable to find resource
> 'org.apache.clerezza.ext:com.ibm.icu:jar:0.5-incubating-SNAPSHOT' in
> repository sun (http://download.java.net/maven/2/)
> Downloading:
> http://wymiwyg.berlios.de/maven2//org/apache/clerezza/ext/com.ibm.icu/0.5-incubating-SNAPSHOT/com.ibm.icu-0.5-incubating-SNAPSHOT.jar
> [INFO] Unable to find resource
> 'org.apache.clerezza.ext:com.ibm.icu:jar:0.5-incubating-SNAPSHOT' in
> repository wymiwyg (http://wymiwyg.berlios.de/maven2/)
> Downloading:
> http://repo.aduna-software.org/maven2/releases/org/apache/clerezza/ext/com.ibm.icu/0.5-incubating-SNAPSHOT/com.ibm.icu-0.5-incubating-SNAPSHOT.jar
> [INFO] Unable to find resource
> 'org.apache.clerezza.ext:com.ibm.icu:jar:0.5-incubating-SNAPSHOT' in
> repository aduna (http://repo.aduna-software.org/maven2/releases)
> Downloading:
> http://repository.ops4j.org/mvn-snapshots//org/apache/clerezza/ext/com.ibm.icu/0.5-incubating-SNAPSHOT/com.ibm.icu-0.5-incubating-SNAPSHOT.jar
> [INFO] Unable to find resource
> 'org.apache.clerezza.ext:com.ibm.icu:jar:0.5-incubating-SNAPSHOT' in
> repository ops4j (http://repository.ops4j.org/mvn-snapshots/)
> Downloading:
> http://repository.apache.org/content/groups/snapshots-group/org/apache/clerezza/ext/com.ibm.icu/0.5-incubating-SNAPSHOT/com.ibm.icu-0.5-incubating-SNAPSHOT.jar
> [INFO] Unable to find resource
> 'org.apache.clerezza.ext:com.ibm.icu:jar:0.5-incubating-SNAPSHOT' in
> repository apache (
> http://repository.apache.org/content/groups/snapshots-group)
> Downloading:
> http://repo.trialox.org/ext/org/apache/clerezza/ext/com.ibm.icu/0.5-incubating-SNAPSHOT/com.ibm.icu-0.5-incubating-SNAPSHOT.jar
> [INFO] Unable to find resource
> 'org.apache.clerezza.ext:com.ibm.icu:jar:0.5-incubating-SNAPSHOT' in
> repository clerezza-ext (http://repo.trialox.org/ext)
> Downloading:
> http://openjena.org/repo//org/apache/clerezza/ext/com.ibm.icu/0.5-incubating-SNAPSHOT/com.ibm.icu-0.5-incubating-SNAPSHOT.jar
> [INFO] Unable to find resource
> 'org.apache.clerezza.ext:com.ibm.icu:jar:0.5-incubating-SNAPSHOT' in
> repository jena (http://openjena.org/repo/)
> Downloading:
> http://scala-tools.org/repo-releases/org/apache/clerezza/ext/com.ibm.icu/0.5-incubating-SNAPSHOT/com.ibm.icu-0.5-incubating-SNAPSHOT.jar
> [INFO] Unable to find resource
> 'org.apache.clerezza.ext:com.ibm.icu:jar:0.5-incubating-SNAPSHOT' in
> repository scala-tools.org (http://scala-tools.org/repo-releases)
> [WARNING] *** CHECKSUM FAILED - Checksum failed on download: local =
> '448ec9d30e0e022baa2d65c4f6fa59cba4b568ee'; remote = '<!DOCTYPE' - RETRYING
> [WARNING] *** CHECKSUM FAILED - Checksum failed on download: local =
> '448ec9d30e0e022baa2d65c4f6fa59cba4b568ee'; remote = '<!DOCTYPE' - IGNORING
> [ERROR] Unable to connect to:
> https://maven-repository.dev.java.net/nonav/repository
> [WARNING] *** CHECKSUM FAILED - Checksum failed on download: local =
> '448ec9d30e0e022baa2d65c4f6fa59cba4b568ee'; remote = '<!DOCTYPE' - RETRYING
> [WARNING] *** CHECKSUM FAILED - Checksum failed on download: local =
> '448ec9d30e0e022baa2d65c4f6fa59cba4b568ee'; remote = '<!DOCTYPE' - IGNORING
> [ERROR] Unable to connect to:
> https://maven-repository.dev.java.net/nonav/repository
> [ERROR] Unable to determine if resource
> org.apache.clerezza.ext:com.ibm.icu:jar:0.5-incubating-SNAPSHOT:provided
> exists in https://maven-repository.dev.java.net/nonav/repository
> Downloading:
> http://scala-tools.org/repo-releases/org/apache/clerezza/ext/javax.mail/0.4-incubating-SNAPSHOT/javax.mail-0.4-incubating-SNAPSHOT.jar
> [INFO] Unable to find resource
> 'org.apache.clerezza.ext:javax.mail:jar:0.4-incubating-SNAPSHOT' in
> repository scala-tools.org (http://scala-tools.org/repo-releases)
> Downloading:
> http://repo.trialox.org/release/org/apache/clerezza/ext/javax.mail/0.4-incubating-SNAPSHOT/javax.mail-0.4-incubating-SNAPSHOT.jar
> [INFO] Unable to find resource
> 'org.apache.clerezza.ext:javax.mail:jar:0.4-incubating-SNAPSHOT' in
> repository trialox-plugin-release (http://repo.trialox.org/release)
> Downloading:
> http://repo.trialox.org/snapshot/org/apache/clerezza/ext/javax.mail/0.4-incubating-SNAPSHOT/javax.mail-0.4-incubating-SNAPSHOT.jar
> [INFO] Unable to find resource
> 'org.apache.clerezza.ext:javax.mail:jar:0.4-incubating-SNAPSHOT' in
> repository trialox-plugin-snapshot (http://repo.trialox.org/snapshot)
> Downloading:
> http://repository.ops4j.org/mvn-snapshots//org/apache/clerezza/ext/javax.mail/0.4-incubating-SNAPSHOT/javax.mail-0.4-incubating-SNAPSHOT.jar
> [INFO] Unable to find resource
> 'org.apache.clerezza.ext:javax.mail:jar:0.4-incubating-SNAPSHOT' in
> repository ops4j-plugin-snapshot (
> http://repository.ops4j.org/mvn-snapshots/)
> Downloading:
> http://repository.apache.org/content/groups/snapshots-group/org/apache/clerezza/ext/javax.mail/0.4-incubating-SNAPSHOT/javax.mail-0.4-incubating-SNAPSHOT.jar
> [INFO] Unable to find resource
> 'org.apache.clerezza.ext:javax.mail:jar:0.4-incubating-SNAPSHOT' in
> repository apache-plugin-snapshot (
> http://repository.apache.org/content/groups/snapshots-group)
> Downloading:
> http://download.java.net/maven/2//org/apache/clerezza/ext/javax.mail/0.4-incubating-SNAPSHOT/javax.mail-0.4-incubating-SNAPSHOT.jar
> [INFO] Unable to find resource
> 'org.apache.clerezza.ext:javax.mail:jar:0.4-incubating-SNAPSHOT' in
> repository sun (http://download.java.net/maven/2/)
> Downloading:
> http://wymiwyg.berlios.de/maven2//org/apache/clerezza/ext/javax.mail/0.4-incubating-SNAPSHOT/javax.mail-0.4-incubating-SNAPSHOT.jar
> [INFO] Unable to find resource
> 'org.apache.clerezza.ext:javax.mail:jar:0.4-incubating-SNAPSHOT' in
> repository wymiwyg (http://wymiwyg.berlios.de/maven2/)
> Downloading:
> http://repo.aduna-software.org/maven2/releases/org/apache/clerezza/ext/javax.mail/0.4-incubating-SNAPSHOT/javax.mail-0.4-incubating-SNAPSHOT.jar
> [INFO] Unable to find resource
> 'org.apache.clerezza.ext:javax.mail:jar:0.4-incubating-SNAPSHOT' in
> repository aduna (http://repo.aduna-software.org/maven2/releases)
> Downloading:
> http://repository.ops4j.org/mvn-snapshots//org/apache/clerezza/ext/javax.mail/0.4-incubating-SNAPSHOT/javax.mail-0.4-incubating-SNAPSHOT.jar
> [INFO] Unable to find resource
> 'org.apache.clerezza.ext:javax.mail:jar:0.4-incubating-SNAPSHOT' in
> repository ops4j (http://repository.ops4j.org/mvn-snapshots/)
> Downloading:
> http://repository.apache.org/content/groups/snapshots-group/org/apache/clerezza/ext/javax.mail/0.4-incubating-SNAPSHOT/javax.mail-0.4-incubating-SNAPSHOT.jar
> [INFO] Unable to find resource
> 'org.apache.clerezza.ext:javax.mail:jar:0.4-incubating-SNAPSHOT' in
> repository apache (
> http://repository.apache.org/content/groups/snapshots-group)
> Downloading:
> http://repo.trialox.org/ext/org/apache/clerezza/ext/javax.mail/0.4-incubating-SNAPSHOT/javax.mail-0.4-incubating-SNAPSHOT.jar
> [INFO] Unable to find resource
> 'org.apache.clerezza.ext:javax.mail:jar:0.4-incubating-SNAPSHOT' in
> repository clerezza-ext (http://repo.trialox.org/ext)
> Downloading:
> http://openjena.org/repo//org/apache/clerezza/ext/javax.mail/0.4-incubating-SNAPSHOT/javax.mail-0.4-incubating-SNAPSHOT.jar
> [INFO] Unable to find resource
> 'org.apache.clerezza.ext:javax.mail:jar:0.4-incubating-SNAPSHOT' in
> repository jena (http://openjena.org/repo/)
> Downloading:
> http://scala-tools.org/repo-releases/org/apache/clerezza/ext/javax.mail/0.4-incubating-SNAPSHOT/javax.mail-0.4-incubating-SNAPSHOT.jar
> [INFO] Unable to find resource
> 'org.apache.clerezza.ext:javax.mail:jar:0.4-incubating-SNAPSHOT' in
> repository scala-tools.org (http://scala-tools.org/repo-releases)
> [WARNING] *** CHECKSUM FAILED - Checksum failed on download: local =
> '448ec9d30e0e022baa2d65c4f6fa59cba4b568ee'; remote = '<!DOCTYPE' - RETRYING
> [WARNING] *** CHECKSUM FAILED - Checksum failed on download: local =
> '448ec9d30e0e022baa2d65c4f6fa59cba4b568ee'; remote = '<!DOCTYPE' - IGNORING
> [ERROR] Unable to connect to:
> https://maven-repository.dev.java.net/nonav/repository
> [WARNING] *** CHECKSUM FAILED - Checksum failed on download: local =
> '448ec9d30e0e022baa2d65c4f6fa59cba4b568ee'; remote = '<!DOCTYPE' - RETRYING
> [WARNING] *** CHECKSUM FAILED - Checksum failed on download: local =
> '448ec9d30e0e022baa2d65c4f6fa59cba4b568ee'; remote = '<!DOCTYPE' - IGNORING
> [ERROR] Unable to connect to:
> https://maven-repository.dev.java.net/nonav/repository
> [ERROR] Unable to determine if resource
> org.apache.clerezza.ext:javax.mail:jar:0.4-incubating-SNAPSHOT:provided
> exists in https://maven-repository.dev.java.net/nonav/repository
> Downloading:
> http://scala-tools.org/repo-releases/org/apache/clerezza/ext/org.jruby/0.3-incubating-SNAPSHOT/org.jruby-0.3-incubating-SNAPSHOT.jar
> [INFO] Unable to find resource
> 'org.apache.clerezza.ext:org.jruby:jar:0.3-incubating-SNAPSHOT' in
> repository scala-tools.org (http://scala-tools.org/repo-releases)
> Downloading:
> http://repo.trialox.org/release/org/apache/clerezza/ext/org.jruby/0.3-incubating-SNAPSHOT/org.jruby-0.3-incubating-SNAPSHOT.jar
> [INFO] Unable to find resource
> 'org.apache.clerezza.ext:org.jruby:jar:0.3-incubating-SNAPSHOT' in
> repository trialox-plugin-release (http://repo.trialox.org/release)
> Downloading:
> http://repo.trialox.org/snapshot/org/apache/clerezza/ext/org.jruby/0.3-incubating-SNAPSHOT/org.jruby-0.3-incubating-SNAPSHOT.jar
> [INFO] Unable to find resource
> 'org.apache.clerezza.ext:org.jruby:jar:0.3-incubating-SNAPSHOT' in
> repository trialox-plugin-snapshot (http://repo.trialox.org/snapshot)
> Downloading:
> http://repository.ops4j.org/mvn-snapshots//org/apache/clerezza/ext/org.jruby/0.3-incubating-SNAPSHOT/org.jruby-0.3-incubating-SNAPSHOT.jar
> [INFO] Unable to find resource
> 'org.apache.clerezza.ext:org.jruby:jar:0.3-incubating-SNAPSHOT' in
> repository ops4j-plugin-snapshot (
> http://repository.ops4j.org/mvn-snapshots/)
> Downloading:
> http://repository.apache.org/content/groups/snapshots-group/org/apache/clerezza/ext/org.jruby/0.3-incubating-SNAPSHOT/org.jruby-0.3-incubating-SNAPSHOT.jar
> [INFO] Unable to find resource
> 'org.apache.clerezza.ext:org.jruby:jar:0.3-incubating-SNAPSHOT' in
> repository apache-plugin-snapshot (
> http://repository.apache.org/content/groups/snapshots-group)
> Downloading:
> http://download.java.net/maven/2//org/apache/clerezza/ext/org.jruby/0.3-incubating-SNAPSHOT/org.jruby-0.3-incubating-SNAPSHOT.jar
> [INFO] Unable to find resource
> 'org.apache.clerezza.ext:org.jruby:jar:0.3-incubating-SNAPSHOT' in
> repository sun (http://download.java.net/maven/2/)
> Downloading:
> http://wymiwyg.berlios.de/maven2//org/apache/clerezza/ext/org.jruby/0.3-incubating-SNAPSHOT/org.jruby-0.3-incubating-SNAPSHOT.jar
> [INFO] Unable to find resource
> 'org.apache.clerezza.ext:org.jruby:jar:0.3-incubating-SNAPSHOT' in
> repository wymiwyg (http://wymiwyg.berlios.de/maven2/)
> Downloading:
> http://repo.aduna-software.org/maven2/releases/org/apache/clerezza/ext/org.jruby/0.3-incubating-SNAPSHOT/org.jruby-0.3-incubating-SNAPSHOT.jar
> [INFO] Unable to find resource
> 'org.apache.clerezza.ext:org.jruby:jar:0.3-incubating-SNAPSHOT' in
> repository aduna (http://repo.aduna-software.org/maven2/releases)
> Downloading:
> http://repository.ops4j.org/mvn-snapshots//org/apache/clerezza/ext/org.jruby/0.3-incubating-SNAPSHOT/org.jruby-0.3-incubating-SNAPSHOT.jar
> [INFO] Unable to find resource
> 'org.apache.clerezza.ext:org.jruby:jar:0.3-incubating-SNAPSHOT' in
> repository ops4j (http://repository.ops4j.org/mvn-snapshots/)
> Downloading:
> http://repository.apache.org/content/groups/snapshots-group/org/apache/clerezza/ext/org.jruby/0.3-incubating-SNAPSHOT/org.jruby-0.3-incubating-SNAPSHOT.jar
> [INFO] Unable to find resource
> 'org.apache.clerezza.ext:org.jruby:jar:0.3-incubating-SNAPSHOT' in
> repository apache (
> http://repository.apache.org/content/groups/snapshots-group)
> Downloading:
> http://repo.trialox.org/ext/org/apache/clerezza/ext/org.jruby/0.3-incubating-SNAPSHOT/org.jruby-0.3-incubating-SNAPSHOT.jar
> [INFO] Unable to find resource
> 'org.apache.clerezza.ext:org.jruby:jar:0.3-incubating-SNAPSHOT' in
> repository clerezza-ext (http://repo.trialox.org/ext)
> Downloading:
> http://openjena.org/repo//org/apache/clerezza/ext/org.jruby/0.3-incubating-SNAPSHOT/org.jruby-0.3-incubating-SNAPSHOT.jar
> [INFO] Unable to find resource
> 'org.apache.clerezza.ext:org.jruby:jar:0.3-incubating-SNAPSHOT' in
> repository jena (http://openjena.org/repo/)
> Downloading:
> http://scala-tools.org/repo-releases/org/apache/clerezza/ext/org.jruby/0.3-incubating-SNAPSHOT/org.jruby-0.3-incubating-SNAPSHOT.jar
> [INFO] Unable to find resource
> 'org.apache.clerezza.ext:org.jruby:jar:0.3-incubating-SNAPSHOT' in
> repository scala-tools.org (http://scala-tools.org/repo-releases)
> [WARNING] *** CHECKSUM FAILED - Checksum failed on download: local =
> '448ec9d30e0e022baa2d65c4f6fa59cba4b568ee'; remote = '<!DOCTYPE' - RETRYING
> [WARNING] *** CHECKSUM FAILED - Checksum failed on download: local =
> '448ec9d30e0e022baa2d65c4f6fa59cba4b568ee'; remote = '<!DOCTYPE' - IGNORING
> [ERROR] Unable to connect to:
> https://maven-repository.dev.java.net/nonav/repository
> [WARNING] *** CHECKSUM FAILED - Checksum failed on download: local =
> '448ec9d30e0e022baa2d65c4f6fa59cba4b568ee'; remote = '<!DOCTYPE' - RETRYING
> [WARNING] *** CHECKSUM FAILED - Checksum failed on download: local =
> '448ec9d30e0e022baa2d65c4f6fa59cba4b568ee'; remote = '<!DOCTYPE' - IGNORING
> [ERROR] Unable to connect to:
> https://maven-repository.dev.java.net/nonav/repository
> [ERROR] Unable to determine if resource
> org.apache.clerezza.ext:org.jruby:jar:0.3-incubating-SNAPSHOT:provided
> exists in https://maven-repository.dev.java.net/nonav/repository
> Downloading:
> http://scala-tools.org/repo-releases/org/apache/clerezza/ext/org.json.simple/0.3-incubating-SNAPSHOT/org.json.simple-0.3-incubating-SNAPSHOT.jar
> [INFO] Unable to find resource
> 'org.apache.clerezza.ext:org.json.simple:jar:0.3-incubating-SNAPSHOT' in
> repository scala-tools.org (http://scala-tools.org/repo-releases)
> Downloading:
> http://repo.trialox.org/release/org/apache/clerezza/ext/org.json.simple/0.3-incubating-SNAPSHOT/org.json.simple-0.3-incubating-SNAPSHOT.jar
> [INFO] Unable to find resource
> 'org.apache.clerezza.ext:org.json.simple:jar:0.3-incubating-SNAPSHOT' in
> repository trialox-plugin-release (http://repo.trialox.org/release)
> Downloading:
> http://repo.trialox.org/snapshot/org/apache/clerezza/ext/org.json.simple/0.3-incubating-SNAPSHOT/org.json.simple-0.3-incubating-SNAPSHOT.jar
> [INFO] Unable to find resource
> 'org.apache.clerezza.ext:org.json.simple:jar:0.3-incubating-SNAPSHOT' in
> repository trialox-plugin-snapshot (http://repo.trialox.org/snapshot)
> Downloading:
> http://repository.ops4j.org/mvn-snapshots//org/apache/clerezza/ext/org.json.simple/0.3-incubating-SNAPSHOT/org.json.simple-0.3-incubating-SNAPSHOT.jar
> [INFO] Unable to find resource
> 'org.apache.clerezza.ext:org.json.simple:jar:0.3-incubating-SNAPSHOT' in
> repository ops4j-plugin-snapshot (
> http://repository.ops4j.org/mvn-snapshots/)
> Downloading:
> http://repository.apache.org/content/groups/snapshots-group/org/apache/clerezza/ext/org.json.simple/0.3-incubating-SNAPSHOT/org.json.simple-0.3-incubating-SNAPSHOT.jar
> [INFO] Unable to find resource
> 'org.apache.clerezza.ext:org.json.simple:jar:0.3-incubating-SNAPSHOT' in
> repository apache-plugin-snapshot (
> http://repository.apache.org/content/groups/snapshots-group)
> Downloading:
> http://download.java.net/maven/2//org/apache/clerezza/ext/org.json.simple/0.3-incubating-SNAPSHOT/org.json.simple-0.3-incubating-SNAPSHOT.jar
> [INFO] Unable to find resource
> 'org.apache.clerezza.ext:org.json.simple:jar:0.3-incubating-SNAPSHOT' in
> repository sun (http://download.java.net/maven/2/)
> Downloading:
> http://wymiwyg.berlios.de/maven2//org/apache/clerezza/ext/org.json.simple/0.3-incubating-SNAPSHOT/org.json.simple-0.3-incubating-SNAPSHOT.jar
> [INFO] Unable to find resource
> 'org.apache.clerezza.ext:org.json.simple:jar:0.3-incubating-SNAPSHOT' in
> repository wymiwyg (http://wymiwyg.berlios.de/maven2/)
> Downloading:
> http://repo.aduna-software.org/maven2/releases/org/apache/clerezza/ext/org.json.simple/0.3-incubating-SNAPSHOT/org.json.simple-0.3-incubating-SNAPSHOT.jar
> [INFO] Unable to find resource
> 'org.apache.clerezza.ext:org.json.simple:jar:0.3-incubating-SNAPSHOT' in
> repository aduna (http://repo.aduna-software.org/maven2/releases)
> Downloading:
> http://repository.ops4j.org/mvn-snapshots//org/apache/clerezza/ext/org.json.simple/0.3-incubating-SNAPSHOT/org.json.simple-0.3-incubating-SNAPSHOT.jar
> [INFO] Unable to find resource
> 'org.apache.clerezza.ext:org.json.simple:jar:0.3-incubating-SNAPSHOT' in
> repository ops4j (http://repository.ops4j.org/mvn-snapshots/)
> Downloading:
> http://repository.apache.org/content/groups/snapshots-group/org/apache/clerezza/ext/org.json.simple/0.3-incubating-SNAPSHOT/org.json.simple-0.3-incubating-SNAPSHOT.jar
> [INFO] Unable to find resource
> 'org.apache.clerezza.ext:org.json.simple:jar:0.3-incubating-SNAPSHOT' in
> repository apache (
> http://repository.apache.org/content/groups/snapshots-group)
> Downloading:
> http://repo.trialox.org/ext/org/apache/clerezza/ext/org.json.simple/0.3-incubating-SNAPSHOT/org.json.simple-0.3-incubating-SNAPSHOT.jar
> [INFO] Unable to find resource
> 'org.apache.clerezza.ext:org.json.simple:jar:0.3-incubating-SNAPSHOT' in
> repository clerezza-ext (http://repo.trialox.org/ext)
> Downloading:
> http://openjena.org/repo//org/apache/clerezza/ext/org.json.simple/0.3-incubating-SNAPSHOT/org.json.simple-0.3-incubating-SNAPSHOT.jar
> [INFO] Unable to find resource
> 'org.apache.clerezza.ext:org.json.simple:jar:0.3-incubating-SNAPSHOT' in
> repository jena (http://openjena.org/repo/)
> Downloading:
> http://scala-tools.org/repo-releases/org/apache/clerezza/ext/org.json.simple/0.3-incubating-SNAPSHOT/org.json.simple-0.3-incubating-SNAPSHOT.jar
> [INFO] Unable to find resource
> 'org.apache.clerezza.ext:org.json.simple:jar:0.3-incubating-SNAPSHOT' in
> repository scala-tools.org (http://scala-tools.org/repo-releases)
> [WARNING] *** CHECKSUM FAILED - Checksum failed on download: local =
> '448ec9d30e0e022baa2d65c4f6fa59cba4b568ee'; remote = '<!DOCTYPE' - RETRYING
> [WARNING] *** CHECKSUM FAILED - Checksum failed on download: local =
> '448ec9d30e0e022baa2d65c4f6fa59cba4b568ee'; remote = '<!DOCTYPE' - IGNORING
> [ERROR] Unable to connect to:
> https://maven-repository.dev.java.net/nonav/repository
> [WARNING] *** CHECKSUM FAILED - Checksum failed on download: local =
> '448ec9d30e0e022baa2d65c4f6fa59cba4b568ee'; remote = '<!DOCTYPE' - RETRYING
> [WARNING] *** CHECKSUM FAILED - Checksum failed on download: local =
> '448ec9d30e0e022baa2d65c4f6fa59cba4b568ee'; remote = '<!DOCTYPE' - IGNORING
> [ERROR] Unable to connect to:
> https://maven-repository.dev.java.net/nonav/repository
> [ERROR] Unable to determine if resource
> org.apache.clerezza.ext:org.json.simple:jar:0.3-incubating-SNAPSHOT:provided
> exists in https://maven-repository.dev.java.net/nonav/repository
> [WARNING] *** CHECKSUM FAILED - Checksum failed on download: local =
> '448ec9d30e0e022baa2d65c4f6fa59cba4b568ee'; remote = '<!DOCTYPE' - RETRYING
> [WARNING] *** CHECKSUM FAILED - Checksum failed on download: local =
> '448ec9d30e0e022baa2d65c4f6fa59cba4b568ee'; remote = '<!DOCTYPE' - IGNORING
> [ERROR] Unable to connect to:
> https://maven-repository.dev.java.net/nonav/repository
> [WARNING] *** CHECKSUM FAILED - Checksum failed on download: local =
> '448ec9d30e0e022baa2d65c4f6fa59cba4b568ee'; remote = '<!DOCTYPE' - RETRYING
> [WARNING] *** CHECKSUM FAILED - Checksum failed on download: local =
> '448ec9d30e0e022baa2d65c4f6fa59cba4b568ee'; remote = '<!DOCTYPE' - IGNORING
> [ERROR] Unable to connect to:
> https://maven-repository.dev.java.net/nonav/repository
> [ERROR] Unable to determine if resource
> org.apache.clerezza.ext:org.mulgara:jar:0.3-incubating-SNAPSHOT:runtime
> exists in https://maven-repository.dev.java.net/nonav/repository
> [WARNING] *** CHECKSUM FAILED - Checksum failed on download: local =
> '448ec9d30e0e022baa2d65c4f6fa59cba4b568ee'; remote = '<!DOCTYPE' - RETRYING
> [WARNING] *** CHECKSUM FAILED - Checksum failed on download: local =
> '448ec9d30e0e022baa2d65c4f6fa59cba4b568ee'; remote = '<!DOCTYPE' - IGNORING
> [ERROR] Unable to connect to:
> https://maven-repository.dev.java.net/nonav/repository
> [WARNING] *** CHECKSUM FAILED - Checksum failed on download: local =
> '448ec9d30e0e022baa2d65c4f6fa59cba4b568ee'; remote = '<!DOCTYPE' - RETRYING
> [WARNING] *** CHECKSUM FAILED - Checksum failed on download: local =
> '448ec9d30e0e022baa2d65c4f6fa59cba4b568ee'; remote = '<!DOCTYPE' - IGNORING
> [ERROR] Unable to connect to:
> https://maven-repository.dev.java.net/nonav/repository
> [ERROR] Unable to determine if resource
> org.apache.clerezza.ext:org.openrdf.sesame:jar:0.5-incubating-SNAPSHOT:runtime
> exists in https://maven-repository.dev.java.net/nonav/repository
> [ERROR] Unable to determine if resource
> org.apache.felix:org.apache.felix.scr.annotations:jar:0.9.0:runtime exists
> in https://maven-repository.dev.java.net/nonav/repository
> [ERROR] Unable to determine if resource
> org.apache.lucene:lucene-core:jar:2.4.0:runtime exists in
> https://maven-repository.dev.java.net/nonav/repository
> [ERROR] Unable to determine if resource
> org.apache.xml:serializer:jar:2.7:runtime exists in
> https://maven-repository.dev.java.net/nonav/repository
> [ERROR] Unable to determine if resource
> org.codehaus.castor:castor-core:jar:1.3:runtime exists in
> https://maven-repository.dev.java.net/nonav/repository
> [ERROR] Unable to determine if resource
> org.codehaus.castor:castor-xml:jar:1.3:runtime exists in
> https://maven-repository.dev.java.net/nonav/repository
> [ERROR] Unable to determine if resource org.jruby:jruby:jar:1.3.1:provided
> exists in https://maven-repository.dev.java.net/nonav/repository
> [ERROR] Unable to determine if resource
> org.mulgara:mulgara-core:jar:2.1.1:runtime exists in
> https://maven-repository.dev.java.net/nonav/repository
> [ERROR] Unable to determine if resource
> org.objectweb.carol:carol:jar:2.0.5:runtime exists in
> https://maven-repository.dev.java.net/nonav/repository
> [ERROR] Unable to determine if resource
> org.objectweb.carol:cmi:jar:1.3.12:runtime exists in
> https://maven-repository.dev.java.net/nonav/repository
> [ERROR] Unable to determine if resource
> org.openrdf:openrdf-model:jar:1.2.7:runtime exists in
> https://maven-repository.dev.java.net/nonav/repository
> [ERROR] Unable to determine if resource
> org.openrdf:sesame:jar:1.2.7:runtime exists in
> https://maven-repository.dev.java.net/nonav/repository
> [ERROR] Unable to determine if resource
> org.openrdf.sesame:sesame-http-client:jar:2.3.0:runtime exists in
> https://maven-repository.dev.java.net/nonav/repository
> [ERROR] Unable to determine if resource
> org.openrdf.sesame:sesame-http-protocol:jar:2.3.0:runtime exists in
> https://maven-repository.dev.java.net/nonav/repository
> [ERROR] Unable to determine if resource
> org.openrdf.sesame:sesame-model:jar:2.3.0:runtime exists in
> https://maven-repository.dev.java.net/nonav/repository
> [ERROR] Unable to determine if resource
> org.openrdf.sesame:sesame-query:jar:2.3.0:runtime exists in
> https://maven-repository.dev.java.net/nonav/repository
> [ERROR] Unable to determine if resource
> org.openrdf.sesame:sesame-queryalgebra-evaluation:jar:2.3.0:runtime exists
> in https://maven-repository.dev.java.net/nonav/repository
> [ERROR] Unable to determine if resource
> org.openrdf.sesame:sesame-queryalgebra-model:jar:2.3.0:runtime exists in
> https://maven-repository.dev.java.net/nonav/repository
> [ERROR] Unable to determine if resource
> org.openrdf.sesame:sesame-queryparser-api:jar:2.3.0:runtime exists in
> https://maven-repository.dev.java.net/nonav/repository
> [ERROR] Unable to determine if resource
> org.openrdf.sesame:sesame-queryparser-serql:jar:2.3.0:runtime exists in
> https://maven-repository.dev.java.net/nonav/repository
> [ERROR] Unable to determine if resource
> org.openrdf.sesame:sesame-queryresultio-api:jar:2.3.0:runtime exists in
> https://maven-repository.dev.java.net/nonav/repository
> [ERROR] Unable to determine if resource
> org.openrdf.sesame:sesame-repository-api:jar:2.3.0:runtime exists in
> https://maven-repository.dev.java.net/nonav/repository
> [ERROR] Unable to determine if resource
> org.openrdf.sesame:sesame-repository-sail:jar:2.3.0:runtime exists in
> https://maven-repository.dev.java.net/nonav/repository
> [ERROR] Unable to determine if resource
> org.openrdf.sesame:sesame-rio-api:jar:2.3.0:runtime exists in
> https://maven-repository.dev.java.net/nonav/repository
> [ERROR] Unable to determine if resource
> org.openrdf.sesame:sesame-rio-ntriples:jar:2.3.0:runtime exists in
> https://maven-repository.dev.java.net/nonav/repository
> [ERROR] Unable to determine if resource
> org.openrdf.sesame:sesame-sail-api:jar:2.3.0:runtime exists in
> https://maven-repository.dev.java.net/nonav/repository
> [ERROR] Unable to determine if resource
> org.openrdf.sesame:sesame-sail-inferencer:jar:2.3.0:runtime exists in
> https://maven-repository.dev.java.net/nonav/repository
> [ERROR] Unable to determine if resource
> org.openrdf.sesame:sesame-sail-nativerdf:jar:2.3.0:runtime exists in
> https://maven-repository.dev.java.net/nonav/repository
> [ERROR] Unable to determine if resource
> org.ops4j.pax.url:pax-url-mvn:jar:1.1.2:provided exists in
> https://maven-repository.dev.java.net/nonav/repository
> [ERROR] Unable to determine if resource
> org.osgi:org.osgi.compendium:jar:4.1.0:runtime exists in
> https://maven-repository.dev.java.net/nonav/repository
> [ERROR] Unable to determine if resource
> org.osgi:org.osgi.core:jar:4.1.0:runtime exists in
> https://maven-repository.dev.java.net/nonav/repository
> [ERROR] Unable to determine if resource
> org.osgi:osgi_R4_compendium:jar:1.0:provided exists in
> https://maven-repository.dev.java.net/nonav/repository
> [ERROR] Unable to determine if resource
> org.osgi:osgi_R4_core:jar:1.0:provided exists in
> https://maven-repository.dev.java.net/nonav/repository
> [ERROR] Unable to determine if resource
> org.scala-lang:scala-compiler:jar:2.7.5:provided exists in
> https://maven-repository.dev.java.net/nonav/repository
> [ERROR] Unable to determine if resource
> org.scala-lang:scala-library:jar:2.7.5:provided exists in
> https://maven-repository.dev.java.net/nonav/repository
> [ERROR] Unable to determine if resource
> org.scala-lang-osgi:scala-compiler:jar:2.7.5:provided exists in
> https://maven-repository.dev.java.net/nonav/repository
> [ERROR] Unable to determine if resource
> org.scala-lang-osgi:scala-library:jar:2.7.5:provided exists in
> https://maven-repository.dev.java.net/nonav/repository
> [ERROR] Unable to determine if resource
> org.slf4j:slf4j-api:jar:1.5.8:compile exists in
> https://maven-repository.dev.java.net/nonav/repository
> [ERROR] Unable to determine if resource
> org.slf4j:slf4j-jdk14:jar:1.5.2:runtime exists in
> https://maven-repository.dev.java.net/nonav/repository
> [ERROR] Unable to determine if resource
> org.slf4j:slf4j-simple:jar:1.5.8:test exists in
> https://maven-repository.dev.java.net/nonav/repository
> [ERROR] Unable to determine if resource org.wymiwyg:wrhapi:jar:0.8:provided
> exists in https://maven-repository.dev.java.net/nonav/repository
> [ERROR] Unable to determine if resource
> org.wymiwyg:wrhapi-osgi:jar:0.2:provided exists in
> https://maven-repository.dev.java.net/nonav/repository
> [ERROR] Unable to determine if resource
> org.wymiwyg:wymiwyg-commons-core:jar:0.7.5:runtime exists in
> https://maven-repository.dev.java.net/nonav/repository
> [ERROR] Unable to determine if resource trove:trove:jar:1.0.2:runtime
> exists in https://maven-repository.dev.java.net/nonav/repository
> [ERROR] Unable to determine if resource xerces:xercesImpl:jar:2.8.1:runtime
> exists in https://maven-repository.dev.java.net/nonav/repository
> [INFO] Generating "Project Plugins" report.
> [INFO] Generating "PMD Report" report.
> [WARNING] Unable to locate Source XRef to link to - DISABLED
> [INFO] Generating "Continuous Integration" report.
> [INFO] Generating "Plugin Management" report.
> [INFO] Generating "Mailing Lists" report.
> [INFO] Generating "Source Repository" report.
> [INFO] Generating "Project Summary" report.
> [INFO] Generating "About" report.
> [INFO] Generating "Project License" report.
> [INFO] Generating "Dependency Convergence" report.
> [INFO] Generating "CPD Report" report.
> [WARNING] Unable to locate Source XRef to link to - DISABLED
> [HUDSON] Archiving site
> [INFO]
> ------------------------------------------------------------------------
> [INFO] Building Clerezza - Platform Launcher with Sesame Storage
> [INFO]    task-segment: [clean, install, site]
> [INFO]
> ------------------------------------------------------------------------
> [INFO] [clean:clean {execution: default-clean}]
> [INFO] Deleting file set: <
> http://hudson.zones.apache.org/hudson/job/clerezza-trunk-1.6/ws/trunk-1.6/org.apache.clerezza.platform.launcher.sesame/target>
> (included: [**], excluded: [])
> [INFO] snapshot
> org.apache.clerezza:org.apache.clerezza.rdf.sesame.storage:0.13-incubating-SNAPSHOT:
> checking for updates from sun
> [INFO] snapshot
> org.apache.clerezza:org.apache.clerezza.rdf.sesame.storage:0.13-incubating-SNAPSHOT:
> checking for updates from wymiwyg
> [INFO] snapshot
> org.apache.clerezza:org.apache.clerezza.rdf.sesame.storage:0.13-incubating-SNAPSHOT:
> checking for updates from aduna
> [INFO] snapshot
> org.apache.clerezza:org.apache.clerezza.rdf.sesame.storage:0.13-incubating-SNAPSHOT:
> checking for updates from ops4j
> [INFO] snapshot
> org.apache.clerezza:org.apache.clerezza.rdf.sesame.storage:0.13-incubating-SNAPSHOT:
> checking for updates from apache
> [INFO] snapshot
> org.apache.clerezza:org.apache.clerezza.rdf.sesame.storage:0.13-incubating-SNAPSHOT:
> checking for updates from clerezza-ext
> [INFO] snapshot
> org.apache.clerezza:org.apache.clerezza.rdf.sesame.storage:0.13-incubating-SNAPSHOT:
> checking for updates from jena
> [INFO] snapshot
> org.apache.clerezza:org.apache.clerezza.rdf.sesame.storage:0.13-incubating-SNAPSHOT:
> checking for updates from scala-tools.org
> [INFO] [dependency:unpack-dependencies {execution: inline-jars}]
> [INFO] Unpacking <
> http://hudson.zones.apache.org/hudson/job/clerezza-trunk-1.6/ws/trunk-1.6/org.apache.clerezza.platform.launcher.storageless.parent/org.apache.clerezza.platform.launcher.storageless/target/org.apache.clerezza.platform.launcher.storageless-0.8-incubating-SNAPSHOT.jar>
> to
>  <
> http://hudson.zones.apache.org/hudson/job/clerezza-trunk-1.6/ws/trunk-1.6/org.apache.clerezza.platform.launcher.sesame/target/extracted
> >
>   with includes ** and excludes:META-INF/**
> [INFO] [dependency:copy-dependencies {execution: copy-platform-bundles}]
> [INFO] Installing
> /home/hudson/.m2/repository/org/apache/clerezza/org.apache.clerezza.rdf.sesame.storage/0.13-incubating-SNAPSHOT/org.apache.clerezza.rdf.sesame.storage-0.13-incubating-SNAPSHOT.jar
> to <
> http://hudson.zones.apache.org/hudson/job/clerezza-trunk-1.6/ws/trunk-1.6/org.apache.clerezza.platform.launcher.sesame/target/bundles/startlevel-3/org/apache/clerezza/org.apache.clerezza.rdf.sesame.storage/0.13-incubating-SNAPSHOT/org.apache.clerezza.rdf.sesame.storage-0.13-incubating-SNAPSHOT.jar
> >
> [INFO] Installing
> /home/hudson/.m2/repository/org/apache/clerezza/ext/org.openrdf.sesame/0.5-incubating-SNAPSHOT/org.openrdf.sesame-0.5-incubating-SNAPSHOT.jar
> to <
> http://hudson.zones.apache.org/hudson/job/clerezza-trunk-1.6/ws/trunk-1.6/org.apache.clerezza.platform.launcher.sesame/target/bundles/startlevel-3/org/apache/clerezza/ext/org.openrdf.sesame/0.5-incubating-SNAPSHOT/org.openrdf.sesame-0.5-incubating-SNAPSHOT.jar
> >
> [INFO] [resources:resources {execution: default-resources}]
> [INFO] Using 'utf-8' encoding to copy filtered resources.
> [INFO] Copying 557 resources
> [INFO] Copying 1 resource to META-INF
> [INFO] Copying 6 resources to bundles
> [INFO] [compiler:compile {execution: default-compile}]
> [INFO] No sources to compile
> [INFO] [scr:scr {execution: generate-scr-scrdescriptor}]
> [INFO] [resources:testResources {execution: default-testResources}]
> [INFO] Using 'utf-8' encoding to copy filtered resources.
> [INFO] skip non existing resourceDirectory <
> http://hudson.zones.apache.org/hudson/job/clerezza-trunk-1.6/ws/trunk-1.6/org.apache.clerezza.platform.launcher.sesame/src/test/resources
> >
> [INFO] [compiler:testCompile {execution: default-testCompile}]
> [INFO] No sources to compile
> [INFO] [surefire:test {execution: default-test}]
> [INFO] No tests to run.
> [HUDSON] Recording test results
> [INFO] [jar:jar {execution: default-jar}]
> [INFO] Building jar: <
> http://hudson.zones.apache.org/hudson/job/clerezza-trunk-1.6/ws/trunk-1.6/org.apache.clerezza.platform.launcher.sesame/target/org.apache.clerezza.platform.launcher.sesame-0.5-incubating-SNAPSHOT.jar
> >
> [INFO] Preparing source:jar
> [WARNING] Removing: jar from forked lifecycle, to prevent recursive
> invocation.
> [INFO] No goals needed for project - skipping
> [INFO] [source:jar {execution: default}]
> [INFO] Building jar: <
> http://hudson.zones.apache.org/hudson/job/clerezza-trunk-1.6/ws/trunk-1.6/org.apache.clerezza.platform.launcher.sesame/target/org.apache.clerezza.platform.launcher.sesame-0.5-incubating-SNAPSHOT-sources.jar
> >
> Build timed out. Aborting
> [INFO] [install:install {execution: default-install}]
> [INFO] Installing <
> http://hudson.zones.apache.org/hudson/job/clerezza-trunk-1.6/ws/trunk-1.6/org.apache.clerezza.platform.launcher.sesame/target/org.apache.clerezza.platform.launcher.sesame-0.5-incubating-SNAPSHOT.jar>
> to
> /home/hudson/.m2/repository/org/apache/clerezza/org.apache.clerezza.platform.launcher.sesame/0.5-incubating-SNAPSHOT/org.apache.clerezza.platform.launcher.sesame-0.5-incubating-SNAPSHOT.jar
> channel stopped
> [locks-and-latches] Releasing all the locks
> [locks-and-latches] All the locks released
>
>

Mime
  • Unnamed multipart/alternative (inline, None, 0 bytes)
View raw message