incubator-clerezza-dev mailing list archives

Site index · List index
Message view « Date » · « Thread »
Top « Date » · « Thread »
From Apache Hudson Server <hud...@hudson.zones.apache.org>
Subject Build failed in Hudson: clerezza-trunk-1.6 #38
Date Mon, 11 Jan 2010 11:16:23 GMT
See <http://hudson.zones.apache.org/hudson/job/clerezza-trunk-1.6/38/changes>

Changes:

[mir] Removed deprecated dashbooard test

[reto] CLEREZZA-27: closing

------------------------------------------
[...truncated 2044 lines...]
Should not skip: ^
Should not skip: ^
Should not skip: ^
Should not skip: ^
Should not skip: ^
Should not skip: ^
Should not skip: ^
Should not skip: ^
Should not skip: ^
Should not skip: ^
Should not skip: ^
Should not skip: ^
Should not skip: ^
Should not skip: ^
Should not skip: ^
Should not skip: ^
Should not skip: ^
Should not skip: ^
Should not skip: ^
Should not skip: ^
Should not skip: ^
Should not skip: ^
Should not skip: ^
Should not skip: ^
Should not skip: ^
Should not skip: ^
Should not skip: ^
Should not skip: ^
Should not skip: ^
Should not skip: ^
Should not skip: ^
Should not skip: ^
Should not skip: ^
Should not skip: ^
Should not skip: ^
Should not skip: ^
Should not skip: ^
Should not skip: ^
Should not skip: ^
Should not skip: ^
Should not skip: ^
Should not skip: ^
Should not skip: ^
Should not skip: ^
Should not skip: ^
Should not skip: ^
Should not skip: ^
Should not skip: ^
Should not skip: ^
Should not skip: ^
Should not skip: ^
Should not skip: ^
Should not skip: ^
Should not skip: ^
Should not skip: ^
Should not skip: ^
Should not skip: ^
Should not skip: ^
Should not skip: ^
Should not skip: ^
Should not skip: ^
Should not skip: ^
Should not skip: ^
Should not skip: ^
Should not skip: ^
Should not skip: ^
Should not skip: ^
Should not skip: ^
Should not skip: ^
Should not skip: ^
Should not skip: ^
Should not skip: ^
Should not skip: ^
Should not skip: ^
Should not skip: ^
Should not skip: ^
Should not skip: ^
Should not skip: ^
Should not skip: ^
Should not skip: ^
Should not skip: ^
Should not skip: ^
Should not skip: ^
Should not skip: ^
Should not skip: ^
Should not skip: ^
Should not skip: ^
Should not skip: ^
Should not skip: ^
Should not skip: ^
Should not skip: ^
Should not skip: ^
Should not skip: ^
Should not skip: ^
Should not skip: ^
Should not skip: ^
Should not skip: ^
Should not skip: ^
Should not skip: ^
Should not skip: ^
Should not skip: ^
Should not skip: ^
Should not skip: ^
Should not skip: ^
Should not skip: ^
Should not skip: ^
Should not skip: ^
Should not skip: ^
Should not skip: ^
Should not skip: ^
Should not skip: ^
Should not skip: ^
Should not skip: ^
Should not skip: ^
Should not skip: ^
Should not skip: ^
Should not skip: ^
Should not skip: ^
Should not skip: ^
Should not skip: ^
Should not skip: ^
Should not skip: ^
Should not skip: ^
Should not skip: ^
Should not skip: ^
Should not skip: ^
Should not skip: ^
Should not skip: ^
Should not skip: ^
Should not skip: ^
Should not skip: ^
Should not skip: ^
Should not skip: ^
Should not skip: ^
Should not skip: ^
Should not skip: ^
Should not skip: ^
Should not skip: ^
Should not skip: ^
Should not skip: ^
Should not skip: ^
Should not skip: ^
Should not skip: ^
Should not skip: ^
Should not skip: ^
Should not skip: ^
Should not skip: ^
Should not skip: ^
Should not skip: ^
[INFO] Preparing source:jar
[WARNING] Removing: jar from forked lifecycle, to prevent recursive invocation.
[INFO] No goals needed for project - skipping
[INFO] [source:jar {execution: default}]
[INFO] No sources in project. Archive not created.
[INFO] [install:install {execution: default-install}]
[INFO] Installing <http://hudson.zones.apache.org/hudson/job/clerezza-trunk-1.6/ws/trunk-1.6/org.apache.clerezza.ext.org.openrdf.sesame/target/org.openrdf.sesame-0.5-incubating-SNAPSHOT.jar>
to /home/hudson/.m2/repository/org/apache/clerezza/ext/org.openrdf.sesame/0.5-incubating-SNAPSHOT/org.openrdf.sesame-0.5-incubating-SNAPSHOT.jar
[INFO] [bundle:install {execution: default-install}]
[INFO] Parsing file:/home/hudson/.m2/repository/repository.xml
[INFO] Installing org/apache/clerezza/ext/org.openrdf.sesame/0.5-incubating-SNAPSHOT/org.openrdf.sesame-0.5-incubating-SNAPSHOT.jar
[INFO] Writing OBR metadata
[HUDSON] Archiving <http://hudson.zones.apache.org/hudson/job/clerezza-trunk-1.6/ws/trunk-1.6/org.apache.clerezza.ext.org.openrdf.sesame/pom.xml>
to /export/home/hudson/hudson/jobs/clerezza-trunk-1.6/modules/org.apache.clerezza.ext$org.openrdf.sesame/builds/2010-01-11_11-07-11/archive/org.apache.clerezza.ext/org.openrdf.sesame/0.5-incubating-SNAPSHOT/pom.xml
[HUDSON] Archiving <http://hudson.zones.apache.org/hudson/job/clerezza-trunk-1.6/ws/trunk-1.6/org.apache.clerezza.ext.org.openrdf.sesame/target/org.openrdf.sesame-0.5-incubating-SNAPSHOT.jar>
to /export/home/hudson/hudson/jobs/clerezza-trunk-1.6/modules/org.apache.clerezza.ext$org.openrdf.sesame/builds/2010-01-11_11-07-11/archive/org.apache.clerezza.ext/org.openrdf.sesame/0.5-incubating-SNAPSHOT/org.openrdf.sesame-0.5-incubating-SNAPSHOT.jar
[INFO] ------------------------------------------------------------------------
[INFO] Building Clerezza - Web Test Framework
[INFO]    task-segment: [clean, install]
[INFO] ------------------------------------------------------------------------
[INFO] [clean:clean {execution: default-clean}]
[INFO] Deleting file set: <http://hudson.zones.apache.org/hudson/job/clerezza-trunk-1.6/ws/trunk-1.6/org.apache.clerezza.integrationtest.web/target>
(included: [**], excluded: [])
[INFO] [resources:resources {execution: default-resources}]
[INFO] Using 'utf-8' encoding to copy filtered resources.
[INFO] Copying 1 resource to META-INF
[INFO] skip non existing resourceDirectory <http://hudson.zones.apache.org/hudson/job/clerezza-trunk-1.6/ws/trunk-1.6/org.apache.clerezza.integrationtest.web/src/main/resources>
[INFO] snapshot org.apache.clerezza.ext:javax.mail:0.4-incubating-SNAPSHOT: checking for updates
from sun
[INFO] snapshot org.apache.clerezza.ext:javax.mail:0.4-incubating-SNAPSHOT: checking for updates
from wymiwyg
[INFO] snapshot org.apache.clerezza.ext:javax.mail:0.4-incubating-SNAPSHOT: checking for updates
from aduna
[INFO] snapshot org.apache.clerezza.ext:javax.mail:0.4-incubating-SNAPSHOT: checking for updates
from ops4j
[INFO] snapshot org.apache.clerezza.ext:javax.mail:0.4-incubating-SNAPSHOT: checking for updates
from apache
[INFO] snapshot org.apache.clerezza.ext:javax.mail:0.4-incubating-SNAPSHOT: checking for updates
from clerezza-ext
[INFO] snapshot org.apache.clerezza.ext:javax.mail:0.4-incubating-SNAPSHOT: checking for updates
from jena
[INFO] snapshot org.apache.clerezza.ext:javax.mail:0.4-incubating-SNAPSHOT: checking for updates
from scala-tools.org
[INFO] [compiler:compile {execution: default-compile}]
[INFO] Compiling 8 source files to <http://hudson.zones.apache.org/hudson/job/clerezza-trunk-1.6/ws/trunk-1.6/org.apache.clerezza.integrationtest.web/target/classes>
[INFO] [scr:scr {execution: generate-scr-scrdescriptor}]
[INFO] Generating 4 MetaType Descriptors to <http://hudson.zones.apache.org/hudson/job/clerezza-trunk-1.6/ws/trunk-1.6/org.apache.clerezza.integrationtest.web/target/scr-plugin-generated/OSGI-INF/metatype/metatype.xml>
[INFO] Writing abstract service descriptor <http://hudson.zones.apache.org/hudson/job/clerezza-trunk-1.6/ws/trunk-1.6/org.apache.clerezza.integrationtest.web/target/scr-plugin-generated/OSGI-INF/scr-plugin/scrinfo.xml>
with 2 entries.
[INFO] Generating 2 Service Component Descriptors to <http://hudson.zones.apache.org/hudson/job/clerezza-trunk-1.6/ws/trunk-1.6/org.apache.clerezza.integrationtest.web/target/scr-plugin-generated/OSGI-INF/serviceComponents.xml>
[INFO] [resources:testResources {execution: default-testResources}]
[INFO] Using 'utf-8' encoding to copy filtered resources.
[INFO] skip non existing resourceDirectory <http://hudson.zones.apache.org/hudson/job/clerezza-trunk-1.6/ws/trunk-1.6/org.apache.clerezza.integrationtest.web/src/test/resources>
[INFO] [compiler:testCompile {execution: default-testCompile}]
[INFO] No sources to compile
[INFO] [surefire:test {execution: default-test}]
[INFO] No tests to run.
[INFO] [bundle:bundle {execution: default-bundle}]
[INFO] Preparing source:jar[HUDSON] Recording test results
[WARNING] Removing: jar from forked lifecycle, to prevent recursive invocation.
[INFO] No goals needed for project - skipping
[INFO] [source:jar {execution: default}]
[INFO] Building jar: <http://hudson.zones.apache.org/hudson/job/clerezza-trunk-1.6/ws/trunk-1.6/org.apache.clerezza.integrationtest.web/target/org.apache.clerezza.integrationtest.web-0.5-incubating-SNAPSHOT-sources.jar>
[INFO] [install:install {execution: default-install}]
[INFO] Installing <http://hudson.zones.apache.org/hudson/job/clerezza-trunk-1.6/ws/trunk-1.6/org.apache.clerezza.integrationtest.web/target/org.apache.clerezza.integrationtest.web-0.5-incubating-SNAPSHOT.jar>
to /home/hudson/.m2/repository/org/apache/clerezza/org.apache.clerezza.integrationtest.web/0.5-incubating-SNAPSHOT/org.apache.clerezza.integrationtest.web-0.5-incubating-SNAPSHOT.jar
[INFO] Installing <http://hudson.zones.apache.org/hudson/job/clerezza-trunk-1.6/ws/trunk-1.6/org.apache.clerezza.integrationtest.web/target/org.apache.clerezza.integrationtest.web-0.5-incubating-SNAPSHOT-sources.jar>
to /home/hudson/.m2/repository/org/apache/clerezza/org.apache.clerezza.integrationtest.web/0.5-incubating-SNAPSHOT/org.apache.clerezza.integrationtest.web-0.5-incubating-SNAPSHOT-sources.jar

[INFO] [bundle:install {execution: default-install}]
[INFO] Parsing file:/home/hudson/.m2/repository/repository.xml
[INFO] Installing org/apache/clerezza/org.apache.clerezza.integrationtest.web/0.5-incubating-SNAPSHOT/org.apache.clerezza.integrationtest.web-0.5-incubating-SNAPSHOT.jar
[INFO] Writing OBR metadata
[HUDSON] Archiving <http://hudson.zones.apache.org/hudson/job/clerezza-trunk-1.6/ws/trunk-1.6/org.apache.clerezza.integrationtest.web/pom.xml>
to /export/home/hudson/hudson/jobs/clerezza-trunk-1.6/modules/org.apache.clerezza$org.apache.clerezza.integrationtest.web/builds/2010-01-11_11-07-11/archive/org.apache.clerezza/org.apache.clerezza.integrationtest.web/0.5-incubating-SNAPSHOT/pom.xml
[HUDSON] Archiving <http://hudson.zones.apache.org/hudson/job/clerezza-trunk-1.6/ws/trunk-1.6/org.apache.clerezza.integrationtest.web/target/org.apache.clerezza.integrationtest.web-0.5-incubating-SNAPSHOT.jar>
to /export/home/hudson/hudson/jobs/clerezza-trunk-1.6/modules/org.apache.clerezza$org.apache.clerezza.integrationtest.web/builds/2010-01-11_11-07-11/archive/org.apache.clerezza/org.apache.clerezza.integrationtest.web/0.5-incubating-SNAPSHOT/org.apache.clerezza.integrationtest.web-0.5-incubating-SNAPSHOT.jar
[HUDSON] Archiving <http://hudson.zones.apache.org/hudson/job/clerezza-trunk-1.6/ws/trunk-1.6/org.apache.clerezza.integrationtest.web/target/org.apache.clerezza.integrationtest.web-0.5-incubating-SNAPSHOT-sources.jar>
to /export/home/hudson/hudson/jobs/clerezza-trunk-1.6/modules/org.apache.clerezza$org.apache.clerezza.integrationtest.web/builds/2010-01-11_11-07-11/archive/org.apache.clerezza/org.apache.clerezza.integrationtest.web/0.5-incubating-SNAPSHOT/org.apache.clerezza.integrationtest.web-0.5-incubating-SNAPSHOT-sources.jar
[INFO] ------------------------------------------------------------------------
[INFO] Building Clerezza - Web Performance Integration Tests
[INFO]    task-segment: [clean, install]
[INFO] ------------------------------------------------------------------------
[INFO] [clean:clean {execution: default-clean}]
[INFO] Deleting file set: <http://hudson.zones.apache.org/hudson/job/clerezza-trunk-1.6/ws/trunk-1.6/org.apache.clerezza.integrationtest.web.performance/target>
(included: [**], excluded: [])
[INFO] [resources:resources {execution: default-resources}]
[INFO] Using 'utf-8' encoding to copy filtered resources.
[INFO] Copying 1 resource to META-INF
[INFO] skip non existing resourceDirectory <http://hudson.zones.apache.org/hudson/job/clerezza-trunk-1.6/ws/trunk-1.6/org.apache.clerezza.integrationtest.web.performance/src/main/resources>
[INFO] snapshot org.apache.clerezza:org.apache.clerezza.integrationtest.web:0.5-incubating-SNAPSHOT:
checking for updates from sun
[INFO] snapshot org.apache.clerezza:org.apache.clerezza.integrationtest.web:0.5-incubating-SNAPSHOT:
checking for updates from wymiwyg
[INFO] snapshot org.apache.clerezza:org.apache.clerezza.integrationtest.web:0.5-incubating-SNAPSHOT:
checking for updates from aduna
[INFO] snapshot org.apache.clerezza:org.apache.clerezza.integrationtest.web:0.5-incubating-SNAPSHOT:
checking for updates from ops4j
[INFO] snapshot org.apache.clerezza:org.apache.clerezza.integrationtest.web:0.5-incubating-SNAPSHOT:
checking for updates from apache
[INFO] snapshot org.apache.clerezza:org.apache.clerezza.integrationtest.web:0.5-incubating-SNAPSHOT:
checking for updates from clerezza-ext
[INFO] snapshot org.apache.clerezza:org.apache.clerezza.integrationtest.web:0.5-incubating-SNAPSHOT:
checking for updates from jena
[INFO] snapshot org.apache.clerezza:org.apache.clerezza.integrationtest.web:0.5-incubating-SNAPSHOT:
checking for updates from scala-tools.org
[INFO] [compiler:compile {execution: default-compile}]
[INFO] Compiling 5 source files to <http://hudson.zones.apache.org/hudson/job/clerezza-trunk-1.6/ws/trunk-1.6/org.apache.clerezza.integrationtest.web.performance/target/classes>
[INFO] [scr:scr {execution: generate-scr-scrdescriptor}]
[ERROR] Interface 'org.clerezza.integrationtest.web.framework.WebTestCase' in class org.apache.clerezza.integrationtest.web.performance.GetSparqlQuery
does not point to a valid class/interface. at <http://hudson.zones.apache.org/hudson/job/clerezza-trunk-1.6/ws/trunk-1.6/org.apache.clerezza.integrationtest.web.performance/src/main/java/org/apache/clerezza/integrationtest/web/performance/GetSparqlQuery.java>:41
[HUDSON] Archiving <http://hudson.zones.apache.org/hudson/job/clerezza-trunk-1.6/ws/trunk-1.6/org.apache.clerezza.integrationtest.web.performance/pom.xml>
to /export/home/hudson/hudson/jobs/clerezza-trunk-1.6/modules/org.apache.clerezza$org.apache.clerezza.integrationtest.web.performance/builds/2010-01-11_11-07-11/archive/org.apache.clerezza/org.apache.clerezza.integrationtest.web.performance/0.6-incubating-SNAPSHOT/pom.xml
[INFO] ------------------------------------------------------------------------
[ERROR] BUILD FAILURE
[INFO] ------------------------------------------------------------------------
[INFO] SCR Descriptor parsing had failures (see log)
[INFO] ------------------------------------------------------------------------
[INFO] For more information, run Maven with the -e switch
[INFO] ------------------------------------------------------------------------
[INFO] Total time: 8 minutes 47 seconds
[INFO] Finished at: Mon Jan 11 11:18:04 UTC 2010
[INFO] Final Memory: 84M/265M
[INFO] ------------------------------------------------------------------------
Waiting for Hudson to finish collecting data
Sending e-mails to: clerezza-dev@incubator.apache.org
channel stopped
[locks-and-latches] Releasing all the locks
[locks-and-latches] All the locks released


Mime
View raw message