incubator-clerezza-dev mailing list archives

Site index · List index
Message view « Date » · « Thread »
Top « Date » · « Thread »
From Apache Hudson Server <hud...@hudson.zones.apache.org>
Subject Build failed in Hudson: clerezza-trunk-1.6 » Clerezza - SCB Mulgara Storage #5
Date Tue, 15 Dec 2009 15:40:33 GMT
See <http://hudson.zones.apache.org/hudson/job/clerezza-trunk-1.6/org.apache.clerezza$org.apache.clerezza.rdf.mulgara.storage/5/>

------------------------------------------
[INFO] ------------------------------------------------------------------------
[INFO] Building Clerezza - SCB Mulgara Storage
[INFO]    task-segment: [clean, install]
[INFO] ------------------------------------------------------------------------
[INFO] [clean:clean {execution: default-clean}]
[INFO] Deleting file set: <http://hudson.zones.apache.org/hudson/job/clerezza-trunk-1.6/org.apache.clerezza$org.apache.clerezza.rdf.mulgara.storage/ws/target>
(included: [**], excluded: [])
[INFO] [resources:resources {execution: default-resources}]
[INFO] Using 'utf-8' encoding to copy filtered resources.
[INFO] Copying 1 resource to META-INF
[INFO] Copying 1 resource
[WARNING] POM for 'javax.jms:jms:pom:1.1:compile' is invalid.

Its dependencies (if any) will NOT be available to the current build.
[INFO] [compiler:compile {execution: default-compile}]
[INFO] Compiling 2 source files to <http://hudson.zones.apache.org/hudson/job/clerezza-trunk-1.6/org.apache.clerezza$org.apache.clerezza.rdf.mulgara.storage/ws/target/classes>
[HUDSON] Archiving <http://hudson.zones.apache.org/hudson/job/clerezza-trunk-1.6/org.apache.clerezza$org.apache.clerezza.rdf.mulgara.storage/ws/pom.xml>
to /export/home/hudson/hudson/jobs/clerezza-trunk-1.6/modules/org.apache.clerezza$org.apache.clerezza.rdf.mulgara.storage/builds/2009-12-15_15-20-23/archive/org.apache.clerezza/org.apache.clerezza.rdf.mulgara.storage/0.5-SNAPSHOT/pom.xml
[INFO] ------------------------------------------------------------------------
[ERROR] BUILD FAILURE
[INFO] ------------------------------------------------------------------------
[INFO] Compilation failure
error: error reading /home/hudson/.m2/repository/javax/jms/jms/1.1/jms-1.1.jar; error in opening
zip file

[INFO] ------------------------------------------------------------------------
[INFO] For more information, run Maven with the -e switch
[INFO] ------------------------------------------------------------------------
[INFO] Total time: 20 minutes 
[INFO] Finished at: Tue Dec 15 15:44:15 UTC 2009
[INFO] Final Memory: 126M/972M
[INFO] ------------------------------------------------------------------------


Mime
View raw message