incubator-clerezza-commits mailing list archives

Site index · List index
Message view « Date » · « Thread »
Top « Date » · « Thread »
From Apache Jenkins Server <jenk...@builds.apache.org>
Subject Build failed in Jenkins: clerezza-site » Clerezza - Parent for all (root) #283
Date Sun, 12 Jun 2011 21:55:34 GMT
See <https://builds.apache.org/job/clerezza-site/org.apache.clerezza$parent/283/>

------------------------------------------
[WARNING] POM for 'biz.aQute:bndlib:pom:1.15.0:runtime' is invalid.

Its dependencies (if any) will NOT be available to the current build.
[INFO] ------------------------------------------------------------------------
[INFO] Building Clerezza - Parent for all (root)
[INFO]    task-segment: [clean, install, site-deploy]
[INFO] ------------------------------------------------------------------------
[INFO] [clean:clean {execution: default-clean}]
[INFO] Deleting file set: <https://builds.apache.org/job/clerezza-site/org.apache.clerezza$parent/ws/target>
(included: [**], excluded: [])
[INFO] snapshot org.apache.clerezza.ext:slf4j-scala-api:1.6.1-SNAPSHOT: checking for updates
from apache
[INFO] [scr:scr {execution: generate-scr-scrdescriptor}]
[INFO] [site:attach-descriptor {execution: default-attach-descriptor}]
[INFO] Preparing source:jar
[WARNING] Removing: jar from forked lifecycle, to prevent recursive invocation.
[INFO] No goals needed for project - skipping
[INFO] [source:jar {execution: default}]
[INFO] [install:install {execution: default-install}]
[INFO] Installing <https://builds.apache.org/job/clerezza-site/org.apache.clerezza$parent/ws/pom.xml>
to /home/hudson/.m2/repository/org/apache/clerezza/parent/0.2-incubating-SNAPSHOT/parent-0.2-incubating-SNAPSHOT.pom
[INFO] snapshot org.apache.clerezza:maven-jaxrs-report-plugin:0.1-incubating-SNAPSHOT: checking
for updates from apache-plugin-snapshot
[INFO] Setting property: classpath.resource.loader.class => 'org.codehaus.plexus.velocity.ContextClassLoaderResourceLoader'.
[INFO] Setting property: velocimacro.messages.on => 'false'.
[INFO] Setting property: resource.loader => 'classpath'.
[INFO] Setting property: resource.manager.logwhenfound => 'false'.
[INFO] ************************************************************** 
[INFO] Starting Jakarta Velocity v1.4
[INFO] RuntimeInstance initializing.
[INFO] Default Properties File: org/apache/velocity/runtime/defaults/velocity.properties
[INFO] Default ResourceManager initializing. (class org.apache.velocity.runtime.resource.ResourceManagerImpl)
[INFO] Resource Loader Instantiated: org.codehaus.plexus.velocity.ContextClassLoaderResourceLoader
[INFO] ClasspathResourceLoader : initialization starting.
[INFO] ClasspathResourceLoader : initialization complete.
[INFO] ResourceCache : initialized. (class org.apache.velocity.runtime.resource.ResourceCacheImpl)
[INFO] Default ResourceManager initialization complete.
[INFO] Loaded System Directive: org.apache.velocity.runtime.directive.Literal
[INFO] Loaded System Directive: org.apache.velocity.runtime.directive.Macro
[INFO] Loaded System Directive: org.apache.velocity.runtime.directive.Parse
[INFO] Loaded System Directive: org.apache.velocity.runtime.directive.Include
[INFO] Loaded System Directive: org.apache.velocity.runtime.directive.Foreach
[INFO] Created: 20 parsers.
[INFO] Velocimacro : initialization starting.
[INFO] Velocimacro : adding VMs from VM library template : VM_global_library.vm
[ERROR] ResourceManager : unable to find resource 'VM_global_library.vm' in any resource loader.
[INFO] Velocimacro : error using  VM library template VM_global_library.vm : org.apache.velocity.exception.ResourceNotFoundException:
Unable to find resource 'VM_global_library.vm'
[INFO] Velocimacro :  VM library template macro registration complete.
[INFO] Velocimacro : allowInline = true : VMs can be defined inline in templates
[INFO] Velocimacro : allowInlineToOverride = false : VMs defined inline may NOT replace previous
VM definitions
[INFO] Velocimacro : allowInlineLocal = false : VMs defined inline will be  global in scope
if allowed.
[INFO] Velocimacro : initialization complete.
[INFO] Velocity successfully started.
[INFO] Preparing surefire-report:report
[JENKINS] Archiving <https://builds.apache.org/job/clerezza-site/org.apache.clerezza$parent/ws/pom.xml>
to /home/hudson/hudson/jobs/clerezza-site/modules/org.apache.clerezza$parent/builds/2011-06-12_21-54-18/archive/org.apache.clerezza/parent/0.2-incubating-SNAPSHOT/parent-0.2-incubating-SNAPSHOT.pom
[INFO] [scr:scr {execution: generate-scr-scrdescriptor}]
[INFO] Preparing surefire-report:report-only
[INFO] No goals needed for project - skipping
[INFO] Preparing plugin:report
[INFO] No goals needed for project - skipping
[INFO] [site:site {execution: default-site}]
[INFO] Skipped "Maven Surefire Report" report, file "surefire-report.html" already exists
for the English version.
[INFO] Generating "Project Team" report.
[INFO] Generating "Issue Tracking" report.
[INFO] Generating "Maven Surefire Report" report.
[WARNING] Unable to locate Test Source XRef to link to - DISABLED
[INFO] Generating "Dependency Management" report.
[INFO] snapshot org.apache.clerezza:integrationtest.web:0.5-incubating-SNAPSHOT: checking
for updates from apache
Downloading: http://repository.apache.org/content/groups/snapshots-group/org/apache/clerezza/integrationtest.web/0.5-incubating-SNAPSHOT/integrationtest.web-0.5-incubating-SNAPSHOT.pom
[INFO] Unable to find resource 'org.apache.clerezza:integrationtest.web:pom:0.5-incubating-SNAPSHOT'
in repository apache (http://repository.apache.org/content/groups/snapshots-group)
[INFO] snapshot org.apache.clerezza:integrationtest.web.performance:0.6-incubating-SNAPSHOT:
checking for updates from apache
Downloading: http://repository.apache.org/content/groups/snapshots-group/org/apache/clerezza/integrationtest.web.performance/0.6-incubating-SNAPSHOT/integrationtest.web.performance-0.6-incubating-SNAPSHOT.pom
[INFO] Unable to find resource 'org.apache.clerezza:integrationtest.web.performance:pom:0.6-incubating-SNAPSHOT'
in repository apache (http://repository.apache.org/content/groups/snapshots-group)
[INFO] snapshot org.apache.clerezza:platform.pagemanager:0.3-incubating-SNAPSHOT: checking
for updates from apache
Downloading: http://repository.apache.org/content/groups/snapshots-group/org/apache/clerezza/platform.pagemanager/0.3-incubating-SNAPSHOT/platform.pagemanager-0.3-incubating-SNAPSHOT.pom
[INFO] Unable to find resource 'org.apache.clerezza:platform.pagemanager:pom:0.3-incubating-SNAPSHOT'
in repository apache (http://repository.apache.org/content/groups/snapshots-group)
[INFO] snapshot org.apache.clerezza:rdf.sesame.parser:0.1-incubating-SNAPSHOT: checking for
updates from apache
Downloading: http://repository.apache.org/content/groups/snapshots-group/org/apache/clerezza/rdf.sesame.parser/0.1-incubating-SNAPSHOT/rdf.sesame.parser-0.1-incubating-SNAPSHOT.pom
[INFO] Unable to find resource 'org.apache.clerezza:rdf.sesame.parser:pom:0.1-incubating-SNAPSHOT'
in repository apache (http://repository.apache.org/content/groups/snapshots-group)
[INFO] snapshot org.apache.clerezza:rdf.sesame.storage:0.13-incubating-SNAPSHOT: checking
for updates from apache
Downloading: http://repository.apache.org/content/groups/snapshots-group/org/apache/clerezza/rdf.sesame.storage/0.13-incubating-SNAPSHOT/rdf.sesame.storage-0.13-incubating-SNAPSHOT.pom
[INFO] Unable to find resource 'org.apache.clerezza:rdf.sesame.storage:pom:0.13-incubating-SNAPSHOT'
in repository apache (http://repository.apache.org/content/groups/snapshots-group)
[INFO] snapshot org.apache.clerezza:utils.imagemagick:0.5-incubating-SNAPSHOT: checking for
updates from apache
[INFO] snapshot org.apache.clerezza:web.resources.extjs:0.4-incubating-SNAPSHOT: checking
for updates from apache
Downloading: http://repository.apache.org/content/groups/snapshots-group/org/apache/clerezza/web.resources.extjs/0.4-incubating-SNAPSHOT/web.resources.extjs-0.4-incubating-SNAPSHOT.pom
[INFO] Unable to find resource 'org.apache.clerezza:web.resources.extjs:pom:0.4-incubating-SNAPSHOT'
in repository apache (http://repository.apache.org/content/groups/snapshots-group)
[INFO] snapshot org.apache.clerezza.ext:org.jruby:0.3-incubating-SNAPSHOT: checking for updates
from apache
[INFO] snapshot org.apache.clerezza:org.apache.clerezza.parent:0.2-incubating-SNAPSHOT: checking
for updates from apache
[INFO] snapshot org.apache.clerezza.ext:org.openrdf.sesame:0.5-incubating-SNAPSHOT: checking
for updates from apache
[INFO] snapshot org.apache.clerezza.scala:scala-compiler-osgi:0.1-incubating-SNAPSHOT: checking
for updates from apache
[INFO] snapshot org.apache.clerezza.scala:scala-library-osgi:0.1-incubating-SNAPSHOT: checking
for updates from apache
[INFO] Generating "Dependencies" report.
[INFO] Generating "Project Plugins" report.
[INFO] Generating "PMD Report" report.
[WARNING] Unable to locate Source XRef to link to - DISABLED
[INFO] Generating "Continuous Integration" report.
[INFO] Generating "JaxRs Report" report.
[INFO] Generating "Plugin Management" report.
[INFO] snapshot org.apache.clerezza:maven-pladoc-plugin.core:0.2-incubating-SNAPSHOT: checking
for updates from apache-plugin-snapshot
Downloading: http://repository.apache.org/content/groups/snapshots-group/org/apache/clerezza/maven-pladoc-plugin.core/0.2-incubating-SNAPSHOT/maven-pladoc-plugin.core-0.2-incubating-SNAPSHOT.pom
[INFO] Unable to find resource 'org.apache.clerezza:maven-pladoc-plugin.core:pom:0.2-incubating-SNAPSHOT'
in repository apache-plugin-snapshot (http://repository.apache.org/content/groups/snapshots-group)
[INFO] Generating "Mailing Lists" report.
[INFO] Generating "Source Repository" report.
[INFO] Generating "Project Summary" report.
[INFO] Generating "About" report.
[INFO] Generating "Project License" report.
[INFO] Generating "Dependency Convergence" report.
[INFO] Generating "CPD Report" report.
[WARNING] Unable to locate Source XRef to link to - DISABLED
[JENKINS] Archiving site from <https://builds.apache.org/job/clerezza-site/org.apache.clerezza$parent/ws/target/site>
to /home/hudson/hudson/jobs/clerezza-site/site
[INFO] [site:deploy {execution: default-deploy}]
scp://people.apache.org/www/incubator.apache.org/clerezza/mvn-site/ - Session: Connection
refused
scp://people.apache.org/www/incubator.apache.org/clerezza/mvn-site/ - Session: Disconnecting
 
scp://people.apache.org/www/incubator.apache.org/clerezza/mvn-site/ - Session: Disconnected
[INFO] ------------------------------------------------------------------------
[ERROR] BUILD ERROR
[INFO] ------------------------------------------------------------------------
[INFO] Error uploading site

Embedded error: Cannot connect. Reason: Auth fail
[INFO] ------------------------------------------------------------------------
[INFO] For more information, run Maven with the -e switch
[INFO] ------------------------------------------------------------------------
[INFO] Total time: 46 seconds
[INFO] Finished at: Sun Jun 12 14:55:33 PDT 2011
[INFO] Final Memory: 88M/443M
[INFO] ------------------------------------------------------------------------


Mime
View raw message