incubator-chukwa-dev mailing list archives

Site index · List index
Message view « Date » · « Thread »
Top « Date » · « Thread »
From Apache Jenkins Server <jenk...@builds.apache.org>
Subject Build failed in Jenkins: Chukwa-trunk #447
Date Mon, 25 Jun 2012 01:49:15 GMT
See <https://builds.apache.org/job/Chukwa-trunk/447/changes>

Changes:

[eyang] CHUKWA-640.  Revert changes to async adaptor registration.

------------------------------------------
[...truncated 1068 lines...]
AU        bin/stop-collectors.sh
AU        bin/slaves.sh
A         bin/downSampling.sh
AU        bin/start-data-processors.sh
AU        bin/stop-agents.sh
AU        bin/start-collectors.sh
AU        bin/stop-chukwa.sh
A         README.txt
 U        .
At revision 1353378
[trunk] $ /home/jenkins/jenkins-slave/tools/Maven/maven-3.0.4/bin/mvn clean package
[INFO] Scanning for projects...
[WARNING] 
[WARNING] Some problems were encountered while building the effective model for org.apache.incubator:chukwa:jar:0.6.0
[WARNING] 'dependencies.dependency.systemPath' for com.josephoconnell.html:html-filter:jar
should not point at files within the project directory, ${basedir}/lib/html-filter-1.0.jar
will be unresolvable by dependent projects @ line 99, column 25
[WARNING] 'dependencies.dependency.systemPath' for edu.berkeley.confspell:confspellcheck:jar
should not point at files within the project directory, ${basedir}/lib/confspellcheck.jar
will be unresolvable by dependent projects @ line 106, column 25
[WARNING] 'dependencies.dependency.systemPath' for com.mdimension:jchronic:jar should not
point at files within the project directory, ${basedir}/lib/jchronic-0.2.3.jar will be unresolvable
by dependent projects @ line 113, column 25
[WARNING] 'dependencies.dependency.systemPath' for org.apache.log4j:NagiosAppender:jar should
not point at files within the project directory, ${basedir}/lib/NagiosAppender-1.5.0.jar will
be unresolvable by dependent projects @ line 120, column 25
[WARNING] 'dependencies.dependency.systemPath' for org.hyperic:sigar:jar should not point
at files within the project directory, ${basedir}/lib/sigar.jar will be unresolvable by dependent
projects @ line 127, column 25
[WARNING] 
[WARNING] It is highly recommended to fix these problems because they threaten the stability
of your build.
[WARNING] 
[WARNING] For this reason, future Maven versions might no longer support building such malformed
projects.
[WARNING] 
[INFO]                                                                         
[INFO] ------------------------------------------------------------------------
[INFO] Building Apache Chukwa 0.6.0
[INFO] ------------------------------------------------------------------------
[INFO] 
[INFO] --- maven-clean-plugin:2.4.1:clean (default-clean) @ chukwa ---
[INFO] 
[INFO] --- maven-antrun-plugin:1.4:run (setup) @ chukwa ---
project.artifactId
[INFO] Executing tasks
    [mkdir] Created dir: <https://builds.apache.org/job/Chukwa-trunk/ws/trunk/target>
    [mkdir] Created dir: <https://builds.apache.org/job/Chukwa-trunk/ws/trunk/target/clover>
[INFO] Executed tasks
[INFO] 
[INFO] --- maven-resources-plugin:2.4.3:copy-resources (copy-configuration) @ chukwa ---
[INFO] Using 'UTF-8' encoding to copy filtered resources.
[INFO] Copying 22 resources
[INFO] 
[INFO] --- maven-resources-plugin:2.4.3:resources (default-resources) @ chukwa ---
[INFO] Using 'UTF-8' encoding to copy filtered resources.
[INFO] skip non existing resourceDirectory <https://builds.apache.org/job/Chukwa-trunk/ws/trunk/src/main/resources>
[INFO] 
[INFO] --- maven-compiler-plugin:2.3.2:compile (default-compile) @ chukwa ---
[INFO] Compiling 298 source files to <https://builds.apache.org/job/Chukwa-trunk/ws/trunk/target/classes>
[INFO] 
[INFO] --- maven-antrun-plugin:1.4:run (test-setup) @ chukwa ---
project.artifactId
[INFO] Executing tasks
    [mkdir] Created dir: <https://builds.apache.org/job/Chukwa-trunk/ws/trunk/target/test/var>
    [mkdir] Created dir: <https://builds.apache.org/job/Chukwa-trunk/ws/trunk/target/test/var/log>
    [mkdir] Created dir: <https://builds.apache.org/job/Chukwa-trunk/ws/trunk/target/test/var/run>
     [copy] Copying 3 files to <https://builds.apache.org/job/Chukwa-trunk/ws/trunk/target/test/var/log>
     [copy] Copying 1 file to <https://builds.apache.org/job/Chukwa-trunk/ws/trunk/target/test/conf>
     [copy] Copying 1 file to <https://builds.apache.org/job/Chukwa-trunk/ws/trunk/target/test/conf>
     [copy] Copying 1 file to <https://builds.apache.org/job/Chukwa-trunk/ws/trunk/target/test/conf>
     [copy] Copying 1 file to <https://builds.apache.org/job/Chukwa-trunk/ws/trunk/target/test/classes>
     [copy] Copying 1 file to <https://builds.apache.org/job/Chukwa-trunk/ws/trunk/target/test/conf>
     [copy] Copying 1 file to <https://builds.apache.org/job/Chukwa-trunk/ws/trunk/target/test/conf>
[INFO] Executed tasks
[INFO] 
[INFO] --- maven-resources-plugin:2.4.3:testResources (default-testResources) @ chukwa ---
[INFO] Using 'UTF-8' encoding to copy filtered resources.
[INFO] Copying 6 resources
[INFO] 
[INFO] --- maven-compiler-plugin:2.3.2:testCompile (default-testCompile) @ chukwa ---
[INFO] Compiling 92 source files to <https://builds.apache.org/job/Chukwa-trunk/ws/trunk/target/test-classes>
[INFO] 
[INFO] --- maven-surefire-plugin:2.10:test (default-test) @ chukwa ---
[INFO] Surefire report directory: <https://builds.apache.org/job/Chukwa-trunk/ws/trunk/target/test-reports>

-------------------------------------------------------
 T E S T S
-------------------------------------------------------

-------------------------------------------------------
 T E S T S
-------------------------------------------------------
Running org.apache.hadoop.chukwa.extraction.demux.TestPostDemuxTrigger
Tests run: 2, Failures: 0, Errors: 0, Skipped: 0, Time elapsed: 0.788 sec
Running org.apache.hadoop.chukwa.extraction.demux.TestDemux
Tests run: 1, Failures: 0, Errors: 0, Skipped: 0, Time elapsed: 7.221 sec
Running org.apache.hadoop.chukwa.extraction.demux.TestDemuxManager
Tests run: 6, Failures: 0, Errors: 0, Skipped: 0, Time elapsed: 5.76 sec
Running org.apache.hadoop.chukwa.extraction.demux.TestDemuxMapperConfigs
Tests run: 1, Failures: 0, Errors: 0, Skipped: 0, Time elapsed: 0.389 sec
Running org.apache.hadoop.chukwa.extraction.demux.TestDemuxReducerConfigs
Tests run: 1, Failures: 0, Errors: 0, Skipped: 0, Time elapsed: 0.379 sec
Running org.apache.hadoop.chukwa.extraction.demux.processor.mapper.TestAbtractProcessor
Tests run: 1, Failures: 0, Errors: 0, Skipped: 0, Time elapsed: 0.122 sec
Running org.apache.hadoop.chukwa.extraction.demux.processor.mapper.TestPsOutput
Tests run: 1, Failures: 0, Errors: 0, Skipped: 0, Time elapsed: 0.029 sec
Running org.apache.hadoop.chukwa.extraction.demux.processor.mapper.TestTsProcessor
Tests run: 7, Failures: 0, Errors: 0, Skipped: 0, Time elapsed: 0.584 sec
Running org.apache.hadoop.chukwa.extraction.demux.processor.mapper.TestHadoopLogProcessor
Tests run: 1, Failures: 0, Errors: 0, Skipped: 0, Time elapsed: 1.499 sec
Running org.apache.hadoop.chukwa.extraction.demux.processor.mapper.TestJobLogEntry
Tests run: 1, Failures: 0, Errors: 0, Skipped: 0, Time elapsed: 0.247 sec
Running org.apache.hadoop.chukwa.extraction.demux.processor.mapper.TestLog4JMetricsContextChukwaRecord
Tests run: 1, Failures: 0, Errors: 0, Skipped: 0, Time elapsed: 0.062 sec
Running org.apache.hadoop.chukwa.TestChunkBuilder
Tests run: 1, Failures: 0, Errors: 0, Skipped: 0, Time elapsed: 0.11 sec
Running org.apache.hadoop.chukwa.util.TestCreateRecordFile
Tests run: 1, Failures: 0, Errors: 0, Skipped: 0, Time elapsed: 0.681 sec
Running org.apache.hadoop.chukwa.util.TestXSSFilter
Tests run: 1, Failures: 0, Errors: 0, Skipped: 0, Time elapsed: 0.121 sec
Running org.apache.hadoop.chukwa.util.TestCopySequenceFile
Tests run: 1, Failures: 0, Errors: 0, Skipped: 0, Time elapsed: 0.585 sec
Running org.apache.hadoop.chukwa.util.TestDumpChunks
Tests run: 1, Failures: 0, Errors: 0, Skipped: 0, Time elapsed: 0.63 sec
Running org.apache.hadoop.chukwa.util.TestRecordConsts
Tests run: 2, Failures: 0, Errors: 0, Skipped: 0, Time elapsed: 0.028 sec
Running org.apache.hadoop.chukwa.util.TestCRValidator
Tests run: 3, Failures: 0, Errors: 0, Skipped: 0, Time elapsed: 0.587 sec
Running org.apache.hadoop.chukwa.util.TestFilter
Tests run: 2, Failures: 0, Errors: 0, Skipped: 0, Time elapsed: 0.117 sec
Running org.apache.hadoop.chukwa.hicc.TestChart
Tests run: 3, Failures: 0, Errors: 0, Skipped: 0, Time elapsed: 0.123 sec
Running org.apache.hadoop.chukwa.rest.resource.TestClientTrace
Running org.apache.hadoop.chukwa.rest.resource.TestUserResource
Running org.apache.hadoop.chukwa.rest.resource.TestViewResource
Running org.apache.hadoop.chukwa.rest.resource.TestWidgetResource
Running org.apache.hadoop.chukwa.database.TestMacro
Tests run: 2, Failures: 0, Errors: 0, Skipped: 0, Time elapsed: 0.144 sec
Running org.apache.hadoop.chukwa.datacollection.collector.TestCollector
Tests run: 1, Failures: 0, Errors: 0, Skipped: 0, Time elapsed: 2.648 sec
Running org.apache.hadoop.chukwa.datacollection.collector.TestBackpressure
Tests run: 1, Failures: 0, Errors: 0, Skipped: 0, Time elapsed: 41.66 sec
Running org.apache.hadoop.chukwa.datacollection.collector.TestDelayedAcks
Tests run: 3, Failures: 0, Errors: 0, Skipped: 0, Time elapsed: 44.643 sec
Running org.apache.hadoop.chukwa.datacollection.collector.TestAdaptorTimeout
Tests run: 1, Failures: 0, Errors: 0, Skipped: 0, Time elapsed: 36.943 sec
Running org.apache.hadoop.chukwa.datacollection.collector.TestFailedCollectorAck
Tests run: 1, Failures: 0, Errors: 0, Skipped: 0, Time elapsed: 27.174 sec
Running org.apache.hadoop.chukwa.datacollection.adaptor.TestDirTailingAdaptor
Tests run: 2, Failures: 0, Errors: 0, Skipped: 0, Time elapsed: 23.505 sec
Running org.apache.hadoop.chukwa.datacollection.adaptor.filetailer.TestFileTailingAdaptors
Tests run: 3, Failures: 0, Errors: 0, Skipped: 0, Time elapsed: 10.893 sec
Running org.apache.hadoop.chukwa.datacollection.adaptor.filetailer.TestLogRotate
Tests run: 1, Failures: 0, Errors: 0, Skipped: 0, Time elapsed: 11.696 sec
Running org.apache.hadoop.chukwa.datacollection.adaptor.filetailer.TestRawAdaptor
Tests run: 3, Failures: 0, Errors: 0, Skipped: 0, Time elapsed: 4.059 sec
Running org.apache.hadoop.chukwa.datacollection.adaptor.filetailer.TestCharFileTailingAdaptorUTF8
Tests run: 1, Failures: 0, Errors: 0, Skipped: 0, Time elapsed: 2.572 sec
Running org.apache.hadoop.chukwa.datacollection.adaptor.filetailer.TestFileExpirationPolicy
Tests run: 2, Failures: 0, Errors: 0, Skipped: 0, Time elapsed: 101.834 sec
Running org.apache.hadoop.chukwa.datacollection.adaptor.filetailer.TestFileTailingAdaptorBigRecord
Tests run: 1, Failures: 0, Errors: 0, Skipped: 0, Time elapsed: 40.597 sec
Running org.apache.hadoop.chukwa.datacollection.adaptor.filetailer.TestRCheckAdaptor
Tests run: 2, Failures: 0, Errors: 0, Skipped: 0, Time elapsed: 33.578 sec
Running org.apache.hadoop.chukwa.datacollection.adaptor.filetailer.TestStartAtOffset
Tests run: 1, Failures: 0, Errors: 0, Skipped: 0, Time elapsed: 0.653 sec
Running org.apache.hadoop.chukwa.datacollection.adaptor.TestExecAdaptor
Tests run: 2, Failures: 0, Errors: 0, Skipped: 0, Time elapsed: 5.711 sec
Running org.apache.hadoop.chukwa.datacollection.adaptor.jms.TestJMSAdaptor
Tests run: 4, Failures: 0, Errors: 0, Skipped: 0, Time elapsed: 5.65 sec
Running org.apache.hadoop.chukwa.datacollection.adaptor.jms.TestJMSMessagePropertyTransformer
Tests run: 9, Failures: 0, Errors: 0, Skipped: 0, Time elapsed: 10.26 sec
Running org.apache.hadoop.chukwa.datacollection.adaptor.TestBufferingWrappers
Tests run: 2, Failures: 0, Errors: 0, Skipped: 0, Time elapsed: 8.793 sec
Running org.apache.hadoop.chukwa.datacollection.adaptor.TestUDPAdaptor
Tests run: 1, Failures: 0, Errors: 0, Skipped: 0, Time elapsed: 0.115 sec
Running org.apache.hadoop.chukwa.datacollection.adaptor.TestFileAdaptor
Tests run: 2, Failures: 0, Errors: 0, Skipped: 0, Time elapsed: 2.17 sec
Running org.apache.hadoop.chukwa.datacollection.adaptor.TestSyslogAdaptor
Tests run: 1, Failures: 0, Errors: 0, Skipped: 0, Time elapsed: 0.381 sec
Running org.apache.hadoop.chukwa.datacollection.writer.TestSocketTee
Tests run: 1, Failures: 0, Errors: 0, Skipped: 0, Time elapsed: 0.358 sec
Running org.apache.hadoop.chukwa.datacollection.writer.TestHBaseWriter
Tests run: 1, Failures: 1, Errors: 0, Skipped: 0, Time elapsed: 29.186 sec <<< FAILURE!
Running org.apache.hadoop.chukwa.datacollection.writer.TestClientAck
Tests run: 1, Failures: 0, Errors: 0, Skipped: 0, Time elapsed: 18.101 sec
Running org.apache.hadoop.chukwa.datacollection.writer.TestChukwaWriters
Tests run: 3, Failures: 0, Errors: 0, Skipped: 0, Time elapsed: 23.684 sec
Running org.apache.hadoop.chukwa.datacollection.controller.TestAgentClient
Tests run: 1, Failures: 0, Errors: 0, Skipped: 0, Time elapsed: 0.55 sec
Running org.apache.hadoop.chukwa.datacollection.TestOffsetStatsManager
Tests run: 3, Failures: 0, Errors: 0, Skipped: 0, Time elapsed: 13.106 sec
Running org.apache.hadoop.chukwa.datacollection.sender.TestRetryListOfCollectors
Tests run: 2, Failures: 0, Errors: 0, Skipped: 0, Time elapsed: 0.356 sec
Running org.apache.hadoop.chukwa.datacollection.sender.TestAcksOnFailure
Tests run: 1, Failures: 0, Errors: 0, Skipped: 0, Time elapsed: 3.705 sec
Running org.apache.hadoop.chukwa.datacollection.connector.TestFailedCollector
Tests run: 1, Failures: 0, Errors: 0, Skipped: 0, Time elapsed: 3.634 sec
Running org.apache.hadoop.chukwa.datacollection.agent.TestCmd
Tests run: 4, Failures: 0, Errors: 0, Skipped: 0, Time elapsed: 7.007 sec
Running org.apache.hadoop.chukwa.datacollection.agent.TestAgentConfig
Tests run: 2, Failures: 0, Errors: 0, Skipped: 0, Time elapsed: 13.197 sec
Running org.apache.hadoop.chukwa.datacollection.agent.rest.TestAdaptorController
Tests run: 14, Failures: 0, Errors: 14, Skipped: 0, Time elapsed: 0.84 sec <<< FAILURE!
Running org.apache.hadoop.chukwa.datacollection.agent.TestAgent
Tests run: 3, Failures: 0, Errors: 0, Skipped: 0, Time elapsed: 162.917 sec
Running org.apache.hadoop.chukwa.dataloader.TestSocketDataLoader
Tests run: 1, Failures: 0, Errors: 0, Skipped: 0, Time elapsed: 0.398 sec
Running org.apache.hadoop.chukwa.tools.backfilling.TestBackfillingLoader
Tests run: 4, Failures: 0, Errors: 0, Skipped: 0, Time elapsed: 73.859 sec
Running org.apache.hadoop.chukwa.inputtools.log4j.TestChukwaDailyRollingFileAppender
Tests run: 1, Failures: 0, Errors: 0, Skipped: 0, Time elapsed: 2.146 sec
Running org.apache.hadoop.chukwa.inputtools.log4j.TestTaskLogAppender
Tests run: 1, Failures: 0, Errors: 0, Skipped: 0, Time elapsed: 2.163 sec
Running org.apache.hadoop.chukwa.inputtools.TestInputFormat
Tests run: 1, Failures: 0, Errors: 0, Skipped: 0, Time elapsed: 0.615 sec

Results :

Failed tests:   testWriters(org.apache.hadoop.chukwa.datacollection.writer.TestHBaseWriter):
Test

Tests in error: 
  testGetPlainText(org.apache.hadoop.chukwa.datacollection.agent.rest.TestAdaptorController)
  testGetXml(org.apache.hadoop.chukwa.datacollection.agent.rest.TestAdaptorController): Agent
already running; aborting
  testGetInvalidViewType(org.apache.hadoop.chukwa.datacollection.agent.rest.TestAdaptorController):
Agent already running; aborting
  testDeleteAdaptor(org.apache.hadoop.chukwa.datacollection.agent.rest.TestAdaptorController):
Agent already running; aborting
  testAddAdaptor(org.apache.hadoop.chukwa.datacollection.agent.rest.TestAdaptorController):
Agent already running; aborting
  testPrintNvp(org.apache.hadoop.chukwa.datacollection.agent.rest.TestAdaptorController):
Agent already running; aborting
  testPrintNvpIndented(org.apache.hadoop.chukwa.datacollection.agent.rest.TestAdaptorController):
Agent already running; aborting
  testPrintNvpIndentedWithDash(org.apache.hadoop.chukwa.datacollection.agent.rest.TestAdaptorController):
Agent already running; aborting
  testPrintNvpIndentedWithStringLiteral(org.apache.hadoop.chukwa.datacollection.agent.rest.TestAdaptorController):
Agent already running; aborting
  testPrintStartTag(org.apache.hadoop.chukwa.datacollection.agent.rest.TestAdaptorController):
Agent already running; aborting
  testPrintStartTagWithAttributes(org.apache.hadoop.chukwa.datacollection.agent.rest.TestAdaptorController):
Agent already running; aborting
  testPrintElement(org.apache.hadoop.chukwa.datacollection.agent.rest.TestAdaptorController):
Agent already running; aborting
  testPrintElementWithAttributes(org.apache.hadoop.chukwa.datacollection.agent.rest.TestAdaptorController):
Agent already running; aborting
  testPrintEndTag(org.apache.hadoop.chukwa.datacollection.agent.rest.TestAdaptorController):
Agent already running; aborting

Tests run: 129, Failures: 1, Errors: 14, Skipped: 0

[INFO] ------------------------------------------------------------------------
[INFO] BUILD FAILURE
[INFO] ------------------------------------------------------------------------
[INFO] Total time: 14:29.709s
[INFO] Finished at: Mon Jun 25 01:49:07 UTC 2012
[INFO] Final Memory: 29M/194M
[INFO] ------------------------------------------------------------------------
[ERROR] Failed to execute goal org.apache.maven.plugins:maven-surefire-plugin:2.10:test (default-test)
on project chukwa: There are test failures.
[ERROR] 
[ERROR] Please refer to <https://builds.apache.org/job/Chukwa-trunk/ws/trunk/target/test-reports>
for the individual test results.
[ERROR] -> [Help 1]
[ERROR] 
[ERROR] To see the full stack trace of the errors, re-run Maven with the -e switch.
[ERROR] Re-run Maven using the -X switch to enable full debug logging.
[ERROR] 
[ERROR] For more information about the errors and possible solutions, please read the following
articles:
[ERROR] [Help 1] http://cwiki.apache.org/confluence/display/MAVEN/MojoFailureException
Build step 'Invoke top-level Maven targets' marked build as failure
Archiving artifacts
Recording test results
Updating CHUKWA-640

Mime
View raw message