From user-return-19368-apmail-cassandra-user-archive=cassandra.apache.org@cassandra.apache.org Tue Aug 2 06:52:57 2011 Return-Path: X-Original-To: apmail-cassandra-user-archive@www.apache.org Delivered-To: apmail-cassandra-user-archive@www.apache.org Received: from mail.apache.org (hermes.apache.org [140.211.11.3]) by minotaur.apache.org (Postfix) with SMTP id F286C694C for ; Tue, 2 Aug 2011 06:52:56 +0000 (UTC) Received: (qmail 13113 invoked by uid 500); 2 Aug 2011 06:52:54 -0000 Delivered-To: apmail-cassandra-user-archive@cassandra.apache.org Received: (qmail 12538 invoked by uid 500); 2 Aug 2011 06:52:43 -0000 Mailing-List: contact user-help@cassandra.apache.org; run by ezmlm Precedence: bulk List-Help: List-Unsubscribe: List-Post: List-Id: Reply-To: user@cassandra.apache.org Delivered-To: mailing list user@cassandra.apache.org Received: (qmail 12512 invoked by uid 99); 2 Aug 2011 06:52:38 -0000 Received: from nike.apache.org (HELO nike.apache.org) (192.87.106.230) by apache.org (qpsmtpd/0.29) with ESMTP; Tue, 02 Aug 2011 06:52:38 +0000 X-ASF-Spam-Status: No, hits=2.5 required=5.0 tests=HTML_FONT_FACE_BAD,HTML_MESSAGE,SPF_PASS X-Spam-Check-By: apache.org Received-SPF: pass (nike.apache.org: local policy) Received: from [122.224.216.65] (HELO hzvscan2.utstar.com.cn) (122.224.216.65) by apache.org (qpsmtpd/0.29) with ESMTP; Tue, 02 Aug 2011 06:52:30 +0000 Received: from cnmail01.cn.utstarcom.com (cnmail01.cn.utstarcom.com [172.18.22.151]) by hzvscan2.utstar.com.cn (8.13.8/8.13.8) with SMTP id p726puIe030499 for ; Tue, 2 Aug 2011 14:51:57 +0800 Received: from CNMAIL12.cn.utstarcom.com ([172.18.22.156]) by cnmail01.cn.utstarcom.com with Microsoft SMTPSVC(6.0.3790.3959); Tue, 2 Aug 2011 14:51:56 +0800 Content-class: urn:content-classes:message MIME-Version: 1.0 Content-Type: multipart/alternative; boundary="----_=_NextPart_001_01CC50E0.AB2F1A69" X-MimeOLE: Produced By Microsoft Exchange V6.5 Subject: cassandra compile Date: Tue, 2 Aug 2011 14:51:52 +0800 Message-ID: <7DA4B654C7FEB24C9998EE4867BEE93EBEB41F@CNMAIL12.cn.utstarcom.com> X-MS-Has-Attach: X-MS-TNEF-Correlator: Thread-Topic: cassandra compile Thread-Index: AcxQuM/0M5JWqPzfSViVomvbR9CfIQAAQceAAAmwk9A= References: From: "Donna Li" To: X-OriginalArrivalTime: 02 Aug 2011 06:51:56.0528 (UTC) FILETIME=[AB645F00:01CC50E0] X-Virus-Checked: Checked by ClamAV on apache.org This is a multi-part message in MIME format. ------_=_NextPart_001_01CC50E0.AB2F1A69 Content-Type: text/plain; charset="gb2312" Content-Transfer-Encoding: quoted-printable All: I use ant to compile cassandra. It is failure on ivy download, = error is =A1=B0Connection refused=A1=B1, but I can get it from ie. So I = download it and put in on dir /build. Then I compile again, it is = blocked on ivy dependency download. I download the apache-rat-0.6.jar, = commons-logging-1.1.1.jar, junit-4.6.jar, paranamer-ant-2.1.jar. I put = these files to /build/lib and modify build/ivy.xml to prevent download. = There still have errors, I wonder why the download is failure? If I = download these files by hand, how to build successfully. =20 check-avro-generate: =20 BUILD FAILED E:\work\research\cassandra\apache-cassandra-0.6.3-src\apache-cassandra-0.= 6.3-src \build.xml:170: taskdef A class needed by class = com.thoughtworks.paranamer.ant.P aranamerGeneratorTask cannot be found: = com/thoughtworks/paranamer/generator/Para namerGenerator =20 Best Regards Donna li =20 =20 ________________________________ =B7=A2=BC=FE=C8=CB: Donna Li=20 =B7=A2=CB=CD=CA=B1=BC=E4: 2011=C4=EA8=D4=C22=C8=D5 10:16 =CA=D5=BC=FE=C8=CB: 'user@cassandra.apache.org' =D6=F7=CC=E2: cassandra compile =20 =20 All: I compile the cassandra source code by ant. The following error print: =20 BUILD FAILED E:\work\research\cassandra\apache-cassandra-0.6.3-src\apache-cassandra-0.= 6.3-src \build.xml:170: taskdef A class needed by class = com.thoughtworks.paranamer.ant.P aranamerGeneratorTask cannot be found: = com/thoughtworks/paranamer/generator/Para namerGenerator =20 How to resolve the problem? Thanks! =20 =20 Best Regards Donna li ------_=_NextPart_001_01CC50E0.AB2F1A69 Content-Type: text/html; charset="gb2312" Content-Transfer-Encoding: quoted-printable

All:

        = I use ant to compile cassandra. It is failure on ivy download, error is = =A1=B0Connection refused=A1=B1, but I can get it from ie. So I download it and put in on = dir /build. Then I compile again, it is blocked on ivy dependency download. I = download the apache-rat-0.6.jar, commons-logging-1.1.1.jar, = junit-4.6.jar, paranamer-ant-2.1.jar. I put these files to /build/lib and modify build/ivy.xml to prevent = download. There still have errors, I wonder why the download is failure? If I download = these files by hand, how to build successfully.

 

check-avro-generate:

 

BUILD FAILED

E:\work\research\cassandra\apache-cassandra-0.6.3-src\apache-cassandra-0.6.3-src=

\build.xml:170: taskdef A class needed by class com.thoughtworks.paranamer.ant.P

aranamerGeneratorTask cannot be found: com/thoughtworks/paranamer/generator/Para

namerGenerator

 

Best Regards

Donna li

 <= /span>

 <= /span>


=B7=A2=BC=FE= =C8=CB: Donna Li =
=B7=A2=CB=CD=CA=B1=BC=E4: 2011=C4=EA8=D4=C22=C8=D5 10:16
=CA=D5=BC=FE=C8=CB: = 'user@cassandra.apache.org'
=D6=F7=CC=E2: cassandra compile

 

 <= /span>

All:

I compile the cassandra source code by ant. The following = error print:

 

BUILD FAILED

E:\work\research\cassandra\apache-cassandra-0.6.3-src\apache-cassandra-0.6.3-src=

\build.xml:170: taskdef A class needed by class com.thoughtworks.paranamer.ant.P

aranamerGeneratorTask cannot be found: com/thoughtworks/paranamer/generator/Para

namerGenerator

 

How to resolve the problem? = Thanks!

 

 

Best Regards

Donna li

------_=_NextPart_001_01CC50E0.AB2F1A69--