incubator-cassandra-dev mailing list archives

Site index · List index
Message view « Date » · « Thread »
Top « Date » · « Thread »
From Apache Jenkins Server <jenk...@builds.apache.org>
Subject Build failed in Jenkins: Cassandra-quick #1400
Date Sun, 23 Sep 2012 08:12:38 GMT
See <https://builds.apache.org/job/Cassandra-quick/1400/>

------------------------------------------
[...truncated 391 lines...]
    [junit] Test org.apache.cassandra.io.LazilyCompactedRowTest FAILED (timeout)
    [junit] Testsuite: org.apache.cassandra.io.compress.CompressedRandomAccessReaderTest
    [junit] Tests run: 3, Failures: 0, Errors: 0, Time elapsed: 2.696 sec
    [junit] 
    [junit] ------------- Standard Error -----------------
    [junit]  WARN 08:03:09,701 open(null, O_RDONLY) failed, errno (14).
    [junit] ------------- ---------------- ---------------
    [junit] Testsuite: org.apache.cassandra.io.sstable.DescriptorTest
    [junit] Tests run: 3, Failures: 0, Errors: 0, Time elapsed: 0.064 sec
    [junit] 
    [junit] Testsuite: org.apache.cassandra.io.sstable.IndexHelperTest
    [junit] Tests run: 1, Failures: 0, Errors: 0, Time elapsed: 0.062 sec
    [junit] 
    [junit] Testsuite: org.apache.cassandra.io.sstable.LegacySSTableTest
    [junit] Tests run: 1, Failures: 0, Errors: 0, Time elapsed: 20.385 sec
    [junit] 
    [junit] Testsuite: org.apache.cassandra.io.sstable.SSTableMetadataSerializerTest
    [junit] Tests run: 1, Failures: 0, Errors: 0, Time elapsed: 0.141 sec
    [junit] 
    [junit] Testsuite: org.apache.cassandra.io.sstable.SSTableReaderTest
    [junit] Tests run: 8, Failures: 0, Errors: 0, Time elapsed: 38.088 sec
    [junit] 
    [junit] ------------- Standard Error -----------------
    [junit]  WARN 08:04:03,475 setting live ratio to maximum of 64.0 instead of 80.0
    [junit]  WARN 08:04:08,376 setting live ratio to maximum of 64.0 instead of 67.56112852664577
    [junit] ------------- ---------------- ---------------
    [junit] Testsuite: org.apache.cassandra.io.sstable.SSTableSimpleWriterTest
    [junit] Tests run: 1, Failures: 0, Errors: 0, Time elapsed: 23.637 sec
    [junit] 
    [junit] Testsuite: org.apache.cassandra.io.sstable.SSTableTest
    [junit] Tests run: 2, Failures: 0, Errors: 0, Time elapsed: 26.287 sec
    [junit] 
    [junit] Testsuite: org.apache.cassandra.io.util.BufferedRandomAccessFileTest
    [junit] Tests run: 18, Failures: 0, Errors: 0, Time elapsed: 5.669 sec
    [junit] 
    [junit] Testsuite: org.apache.cassandra.locator.DynamicEndpointSnitchTest
    [junit] Tests run: 1, Failures: 0, Errors: 0, Time elapsed: 2.139 sec
    [junit] 
    [junit] Testsuite: org.apache.cassandra.locator.EC2SnitchTest
    [junit] Tests run: 2, Failures: 0, Errors: 0, Time elapsed: 1.014 sec
    [junit] 
    [junit] Testsuite: org.apache.cassandra.locator.NetworkTopologyStrategyTest
    [junit] Tests run: 3, Failures: 0, Errors: 0, Time elapsed: 1.194 sec
    [junit] 
    [junit] Testsuite: org.apache.cassandra.locator.OldNetworkTopologyStrategyTest
    [junit] Tests run: 8, Failures: 0, Errors: 0, Time elapsed: 11.667 sec
    [junit] 
    [junit] ------------- Standard Output ---------------
    [junit] toStream : [(158873535527910577765226390751398592512,0], (0,34028236692093846346337460743176821145]]
    [junit] toFetch : [(127605887595351923798765477786913079296,148873535527910577765226390751398592512]]
    [junit] toStreamExpected : [(158873535527910577765226390751398592512,0], (0,34028236692093846346337460743176821145]]
    [junit] toFetchExpected : [(127605887595351923798765477786913079296,148873535527910577765226390751398592512]]
    [junit] ------------- ---------------- ---------------
    [junit] Testsuite: org.apache.cassandra.locator.ReplicationStrategyEndpointCacheTest
    [junit] Tests run: 2, Failures: 0, Errors: 0, Time elapsed: 13.509 sec
    [junit] 
    [junit] Testsuite: org.apache.cassandra.locator.SimpleStrategyTest
    [junit] Tests run: 4, Failures: 0, Errors: 0, Time elapsed: 11.586 sec
    [junit] 
    [junit] Testsuite: org.apache.cassandra.locator.TokenMetadataTest
    [junit] Tests run: 3, Failures: 0, Errors: 0, Time elapsed: 0.955 sec
    [junit] 
    [junit] Testsuite: org.apache.cassandra.service.AntiEntropyServiceCounterTest
    [junit] Tests run: 6, Failures: 0, Errors: 0, Time elapsed: 19.77 sec
    [junit] 
    [junit] ------------- Standard Error -----------------
    [junit]  WARN 08:06:11,941 No host ID found, created 5551552f-c26e-47fa-a8e5-285d95921eca
(Note: This should happen exactly once per node).
    [junit]  WARN 08:06:12,448 Generated random token [Token(bytes[403b2948c40f0c360517d333004b086a])].
Random tokens will result in an unbalanced ring; see http://wiki.apache.org/cassandra/Operations
    [junit] ------------- ---------------- ---------------
    [junit] Testsuite: org.apache.cassandra.service.AntiEntropyServiceStandardTest
    [junit] Tests run: 6, Failures: 0, Errors: 0, Time elapsed: 15.366 sec
    [junit] 
    [junit] ------------- Standard Error -----------------
    [junit]  WARN 08:06:30,372 No host ID found, created af8d9cb8-55d6-41b9-9efe-bcde2491e2df
(Note: This should happen exactly once per node).
    [junit]  WARN 08:06:30,722 Generated random token [Token(bytes[a184e69da5261ae65050439eb34843d6])].
Random tokens will result in an unbalanced ring; see http://wiki.apache.org/cassandra/Operations
    [junit] ------------- ---------------- ---------------
    [junit] Testsuite: org.apache.cassandra.service.CassandraServerTest
    [junit] Tests run: 1, Failures: 0, Errors: 0, Time elapsed: 9.652 sec
    [junit] 
    [junit] Testsuite: org.apache.cassandra.service.EmbeddedCassandraServiceTest
    [junit] Tests run: 1, Failures: 0, Errors: 0, Time elapsed: 10.795 sec
    [junit] 
    [junit] ------------- Standard Error -----------------
    [junit]  WARN 08:06:56,122 Unable to lock JVM memory (ENOMEM). This can result in part
of the JVM being swapped out, especially with mmapped I/O enabled. Increase RLIMIT_MEMLOCK
or run Cassandra as root.
    [junit]  WARN 08:06:56,485 No host ID found, created ab3ae1bd-c0e8-445a-836a-54ef4df34684
(Note: This should happen exactly once per node).
    [junit]  WARN 08:06:56,761 Generated random token [Token(bytes[f0fe610b186b7224348d4be1dcc64fdd])].
Random tokens will result in an unbalanced ring; see http://wiki.apache.org/cassandra/Operations
    [junit] ------------- ---------------- ---------------
    [junit] Testsuite: org.apache.cassandra.service.InitClientTest
    [junit] Tests run: 1, Failures: 0, Errors: 0, Time elapsed: 1.343 sec
    [junit] 
    [junit] Testsuite: org.apache.cassandra.service.LeaveAndBootstrapTest
    [junit] Tests run: 6, Failures: 0, Errors: 0, Time elapsed: 34.377 sec
    [junit] 
    [junit] ------------- Standard Error -----------------
    [junit]  WARN 08:07:31,964 Node /127.0.0.3 'leaving' token mismatch. Long network partition?
    [junit] ------------- ---------------- ---------------
    [junit] Testsuite: org.apache.cassandra.service.MoveTest
    [junit] Tests run: 3, Failures: 0, Errors: 0, Time elapsed: 25.242 sec
    [junit] 
    [junit] Testsuite: org.apache.cassandra.service.RelocateTest
    [junit] Testsuite: org.apache.cassandra.service.RelocateTest
    [junit] Tests run: 1, Failures: 0, Errors: 1, Time elapsed: 0 sec
    [junit] 
    [junit] Testcase: org.apache.cassandra.service.RelocateTest:testRelocationSuccess:	Caused
an ERROR
    [junit] Timeout occurred. Please note the time in the report does not reflect the time
until the timeout.
    [junit] junit.framework.AssertionFailedError: Timeout occurred. Please note the time in
the report does not reflect the time until the timeout.
    [junit] 
    [junit] 
    [junit] Test org.apache.cassandra.service.RelocateTest FAILED (timeout)
    [junit] Testsuite: org.apache.cassandra.service.RemoveTest
    [junit] Tests run: 3, Failures: 0, Errors: 0, Time elapsed: 33.454 sec
    [junit] 
    [junit] ------------- Standard Error -----------------
    [junit] ERROR 08:09:36,035 Stream failed because /127.0.0.6 died or was restarted/removed
(streams may still be active in background, but further streams won't be started)
    [junit]  WARN 08:09:36,036 Streaming from /127.0.0.6 failed
    [junit] ERROR 08:09:36,036 Stream failed because /127.0.0.6 died or was restarted/removed
(streams may still be active in background, but further streams won't be started)
    [junit]  WARN 08:09:36,036 Streaming from /127.0.0.6 failed
    [junit] ERROR 08:09:36,037 Stream failed because /127.0.0.6 died or was restarted/removed
(streams may still be active in background, but further streams won't be started)
    [junit]  WARN 08:09:36,037 Streaming from /127.0.0.6 failed
    [junit] ERROR 08:09:36,037 Stream failed because /127.0.0.6 died or was restarted/removed
(streams may still be active in background, but further streams won't be started)
    [junit]  WARN 08:09:36,037 Streaming from /127.0.0.6 failed
    [junit] ERROR 08:09:36,037 Stream failed because /127.0.0.6 died or was restarted/removed
(streams may still be active in background, but further streams won't be started)
    [junit]  WARN 08:09:36,037 Streaming from /127.0.0.6 failed
    [junit] ERROR 08:09:36,037 Stream failed because /127.0.0.6 died or was restarted/removed
(streams may still be active in background, but further streams won't be started)
    [junit]  WARN 08:09:36,038 Streaming from /127.0.0.6 failed
    [junit] ------------- ---------------- ---------------
    [junit] Testsuite: org.apache.cassandra.service.RowResolverTest
    [junit] Tests run: 8, Failures: 0, Errors: 0, Time elapsed: 11.6 sec
    [junit] 
    [junit] Testsuite: org.apache.cassandra.service.SerializationsTest
    [junit] Tests run: 2, Failures: 0, Errors: 0, Time elapsed: 16.432 sec
    [junit] 
    [junit] Testsuite: org.apache.cassandra.service.StorageProxyTest
    [junit] Tests run: 4, Failures: 0, Errors: 0, Time elapsed: 14.462 sec
    [junit] 
    [junit] Testsuite: org.apache.cassandra.service.StorageServiceClientTest
    [junit] Tests run: 1, Failures: 0, Errors: 0, Time elapsed: 3.208 sec
    [junit] 
    [junit] Testsuite: org.apache.cassandra.service.StorageServiceServerTest
    [junit] Tests run: 4, Failures: 0, Errors: 0, Time elapsed: 5.552 sec
    [junit] 
    [junit] ------------- Standard Error -----------------
    [junit]  WARN 08:10:31,612 No host ID found, created e31c8cb3-ee60-41c8-9b4e-79d3541c12c4
(Note: This should happen exactly once per node).
    [junit]  WARN 08:10:33,188 Generated random token [Token(bytes[41de6294beae8d2ebd54456899eca064])].
Random tokens will result in an unbalanced ring; see http://wiki.apache.org/cassandra/Operations
    [junit] ------------- ---------------- ---------------
    [junit] Testsuite: org.apache.cassandra.streaming.BootstrapTest
    [junit] Tests run: 1, Failures: 0, Errors: 0, Time elapsed: 10.967 sec
    [junit] 
    [junit] Testsuite: org.apache.cassandra.streaming.SerializationsTest
    [junit] Tests run: 4, Failures: 0, Errors: 0, Time elapsed: 11.745 sec
    [junit] 
    [junit] Testsuite: org.apache.cassandra.streaming.StreamingTransferTest
    [junit] Tests run: 5, Failures: 0, Errors: 0, Time elapsed: 18.359 sec
    [junit] 
    [junit] ------------- Standard Error -----------------
    [junit]  WARN 08:11:11,723 No host ID found, created 033c6996-2355-41c4-bc14-4c6fff5876e2
(Note: This should happen exactly once per node).
    [junit]  WARN 08:11:12,157 Generated random token [Token(bytes[485d18e6de11dccc427ae015c7856c34])].
Random tokens will result in an unbalanced ring; see http://wiki.apache.org/cassandra/Operations
    [junit] ------------- ---------------- ---------------
    [junit] Testsuite: org.apache.cassandra.thrift.ThriftValidationTest
    [junit] Tests run: 4, Failures: 0, Errors: 0, Time elapsed: 12.79 sec
    [junit] 
    [junit] Testsuite: org.apache.cassandra.tools.SSTableExportTest
    [junit] Tests run: 7, Failures: 0, Errors: 0, Time elapsed: 13.484 sec
    [junit] 
    [junit] ------------- Standard Output ---------------
    [junit] Importing 1 keys...
    [junit] 1 keys imported successfully.
    [junit] [{"columns":[["636f6c4e616d65","76616c",1348387907366],["636f6c4e616d6531","76616c31",1348387907366]],"key":"726f7741","metadata":{"deletionInfo":{"markedForDeleteAt":0,"localDeletionTime":0}}}]
    [junit] ------------- ---------------- ---------------
    [junit] Testsuite: org.apache.cassandra.tools.SSTableImportTest
    [junit] Tests run: 7, Failures: 0, Errors: 0, Time elapsed: 11.875 sec
    [junit] 
    [junit] ------------- Standard Output ---------------
    [junit] Counting keys to import, please wait... (NOTE: to skip this use -n <num_keys>)
    [junit] Importing 2 keys...
    [junit] 2 keys imported successfully.
    [junit] Counting keys to import, please wait... (NOTE: to skip this use -n <num_keys>)
    [junit] Importing 2 keys...
    [junit] 2 keys imported successfully.
    [junit] Counting keys to import, please wait... (NOTE: to skip this use -n <num_keys>)
    [junit] Importing 2 keys...
    [junit] 2 keys imported successfully.
    [junit] Importing 3 keys...
    [junit] Importing 2 keys...
    [junit] 2 keys imported successfully.
    [junit] Counting keys to import, please wait... (NOTE: to skip this use -n <num_keys>)
    [junit] Importing 2 keys...
    [junit] 2 keys imported successfully.
    [junit] Counting keys to import, please wait... (NOTE: to skip this use -n <num_keys>)
    [junit] Importing 1 keys...
    [junit] 1 keys imported successfully.
    [junit] ------------- ---------------- ---------------
    [junit] ------------- Standard Error -----------------
    [junit] Line 2: Key null is greater than previous, collection is not sorted properly.
Aborting import. You might need to delete SSTables manually.
    [junit] ------------- ---------------- ---------------
    [junit] Testsuite: org.apache.cassandra.utils.BloomFilterTest
    [junit] Tests run: 7, Failures: 0, Errors: 0, Time elapsed: 0.838 sec
    [junit] 
    [junit] Testsuite: org.apache.cassandra.utils.BoundedStatsDequeTest
    [junit] Tests run: 1, Failures: 0, Errors: 0, Time elapsed: 0.059 sec
    [junit] 
    [junit] Testsuite: org.apache.cassandra.utils.ByteBufferUtilTest
    [junit] Tests run: 10, Failures: 0, Errors: 0, Time elapsed: 0.073 sec
    [junit] 
    [junit] Testsuite: org.apache.cassandra.utils.BytesReadTrackerTest
    [junit] Tests run: 4, Failures: 0, Errors: 0, Time elapsed: 0.061 sec
    [junit] 
    [junit] Testsuite: org.apache.cassandra.utils.EncodedStreamsTest
    [junit] Tests run: 4, Failures: 0, Errors: 0, Time elapsed: 10.458 sec
    [junit] 
    [junit] Testsuite: org.apache.cassandra.utils.EstimatedHistogramTest
    [junit] Tests run: 5, Failures: 0, Errors: 0, Time elapsed: 0.061 sec
    [junit] 
    [junit] Testsuite: org.apache.cassandra.utils.FBUtilitiesTest
    [junit] Tests run: 2, Failures: 0, Errors: 0, Time elapsed: 0.06 sec
    [junit] 
    [junit] Testsuite: org.apache.cassandra.utils.HexTest
    [junit] Tests run: 2, Failures: 0, Errors: 0, Time elapsed: 0.061 sec
    [junit] 
    [junit] Testsuite: org.apache.cassandra.utils.IntervalTreeTest
    [junit] Tests run: 3, Failures: 0, Errors: 0, Time elapsed: 0.171 sec
    [junit] 
    [junit] Testsuite: org.apache.cassandra.utils.LegacyBloomFilterTest
    [junit] Tests run: 6, Failures: 0, Errors: 0, Time elapsed: 0.783 sec
    [junit] 
    [junit] Testsuite: org.apache.cassandra.utils.MergeIteratorTest
    [junit] Tests run: 1, Failures: 0, Errors: 0, Time elapsed: 0.077 sec
    [junit] 
    [junit] Testsuite: org.apache.cassandra.utils.MerkleTreeTest
    [junit] Tests run: 12, Failures: 0, Errors: 0, Time elapsed: 1.055 sec
    [junit] 
    [junit] Testsuite: org.apache.cassandra.utils.SemanticVersionTest
    [junit] Tests run: 4, Failures: 0, Errors: 0, Time elapsed: 0.059 sec
    [junit] 
    [junit] Testsuite: org.apache.cassandra.utils.SerializationsTest
    [junit] Tests run: 4, Failures: 0, Errors: 0, Time elapsed: 11.481 sec
    [junit] 
    [junit] Testsuite: org.apache.cassandra.utils.StreamingHistogramTest
    [junit] Tests run: 2, Failures: 0, Errors: 0, Time elapsed: 0.062 sec
    [junit] 

BUILD FAILED
<https://builds.apache.org/job/Cassandra-quick/ws/build.xml>:1095: The following error
occurred while executing this line:
<https://builds.apache.org/job/Cassandra-quick/ws/build.xml>:1060: Some unit test(s)
failed.

Total time: 26 minutes 22 seconds
Build step 'Invoke Ant' marked build as failure
[TASKS] Skipping publisher since build result is FAILURE
Recording test results

Mime
View raw message