incubator-cassandra-dev mailing list archives

Site index · List index
Message view « Date » · « Thread »
Top « Date » · « Thread »
From Apache Jenkins Server <jenk...@builds.apache.org>
Subject Build failed in Jenkins: Cassandra-quick #1443
Date Wed, 26 Sep 2012 15:44:49 GMT
See <https://builds.apache.org/job/Cassandra-quick/1443/changes>

Changes:

[sylvain] Fix validation for IN queries with non-PK cols

[sylvain] Fix ColumnFamilyStoreTest failure

[brandonwilliams] cqlsh: alphabetize help

[brandonwilliams] cqlsh: autocomplete fqdn

[jbellis] fix listEndpointsPendingHints to generate String representation of the tokens for
which we have hints

[brandonwilliams] cqlsh: fix extra space in tab completion

[sylvain] Fix variable visibility issue

------------------------------------------
[...truncated 450 lines...]
    [junit] Tests run: 6, Failures: 0, Errors: 0, Time elapsed: 5.87 sec
    [junit] 
    [junit] ------------- Standard Error -----------------
    [junit]  WARN 15:42:11,853 No host ID found, created a93b2baa-19da-48a4-a8a6-db39b57c9dab
(Note: This should happen exactly once per node).
    [junit]  WARN 15:42:11,964 Generated random token [Token(bytes[9da5aa88163ba8c0f9b1f47cd5bd8d21])].
Random tokens will result in an unbalanced ring; see http://wiki.apache.org/cassandra/Operations
    [junit] ------------- ---------------- ---------------
    [junit] Testsuite: org.apache.cassandra.service.CassandraServerTest
    [junit] Tests run: 1, Failures: 0, Errors: 0, Time elapsed: 4.364 sec
    [junit] 
    [junit] Testsuite: org.apache.cassandra.service.EmbeddedCassandraServiceTest
    [junit] Tests run: 1, Failures: 0, Errors: 0, Time elapsed: 5.159 sec
    [junit] 
    [junit] ------------- Standard Error -----------------
    [junit]  WARN 15:42:24,292 Unable to lock JVM memory (ENOMEM). This can result in part
of the JVM being swapped out, especially with mmapped I/O enabled. Increase RLIMIT_MEMLOCK
or run Cassandra as root.
    [junit]  WARN 15:42:24,575 No host ID found, created 6d50cbaf-52ff-450c-b296-e730f1cd322a
(Note: This should happen exactly once per node).
    [junit]  WARN 15:42:24,698 Generated random token [Token(bytes[61a693496dccd6ad3d6b63feaf486465])].
Random tokens will result in an unbalanced ring; see http://wiki.apache.org/cassandra/Operations
    [junit] ------------- ---------------- ---------------
    [junit] Testsuite: org.apache.cassandra.service.InitClientTest
    [junit] Tests run: 1, Failures: 0, Errors: 0, Time elapsed: 1.375 sec
    [junit] 
    [junit] Testsuite: org.apache.cassandra.service.LeaveAndBootstrapTest
    [junit] Tests run: 6, Failures: 0, Errors: 0, Time elapsed: 9.025 sec
    [junit] 
    [junit] ------------- Standard Error -----------------
    [junit]  WARN 15:42:37,839 Node /127.0.0.3 'leaving' token mismatch. Long network partition?
    [junit] ------------- ---------------- ---------------
    [junit] Testsuite: org.apache.cassandra.service.MoveTest
    [junit] Tests run: 3, Failures: 0, Errors: 0, Time elapsed: 7.018 sec
    [junit] 
    [junit] Testsuite: org.apache.cassandra.service.RelocateTest
    [junit] Tests run: 2, Failures: 0, Errors: 0, Time elapsed: 27.367 sec
    [junit] 
    [junit] ------------- Standard Error -----------------
    [junit]  WARN 15:42:51,862 setting live ratio to maximum of 64.0 instead of Infinity
    [junit]  WARN 15:42:51,968 setting live ratio to maximum of 64.0 instead of Infinity
    [junit]  WARN 15:42:52,189 setting live ratio to maximum of 64.0 instead of Infinity
    [junit]  WARN 15:42:54,938 Token 10 changing ownership from /127.0.0.1 to /127.0.0.2
    [junit]  WARN 15:42:55,115 Token 10 changing ownership from /127.0.0.1 to /127.0.0.2
    [junit]  WARN 15:42:55,498 Token 10 changing ownership from /127.0.0.1 to /127.0.0.2
    [junit]  WARN 15:42:55,691 Token 10 changing ownership from /127.0.0.1 to /127.0.0.2
    [junit]  WARN 15:42:55,721 Token 10 changing ownership from /127.0.0.1 to /127.0.0.2
    [junit]  WARN 15:42:55,735 Token 10 changing ownership from /127.0.0.1 to /127.0.0.2
    [junit]  WARN 15:42:55,790 Token 10 changing ownership from /127.0.0.1 to /127.0.0.2
    [junit]  WARN 15:42:55,833 Token 10 changing ownership from /127.0.0.1 to /127.0.0.2
    [junit]  WARN 15:42:55,843 Token 10 changing ownership from /127.0.0.1 to /127.0.0.2
    [junit]  WARN 15:43:07,141 Token 10 changing ownership from /127.0.0.1 to /127.0.0.2
    [junit]  WARN 15:43:07,170 Token 10 changing ownership from /127.0.0.1 to /127.0.0.2
    [junit]  WARN 15:43:07,201 Token 10 changing ownership from /127.0.0.1 to /127.0.0.2
    [junit]  WARN 15:43:07,217 Token 10 changing ownership from /127.0.0.1 to /127.0.0.2
    [junit]  WARN 15:43:07,219 Token 10 changing ownership from /127.0.0.1 to /127.0.0.2
    [junit]  WARN 15:43:07,221 Token 10 changing ownership from /127.0.0.1 to /127.0.0.2
    [junit]  WARN 15:43:07,238 Token 10 changing ownership from /127.0.0.1 to /127.0.0.2
    [junit]  WARN 15:43:07,248 Token 10 changing ownership from /127.0.0.1 to /127.0.0.2
    [junit]  WARN 15:43:07,250 Token 10 changing ownership from /127.0.0.1 to /127.0.0.2
    [junit]  WARN 15:43:07,717 Token 10 changing ownership from /127.0.0.1 to /127.0.0.2
    [junit]  WARN 15:43:07,789 Token 10 changing ownership from /127.0.0.1 to /127.0.0.2
    [junit]  WARN 15:43:07,870 Token 10 changing ownership from /127.0.0.1 to /127.0.0.2
    [junit]  WARN 15:43:07,888 Token 10 changing ownership from /127.0.0.1 to /127.0.0.2
    [junit]  WARN 15:43:07,896 Token 10 changing ownership from /127.0.0.1 to /127.0.0.2
    [junit]  WARN 15:43:07,900 Token 10 changing ownership from /127.0.0.1 to /127.0.0.2
    [junit]  WARN 15:43:07,920 Token 10 changing ownership from /127.0.0.1 to /127.0.0.2
    [junit]  WARN 15:43:07,931 Token 10 changing ownership from /127.0.0.1 to /127.0.0.2
    [junit]  WARN 15:43:07,935 Token 10 changing ownership from /127.0.0.1 to /127.0.0.2
    [junit]  WARN 15:43:08,382 Token 10 changing ownership from /127.0.0.1 to /127.0.0.2
    [junit]  WARN 15:43:08,462 Token 10 changing ownership from /127.0.0.1 to /127.0.0.2
    [junit]  WARN 15:43:08,644 Token 10 changing ownership from /127.0.0.1 to /127.0.0.2
    [junit]  WARN 15:43:08,711 Token 10 changing ownership from /127.0.0.1 to /127.0.0.2
    [junit]  WARN 15:43:08,716 Token 10 changing ownership from /127.0.0.1 to /127.0.0.2
    [junit]  WARN 15:43:08,721 Token 10 changing ownership from /127.0.0.1 to /127.0.0.2
    [junit]  WARN 15:43:08,750 Token 10 changing ownership from /127.0.0.1 to /127.0.0.2
    [junit]  WARN 15:43:08,771 Token 10 changing ownership from /127.0.0.1 to /127.0.0.2
    [junit]  WARN 15:43:08,776 Token 10 changing ownership from /127.0.0.1 to /127.0.0.2
    [junit]  WARN 15:43:09,288 Token 10 changing ownership from /127.0.0.1 to /127.0.0.2
    [junit]  WARN 15:43:09,396 Token 10 changing ownership from /127.0.0.1 to /127.0.0.2
    [junit]  WARN 15:43:09,733 Token 10 changing ownership from /127.0.0.1 to /127.0.0.2
    [junit]  WARN 15:43:09,886 Token 10 changing ownership from /127.0.0.1 to /127.0.0.2
    [junit]  WARN 15:43:09,892 Token 10 changing ownership from /127.0.0.1 to /127.0.0.2
    [junit]  WARN 15:43:09,899 Token 10 changing ownership from /127.0.0.1 to /127.0.0.2
    [junit]  WARN 15:43:09,938 Token 10 changing ownership from /127.0.0.1 to /127.0.0.2
    [junit]  WARN 15:43:09,969 Token 10 changing ownership from /127.0.0.1 to /127.0.0.2
    [junit]  WARN 15:43:09,976 Token 10 changing ownership from /127.0.0.1 to /127.0.0.2
    [junit]  WARN 15:43:10,797 Token 10 changing ownership from /127.0.0.1 to /127.0.0.2
    [junit]  WARN 15:43:10,936 Token 10 changing ownership from /127.0.0.1 to /127.0.0.2
    [junit]  WARN 15:43:11,328 Token 10 changing ownership from /127.0.0.1 to /127.0.0.2
    [junit]  WARN 15:43:11,522 Token 10 changing ownership from /127.0.0.1 to /127.0.0.2
    [junit]  WARN 15:43:11,530 Token 10 changing ownership from /127.0.0.1 to /127.0.0.2
    [junit]  WARN 15:43:11,538 Token 10 changing ownership from /127.0.0.1 to /127.0.0.2
    [junit]  WARN 15:43:11,587 Token 10 changing ownership from /127.0.0.1 to /127.0.0.2
    [junit]  WARN 15:43:11,629 Token 10 changing ownership from /127.0.0.1 to /127.0.0.2
    [junit]  WARN 15:43:11,641 Token 10 changing ownership from /127.0.0.1 to /127.0.0.2
    [junit]  WARN 15:43:11,646 Relocation of 10 to /127.0.0.3 overwrites previous to /127.0.0.2
    [junit]  WARN 15:43:11,650 Token 10 changing ownership from /127.0.0.1 to /127.0.0.3
    [junit]  WARN 15:43:11,783 Token 10 changing ownership from /127.0.0.1 to /127.0.0.3
    [junit]  WARN 15:43:12,174 Token 10 changing ownership from /127.0.0.1 to /127.0.0.3
    [junit]  WARN 15:43:12,368 Token 10 changing ownership from /127.0.0.1 to /127.0.0.3
    [junit]  WARN 15:43:12,376 Token 10 changing ownership from /127.0.0.1 to /127.0.0.3
    [junit]  WARN 15:43:12,384 Token 10 changing ownership from /127.0.0.1 to /127.0.0.3
    [junit]  WARN 15:43:12,434 Token 10 changing ownership from /127.0.0.1 to /127.0.0.3
    [junit]  WARN 15:43:12,474 Token 10 changing ownership from /127.0.0.1 to /127.0.0.3
    [junit]  WARN 15:43:12,482 Token 10 changing ownership from /127.0.0.1 to /127.0.0.3
    [junit]  WARN 15:43:12,493 Token 10 changing ownership from /127.0.0.1 to /127.0.0.3
    [junit] ------------- ---------------- ---------------
    [junit] Testsuite: org.apache.cassandra.service.RemoveTest
    [junit] Tests run: 3, Failures: 0, Errors: 0, Time elapsed: 8.8 sec
    [junit] 
    [junit] ------------- Standard Error -----------------
    [junit] ERROR 15:43:20,472 Fatal exception in thread Thread[ACCEPT-/127.0.0.1,5,main]
    [junit] java.lang.RuntimeException: java.nio.channels.ClosedChannelException
    [junit] 	at org.apache.cassandra.net.MessagingService$SocketThread.run(MessagingService.java:837)
    [junit] Caused by: java.nio.channels.ClosedChannelException
    [junit] 	at sun.nio.ch.ServerSocketChannelImpl.accept(ServerSocketChannelImpl.java:137)
    [junit] 	at sun.nio.ch.ServerSocketAdaptor.accept(ServerSocketAdaptor.java:84)
    [junit] 	at org.apache.cassandra.net.MessagingService$SocketThread.run(MessagingService.java:826)
    [junit] ERROR 15:43:21,945 Stream failed because /127.0.0.6 died or was restarted/removed
(streams may still be active in background, but further streams won't be started)
    [junit]  WARN 15:43:21,946 Streaming from /127.0.0.6 failed
    [junit] ERROR 15:43:21,946 Stream failed because /127.0.0.6 died or was restarted/removed
(streams may still be active in background, but further streams won't be started)
    [junit]  WARN 15:43:21,946 Streaming from /127.0.0.6 failed
    [junit] ERROR 15:43:21,946 Stream failed because /127.0.0.6 died or was restarted/removed
(streams may still be active in background, but further streams won't be started)
    [junit]  WARN 15:43:21,948 Streaming from /127.0.0.6 failed
    [junit] ERROR 15:43:21,948 Stream failed because /127.0.0.6 died or was restarted/removed
(streams may still be active in background, but further streams won't be started)
    [junit]  WARN 15:43:21,949 Streaming from /127.0.0.6 failed
    [junit] ERROR 15:43:21,949 Stream failed because /127.0.0.6 died or was restarted/removed
(streams may still be active in background, but further streams won't be started)
    [junit]  WARN 15:43:21,949 Streaming from /127.0.0.6 failed
    [junit] ERROR 15:43:21,949 Stream failed because /127.0.0.6 died or was restarted/removed
(streams may still be active in background, but further streams won't be started)
    [junit]  WARN 15:43:21,949 Streaming from /127.0.0.6 failed
    [junit] ------------- ---------------- ---------------
    [junit] Testsuite: org.apache.cassandra.service.RowResolverTest
    [junit] Tests run: 8, Failures: 0, Errors: 0, Time elapsed: 4.422 sec
    [junit] 
    [junit] Testsuite: org.apache.cassandra.service.SerializationsTest
    [junit] Tests run: 2, Failures: 0, Errors: 0, Time elapsed: 3.488 sec
    [junit] 
    [junit] Testsuite: org.apache.cassandra.service.StorageProxyTest
    [junit] Tests run: 4, Failures: 0, Errors: 0, Time elapsed: 4.478 sec
    [junit] 
    [junit] Testsuite: org.apache.cassandra.service.StorageServiceClientTest
    [junit] Tests run: 1, Failures: 0, Errors: 0, Time elapsed: 3.205 sec
    [junit] 
    [junit] Testsuite: org.apache.cassandra.service.StorageServiceServerTest
    [junit] Tests run: 4, Failures: 0, Errors: 0, Time elapsed: 3.66 sec
    [junit] 
    [junit] ------------- Standard Error -----------------
    [junit]  WARN 15:43:46,957 No host ID found, created eae5b441-d3fd-4e17-885c-8b080ee00b4a
(Note: This should happen exactly once per node).
    [junit]  WARN 15:43:47,297 Generated random token [Token(bytes[54b48f5e785d368768e250f6548c1c07])].
Random tokens will result in an unbalanced ring; see http://wiki.apache.org/cassandra/Operations
    [junit] ------------- ---------------- ---------------
    [junit] Testsuite: org.apache.cassandra.streaming.BootstrapTest
    [junit] Tests run: 1, Failures: 0, Errors: 0, Time elapsed: 4.435 sec
    [junit] 
    [junit] Testsuite: org.apache.cassandra.streaming.SerializationsTest
    [junit] Tests run: 4, Failures: 0, Errors: 0, Time elapsed: 4.328 sec
    [junit] 
    [junit] Testsuite: org.apache.cassandra.streaming.StreamingTransferTest
    [junit] Tests run: 5, Failures: 0, Errors: 0, Time elapsed: 5.077 sec
    [junit] 
    [junit] ------------- Standard Error -----------------
    [junit]  WARN 15:44:04,165 No host ID found, created 8b6e077f-cc0a-40ca-a542-656d737315de
(Note: This should happen exactly once per node).
    [junit]  WARN 15:44:04,294 Generated random token [Token(bytes[a08eceedf4cc5b48fc936fe4da1aa070])].
Random tokens will result in an unbalanced ring; see http://wiki.apache.org/cassandra/Operations
    [junit] ------------- ---------------- ---------------
    [junit] Testsuite: org.apache.cassandra.thrift.ThriftValidationTest
    [junit] Tests run: 4, Failures: 0, Errors: 0, Time elapsed: 4.411 sec
    [junit] 
    [junit] Testsuite: org.apache.cassandra.tools.SSTableExportTest
    [junit] Tests run: 7, Failures: 0, Errors: 0, Time elapsed: 4.524 sec
    [junit] 
    [junit] ------------- Standard Output ---------------
    [junit] Importing 1 keys...
    [junit] 1 keys imported successfully.
    [junit] [{"columns":[["636f6c4e616d65","76616c",1348674256484],["636f6c4e616d6531","76616c31",1348674256484]],"key":"726f7741","metadata":{"deletionInfo":{"markedForDeleteAt":0,"localDeletionTime":0}}}]
    [junit] ------------- ---------------- ---------------
    [junit] Testsuite: org.apache.cassandra.tools.SSTableImportTest
    [junit] Tests run: 7, Failures: 0, Errors: 0, Time elapsed: 6.014 sec
    [junit] 
    [junit] ------------- Standard Output ---------------
    [junit] Counting keys to import, please wait... (NOTE: to skip this use -n <num_keys>)
    [junit] Importing 2 keys...
    [junit] 2 keys imported successfully.
    [junit] Counting keys to import, please wait... (NOTE: to skip this use -n <num_keys>)
    [junit] Importing 2 keys...
    [junit] 2 keys imported successfully.
    [junit] Counting keys to import, please wait... (NOTE: to skip this use -n <num_keys>)
    [junit] Importing 2 keys...
    [junit] 2 keys imported successfully.
    [junit] Importing 3 keys...
    [junit] Importing 2 keys...
    [junit] 2 keys imported successfully.
    [junit] Counting keys to import, please wait... (NOTE: to skip this use -n <num_keys>)
    [junit] Importing 2 keys...
    [junit] 2 keys imported successfully.
    [junit] Counting keys to import, please wait... (NOTE: to skip this use -n <num_keys>)
    [junit] Importing 1 keys...
    [junit] 1 keys imported successfully.
    [junit] ------------- ---------------- ---------------
    [junit] ------------- Standard Error -----------------
    [junit] Line 2: Key null is greater than previous, collection is not sorted properly.
Aborting import. You might need to delete SSTables manually.
    [junit] ------------- ---------------- ---------------
    [junit] Testsuite: org.apache.cassandra.utils.BloomFilterTest
    [junit] Tests run: 7, Failures: 0, Errors: 0, Time elapsed: 0.521 sec
    [junit] 
    [junit] Testsuite: org.apache.cassandra.utils.BoundedStatsDequeTest
    [junit] Tests run: 1, Failures: 0, Errors: 0, Time elapsed: 0.056 sec
    [junit] 
    [junit] Testsuite: org.apache.cassandra.utils.ByteBufferUtilTest
    [junit] Tests run: 10, Failures: 0, Errors: 0, Time elapsed: 0.074 sec
    [junit] 
    [junit] Testsuite: org.apache.cassandra.utils.BytesReadTrackerTest
    [junit] Tests run: 4, Failures: 0, Errors: 0, Time elapsed: 0.06 sec
    [junit] 
    [junit] Testsuite: org.apache.cassandra.utils.EncodedStreamsTest
    [junit] Tests run: 4, Failures: 0, Errors: 0, Time elapsed: 4.327 sec
    [junit] 
    [junit] Testsuite: org.apache.cassandra.utils.EstimatedHistogramTest
    [junit] Tests run: 5, Failures: 0, Errors: 0, Time elapsed: 0.059 sec
    [junit] 
    [junit] Testsuite: org.apache.cassandra.utils.FBUtilitiesTest
    [junit] Tests run: 2, Failures: 0, Errors: 0, Time elapsed: 0.06 sec
    [junit] 
    [junit] Testsuite: org.apache.cassandra.utils.HexTest
    [junit] Tests run: 2, Failures: 0, Errors: 0, Time elapsed: 0.063 sec
    [junit] 
    [junit] Testsuite: org.apache.cassandra.utils.IntervalTreeTest
    [junit] Tests run: 3, Failures: 0, Errors: 0, Time elapsed: 0.171 sec
    [junit] 
    [junit] Testsuite: org.apache.cassandra.utils.LegacyBloomFilterTest
    [junit] Tests run: 6, Failures: 0, Errors: 0, Time elapsed: 0.454 sec
    [junit] 
    [junit] Testsuite: org.apache.cassandra.utils.MergeIteratorTest
    [junit] Tests run: 1, Failures: 0, Errors: 0, Time elapsed: 0.08 sec
    [junit] 
    [junit] Testsuite: org.apache.cassandra.utils.MerkleTreeTest
    [junit] Tests run: 12, Failures: 0, Errors: 0, Time elapsed: 1.039 sec
    [junit] 
    [junit] Testsuite: org.apache.cassandra.utils.SemanticVersionTest
    [junit] Tests run: 4, Failures: 0, Errors: 0, Time elapsed: 0.06 sec
    [junit] 
    [junit] Testsuite: org.apache.cassandra.utils.SerializationsTest
    [junit] Tests run: 4, Failures: 0, Errors: 0, Time elapsed: 6.198 sec
    [junit] 
    [junit] Testsuite: org.apache.cassandra.utils.StreamingHistogramTest
    [junit] Tests run: 2, Failures: 0, Errors: 0, Time elapsed: 0.06 sec
    [junit] 

BUILD FAILED
<https://builds.apache.org/job/Cassandra-quick/ws/build.xml>:1095: The following error
occurred while executing this line:
<https://builds.apache.org/job/Cassandra-quick/ws/build.xml>:1060: Some unit test(s)
failed.

Total time: 10 minutes 38 seconds
Build step 'Invoke Ant' marked build as failure
[TASKS] Skipping publisher since build result is FAILURE
Recording test results

Mime
View raw message