incubator-cassandra-dev mailing list archives

Site index · List index
Message view « Date » · « Thread »
Top « Date » · « Thread »
From Apache Jenkins Server <jenk...@builds.apache.org>
Subject Build failed in Jenkins: Cassandra-quick #808
Date Wed, 11 Jul 2012 00:57:37 GMT
See <https://builds.apache.org/job/Cassandra-quick/808/>

------------------------------------------
[...truncated 534 lines...]
    [junit] Testsuite: org.apache.cassandra.io.LazilyCompactedRowTest
    [junit] Tests run: 7, Failures: 0, Errors: 0, Time elapsed: 6.75 sec
    [junit] 
    [junit] Testsuite: org.apache.cassandra.io.compress.CompressedRandomAccessReaderTest
    [junit] Tests run: 3, Failures: 0, Errors: 0, Time elapsed: 1.025 sec
    [junit] 
    [junit] ------------- Standard Error -----------------
    [junit]  WARN 00:54:02,028 open(null, O_RDONLY) failed, errno (14).
    [junit] ------------- ---------------- ---------------
    [junit] Testsuite: org.apache.cassandra.io.sstable.DescriptorTest
    [junit] Tests run: 3, Failures: 0, Errors: 0, Time elapsed: 0.065 sec
    [junit] 
    [junit] Testsuite: org.apache.cassandra.io.sstable.IndexHelperTest
    [junit] Tests run: 1, Failures: 0, Errors: 0, Time elapsed: 0.064 sec
    [junit] 
    [junit] Testsuite: org.apache.cassandra.io.sstable.LegacySSTableTest
    [junit] Tests run: 1, Failures: 0, Errors: 0, Time elapsed: 6.689 sec
    [junit] 
    [junit] Testsuite: org.apache.cassandra.io.sstable.SSTableMetadataSerializerTest
    [junit] Tests run: 1, Failures: 0, Errors: 0, Time elapsed: 0.149 sec
    [junit] 
    [junit] Testsuite: org.apache.cassandra.io.sstable.SSTableReaderTest
    [junit] Tests run: 8, Failures: 0, Errors: 0, Time elapsed: 6.186 sec
    [junit] 
    [junit] ------------- Standard Error -----------------
    [junit]  WARN 00:54:17,799 setting live ratio to maximum of 64.0 instead of 87.80444444444444
    [junit]  WARN 00:54:17,917 setting live ratio to maximum of 64.0 instead of 67.16577540106952
    [junit] ------------- ---------------- ---------------
    [junit] Testsuite: org.apache.cassandra.io.sstable.SSTableSimpleWriterTest
    [junit] Tests run: 1, Failures: 0, Errors: 0, Time elapsed: 5.708 sec
    [junit] 
    [junit] Testsuite: org.apache.cassandra.io.sstable.SSTableTest
    [junit] Tests run: 2, Failures: 0, Errors: 0, Time elapsed: 5.857 sec
    [junit] 
    [junit] Testsuite: org.apache.cassandra.io.util.BufferedRandomAccessFileTest
    [junit] Tests run: 18, Failures: 0, Errors: 0, Time elapsed: 1.097 sec
    [junit] 
    [junit] Testsuite: org.apache.cassandra.locator.DynamicEndpointSnitchTest
    [junit] Tests run: 1, Failures: 0, Errors: 0, Time elapsed: 2.265 sec
    [junit] 
    [junit] Testsuite: org.apache.cassandra.locator.EC2SnitchTest
    [junit] Tests run: 2, Failures: 0, Errors: 0, Time elapsed: 0.946 sec
    [junit] 
    [junit] Testsuite: org.apache.cassandra.locator.NetworkTopologyStrategyTest
    [junit] Tests run: 3, Failures: 0, Errors: 0, Time elapsed: 1.086 sec
    [junit] 
    [junit] Testsuite: org.apache.cassandra.locator.OldNetworkTopologyStrategyTest
    [junit] Tests run: 8, Failures: 0, Errors: 0, Time elapsed: 5.673 sec
    [junit] 
    [junit] ------------- Standard Output ---------------
    [junit] toStream : [(158873535527910577765226390751398592512,0], (0,34028236692093846346337460743176821145]]
    [junit] toFetch : [(127605887595351923798765477786913079296,148873535527910577765226390751398592512]]
    [junit] toStreamExpected : [(158873535527910577765226390751398592512,0], (0,34028236692093846346337460743176821145]]
    [junit] toFetchExpected : [(127605887595351923798765477786913079296,148873535527910577765226390751398592512]]
    [junit] ------------- ---------------- ---------------
    [junit] Testsuite: org.apache.cassandra.locator.ReplicationStrategyEndpointCacheTest
    [junit] Tests run: 2, Failures: 0, Errors: 0, Time elapsed: 5.563 sec
    [junit] 
    [junit] Testsuite: org.apache.cassandra.locator.SimpleStrategyTest
    [junit] Tests run: 4, Failures: 0, Errors: 0, Time elapsed: 5.623 sec
    [junit] 
    [junit] Testsuite: org.apache.cassandra.locator.TokenMetadataTest
    [junit] Tests run: 3, Failures: 0, Errors: 0, Time elapsed: 0.919 sec
    [junit] 
    [junit] Testsuite: org.apache.cassandra.service.AntiEntropyServiceCounterTest
    [junit] Tests run: 6, Failures: 0, Errors: 0, Time elapsed: 7.321 sec
    [junit] 
    [junit] ------------- Standard Error -----------------
    [junit]  WARN 00:55:07,267 No host ID found, created 45b2616a-a324-4bc1-893e-432cbf63435f
(Note: This should happen exactly once per node).
    [junit]  WARN 00:55:07,452 Generated random token Token(bytes[4a87240a6516df445a6c411016e58d6a]).
Random tokens will result in an unbalanced ring; see http://wiki.apache.org/cassandra/Operations
    [junit] ------------- ---------------- ---------------
    [junit] Testsuite: org.apache.cassandra.service.AntiEntropyServiceStandardTest
    [junit] Tests run: 6, Failures: 0, Errors: 0, Time elapsed: 6.399 sec
    [junit] 
    [junit] ------------- Standard Error -----------------
    [junit]  WARN 00:55:15,682 No host ID found, created 461ac78a-a109-410e-b5e5-9052a553990b
(Note: This should happen exactly once per node).
    [junit]  WARN 00:55:15,866 Generated random token Token(bytes[e591aaa5cba967d4c732e79bc56270ec]).
Random tokens will result in an unbalanced ring; see http://wiki.apache.org/cassandra/Operations
    [junit] ------------- ---------------- ---------------
    [junit] Testsuite: org.apache.cassandra.service.CassandraServerTest
    [junit] Tests run: 1, Failures: 0, Errors: 0, Time elapsed: 5.547 sec
    [junit] 
    [junit] Testsuite: org.apache.cassandra.service.EmbeddedCassandraServiceTest
    [junit] Tests run: 1, Failures: 0, Errors: 1, Time elapsed: 6.487 sec
    [junit] 
    [junit] ------------- Standard Error -----------------
    [junit]  WARN 00:55:29,765 Unable to lock JVM memory (ENOMEM). This can result in part
of the JVM being swapped out, especially with mmapped I/O enabled. Increase RLIMIT_MEMLOCK
or run Cassandra as root.
    [junit]  WARN 00:55:30,224 No host ID found, created 23b637fc-8560-48c6-9c87-6cc740a8f419
(Note: This should happen exactly once per node).
    [junit]  WARN 00:55:30,405 Generated random token Token(bytes[229c038f63129301fe2ddb98bc26a2ee]).
Random tokens will result in an unbalanced ring; see http://wiki.apache.org/cassandra/Operations
    [junit] ------------- ---------------- ---------------
    [junit] Testcase: testEmbeddedCassandraService(org.apache.cassandra.service.EmbeddedCassandraServiceTest):
Caused an ERROR
    [junit] java.net.ConnectException: Connection refused
    [junit] org.apache.thrift.transport.TTransportException: java.net.ConnectException: Connection
refused
    [junit] 	at org.apache.thrift.transport.TSocket.open(TSocket.java:183)
    [junit] 	at org.apache.thrift.transport.TFramedTransport.open(TFramedTransport.java:81)
    [junit] 	at org.apache.cassandra.service.EmbeddedCassandraServiceTest.getClient(EmbeddedCassandraServiceTest.java:110)
    [junit] 	at org.apache.cassandra.service.EmbeddedCassandraServiceTest.testEmbeddedCassandraService(EmbeddedCassandraServiceTest.java:75)
    [junit] Caused by: java.net.ConnectException: Connection refused
    [junit] 	at java.net.PlainSocketImpl.socketConnect(Native Method)
    [junit] 	at java.net.PlainSocketImpl.doConnect(PlainSocketImpl.java:351)
    [junit] 	at java.net.PlainSocketImpl.connectToAddress(PlainSocketImpl.java:213)
    [junit] 	at java.net.PlainSocketImpl.connect(PlainSocketImpl.java:200)
    [junit] 	at java.net.SocksSocketImpl.connect(SocksSocketImpl.java:366)
    [junit] 	at java.net.Socket.connect(Socket.java:529)
    [junit] 	at org.apache.thrift.transport.TSocket.open(TSocket.java:178)
    [junit] 
    [junit] 
    [junit] Test org.apache.cassandra.service.EmbeddedCassandraServiceTest FAILED
    [junit] Testsuite: org.apache.cassandra.service.InitClientTest
    [junit] Tests run: 1, Failures: 0, Errors: 0, Time elapsed: 1.5 sec
    [junit] 
    [junit] Testsuite: org.apache.cassandra.service.LeaveAndBootstrapTest
    [junit] Tests run: 6, Failures: 0, Errors: 0, Time elapsed: 7.099 sec
    [junit] 
    [junit] ------------- Standard Error -----------------
    [junit]  WARN 00:55:41,759 Node /127.0.0.3 'leaving' token mismatch. Long network partition?
    [junit] ------------- ---------------- ---------------
    [junit] Testsuite: org.apache.cassandra.service.MoveTest
    [junit] Tests run: 3, Failures: 0, Errors: 0, Time elapsed: 6.495 sec
    [junit] 
    [junit] Testsuite: org.apache.cassandra.service.RemoveTest
    [junit] Tests run: 3, Failures: 0, Errors: 0, Time elapsed: 9.236 sec
    [junit] 
    [junit] ------------- Standard Error -----------------
    [junit] ERROR 00:55:57,148 Stream failed because /127.0.0.6 died or was restarted/removed
(streams may still be active in background, but further streams won't be started)
    [junit]  WARN 00:55:57,150 Streaming from /127.0.0.6 failed
    [junit] ERROR 00:55:57,150 Stream failed because /127.0.0.6 died or was restarted/removed
(streams may still be active in background, but further streams won't be started)
    [junit]  WARN 00:55:57,150 Streaming from /127.0.0.6 failed
    [junit] ERROR 00:55:57,150 Stream failed because /127.0.0.6 died or was restarted/removed
(streams may still be active in background, but further streams won't be started)
    [junit]  WARN 00:55:57,151 Streaming from /127.0.0.6 failed
    [junit] ERROR 00:55:57,151 Stream failed because /127.0.0.6 died or was restarted/removed
(streams may still be active in background, but further streams won't be started)
    [junit]  WARN 00:55:57,151 Streaming from /127.0.0.6 failed
    [junit] ERROR 00:55:57,151 Stream failed because /127.0.0.6 died or was restarted/removed
(streams may still be active in background, but further streams won't be started)
    [junit]  WARN 00:55:57,152 Streaming from /127.0.0.6 failed
    [junit] ERROR 00:55:57,152 Stream failed because /127.0.0.6 died or was restarted/removed
(streams may still be active in background, but further streams won't be started)
    [junit]  WARN 00:55:57,152 Streaming from /127.0.0.6 failed
    [junit] ------------- ---------------- ---------------
    [junit] Testsuite: org.apache.cassandra.service.RowResolverTest
    [junit] Tests run: 8, Failures: 0, Errors: 0, Time elapsed: 5.909 sec
    [junit] 
    [junit] Testsuite: org.apache.cassandra.service.SerializationsTest
    [junit] Tests run: 2, Failures: 0, Errors: 0, Time elapsed: 4.875 sec
    [junit] 
    [junit] Testsuite: org.apache.cassandra.service.StorageProxyTest
    [junit] Tests run: 4, Failures: 0, Errors: 0, Time elapsed: 5.659 sec
    [junit] 
    [junit] Testsuite: org.apache.cassandra.service.StorageServiceClientTest
    [junit] Tests run: 1, Failures: 0, Errors: 0, Time elapsed: 3.123 sec
    [junit] 
    [junit] Testsuite: org.apache.cassandra.service.StorageServiceServerTest
    [junit] Tests run: 4, Failures: 0, Errors: 0, Time elapsed: 3.456 sec
    [junit] 
    [junit] ------------- Standard Error -----------------
    [junit]  WARN 00:56:25,895 No host ID found, created e2a01fee-da4b-4b70-afd9-49e85f530706
(Note: This should happen exactly once per node).
    [junit]  WARN 00:56:26,170 Generated random token Token(bytes[628d8a0c52a057f7d6a0ac629505bb0d]).
Random tokens will result in an unbalanced ring; see http://wiki.apache.org/cassandra/Operations
    [junit] ------------- ---------------- ---------------
    [junit] Testsuite: org.apache.cassandra.streaming.BootstrapTest
    [junit] Tests run: 1, Failures: 0, Errors: 0, Time elapsed: 5.696 sec
    [junit] 
    [junit] Testsuite: org.apache.cassandra.streaming.SerializationsTest
    [junit] Tests run: 4, Failures: 0, Errors: 0, Time elapsed: 5.751 sec
    [junit] 
    [junit] Testsuite: org.apache.cassandra.streaming.StreamingTransferTest
    [junit] Tests run: 5, Failures: 0, Errors: 0, Time elapsed: 5.454 sec
    [junit] 
    [junit] ------------- Standard Error -----------------
    [junit]  WARN 00:56:46,939 No host ID found, created 00db2eea-3e45-45ce-803a-0c1545d13f35
(Note: This should happen exactly once per node).
    [junit]  WARN 00:56:47,119 Generated random token Token(bytes[7c1f15a0ae39c9274dd3604475474a78]).
Random tokens will result in an unbalanced ring; see http://wiki.apache.org/cassandra/Operations
    [junit] ------------- ---------------- ---------------
    [junit] Testsuite: org.apache.cassandra.thrift.ThriftValidationTest
    [junit] Tests run: 5, Failures: 0, Errors: 0, Time elapsed: 5.754 sec
    [junit] 
    [junit] Testsuite: org.apache.cassandra.tools.SSTableExportTest
    [junit] Tests run: 6, Failures: 0, Errors: 0, Time elapsed: 5.868 sec
    [junit] 
    [junit] ------------- Standard Output ---------------
    [junit] Importing 1 keys...
    [junit] 1 keys imported successfully.
    [junit] ------------- ---------------- ---------------
    [junit] Testsuite: org.apache.cassandra.tools.SSTableImportTest
    [junit] Tests run: 5, Failures: 0, Errors: 0, Time elapsed: 5.799 sec
    [junit] 
    [junit] ------------- Standard Output ---------------
    [junit] Importing 2 keys...
    [junit] 2 keys imported successfully.
    [junit] Importing 2 keys...
    [junit] 2 keys imported successfully.
    [junit] Importing 2 keys...
    [junit] 2 keys imported successfully.
    [junit] Importing 3 keys...
    [junit] Importing 3 keys...
    [junit] 1 keys imported successfully.
    [junit] ------------- ---------------- ---------------
    [junit] ------------- Standard Error -----------------
    [junit] Line 2: Key 303630 is greater than previous, collection is not sorted properly.
Aborting import. You might need to delete SSTables manually.
    [junit] ------------- ---------------- ---------------
    [junit] Testsuite: org.apache.cassandra.utils.BloomFilterTest
    [junit] Tests run: 7, Failures: 0, Errors: 0, Time elapsed: 0.554 sec
    [junit] 
    [junit] Testsuite: org.apache.cassandra.utils.BoundedStatsDequeTest
    [junit] Tests run: 1, Failures: 0, Errors: 0, Time elapsed: 0.064 sec
    [junit] 
    [junit] Testsuite: org.apache.cassandra.utils.ByteBufferUtilTest
    [junit] Tests run: 10, Failures: 0, Errors: 0, Time elapsed: 0.082 sec
    [junit] 
    [junit] Testsuite: org.apache.cassandra.utils.BytesReadTrackerTest
    [junit] Tests run: 4, Failures: 0, Errors: 0, Time elapsed: 0.064 sec
    [junit] 
    [junit] Testsuite: org.apache.cassandra.utils.EncodedStreamsTest
    [junit] Tests run: 4, Failures: 0, Errors: 0, Time elapsed: 5.774 sec
    [junit] 
    [junit] Testsuite: org.apache.cassandra.utils.EstimatedHistogramTest
    [junit] Tests run: 5, Failures: 0, Errors: 0, Time elapsed: 0.066 sec
    [junit] 
    [junit] Testsuite: org.apache.cassandra.utils.FBUtilitiesTest
    [junit] Tests run: 2, Failures: 0, Errors: 0, Time elapsed: 0.067 sec
    [junit] 
    [junit] Testsuite: org.apache.cassandra.utils.HexTest
    [junit] Tests run: 2, Failures: 0, Errors: 0, Time elapsed: 0.068 sec
    [junit] 
    [junit] Testsuite: org.apache.cassandra.utils.IntervalTreeTest
    [junit] Tests run: 3, Failures: 0, Errors: 0, Time elapsed: 0.18 sec
    [junit] 
    [junit] Testsuite: org.apache.cassandra.utils.LegacyBloomFilterTest
    [junit] Tests run: 6, Failures: 0, Errors: 0, Time elapsed: 0.468 sec
    [junit] 
    [junit] Testsuite: org.apache.cassandra.utils.MergeIteratorTest
    [junit] Tests run: 1, Failures: 0, Errors: 0, Time elapsed: 0.082 sec
    [junit] 
    [junit] Testsuite: org.apache.cassandra.utils.MerkleTreeTest
    [junit] Tests run: 12, Failures: 0, Errors: 0, Time elapsed: 0.956 sec
    [junit] 
    [junit] Testsuite: org.apache.cassandra.utils.SemanticVersionTest
    [junit] Tests run: 4, Failures: 0, Errors: 0, Time elapsed: 0.065 sec
    [junit] 
    [junit] Testsuite: org.apache.cassandra.utils.SerializationsTest
    [junit] Tests run: 4, Failures: 0, Errors: 0, Time elapsed: 7.861 sec
    [junit] 
    [junit] Testsuite: org.apache.cassandra.utils.StreamingHistogramTest
    [junit] Tests run: 2, Failures: 0, Errors: 0, Time elapsed: 0.066 sec
    [junit] 

BUILD FAILED
<https://builds.apache.org/job/Cassandra-quick/ws/build.xml>:1094: The following error
occurred while executing this line:
<https://builds.apache.org/job/Cassandra-quick/ws/build.xml>:1056: Some unit test(s)
failed.

Total time: 11 minutes 8 seconds
Build step 'Invoke Ant' marked build as failure
[TASKS] Skipping publisher since build result is FAILURE
Recording test results

Mime
View raw message