incubator-cassandra-dev mailing list archives

Site index · List index
Message view « Date » · « Thread »
Top « Date » · « Thread »
From Apache Jenkins Server <jenk...@builds.apache.org>
Subject Build failed in Jenkins: Cassandra-quick #829
Date Thu, 12 Jul 2012 15:56:32 GMT
See <https://builds.apache.org/job/Cassandra-quick/829/changes>

Changes:

[yukim] new json format with row level deletion; patch by David Alves, reviewed by yukim for
CASSANDRA-4054

------------------------------------------
[...truncated 445 lines...]
    [junit] Tests run: 3, Failures: 0, Errors: 0, Time elapsed: 0.044 sec
    [junit] 
    [junit] Testsuite: org.apache.cassandra.io.sstable.IndexHelperTest
    [junit] Tests run: 1, Failures: 0, Errors: 0, Time elapsed: 0.044 sec
    [junit] 
    [junit] Testsuite: org.apache.cassandra.io.sstable.LegacySSTableTest
    [junit] Tests run: 1, Failures: 0, Errors: 0, Time elapsed: 6.152 sec
    [junit] 
    [junit] Testsuite: org.apache.cassandra.io.sstable.SSTableMetadataSerializerTest
    [junit] Tests run: 1, Failures: 0, Errors: 0, Time elapsed: 0.12 sec
    [junit] 
    [junit] Testsuite: org.apache.cassandra.io.sstable.SSTableReaderTest
    [junit] Tests run: 8, Failures: 0, Errors: 0, Time elapsed: 5.728 sec
    [junit] 
    [junit] ------------- Standard Error -----------------
    [junit]  WARN 15:53:23,426 setting live ratio to maximum of 64.0 instead of 88.30222222222223
    [junit]  WARN 15:53:23,590 setting live ratio to maximum of 64.0 instead of 66.45603576751118
    [junit] ------------- ---------------- ---------------
    [junit] Testsuite: org.apache.cassandra.io.sstable.SSTableSimpleWriterTest
    [junit] Tests run: 1, Failures: 0, Errors: 0, Time elapsed: 5.464 sec
    [junit] 
    [junit] Testsuite: org.apache.cassandra.io.sstable.SSTableTest
    [junit] Tests run: 2, Failures: 0, Errors: 0, Time elapsed: 5.505 sec
    [junit] 
    [junit] Testsuite: org.apache.cassandra.io.util.BufferedRandomAccessFileTest
    [junit] Tests run: 18, Failures: 0, Errors: 0, Time elapsed: 0.942 sec
    [junit] 
    [junit] Testsuite: org.apache.cassandra.locator.DynamicEndpointSnitchTest
    [junit] Tests run: 1, Failures: 0, Errors: 0, Time elapsed: 2.075 sec
    [junit] 
    [junit] Testsuite: org.apache.cassandra.locator.EC2SnitchTest
    [junit] Tests run: 2, Failures: 0, Errors: 0, Time elapsed: 0.662 sec
    [junit] 
    [junit] Testsuite: org.apache.cassandra.locator.NetworkTopologyStrategyTest
    [junit] Tests run: 3, Failures: 0, Errors: 0, Time elapsed: 0.804 sec
    [junit] 
    [junit] Testsuite: org.apache.cassandra.locator.OldNetworkTopologyStrategyTest
    [junit] Tests run: 8, Failures: 0, Errors: 0, Time elapsed: 5.704 sec
    [junit] 
    [junit] ------------- Standard Output ---------------
    [junit] toStream : [(158873535527910577765226390751398592512,0], (0,34028236692093846346337460743176821145]]
    [junit] toFetch : [(127605887595351923798765477786913079296,148873535527910577765226390751398592512]]
    [junit] toStreamExpected : [(158873535527910577765226390751398592512,0], (0,34028236692093846346337460743176821145]]
    [junit] toFetchExpected : [(127605887595351923798765477786913079296,148873535527910577765226390751398592512]]
    [junit] ------------- ---------------- ---------------
    [junit] Testsuite: org.apache.cassandra.locator.ReplicationStrategyEndpointCacheTest
    [junit] Tests run: 2, Failures: 0, Errors: 0, Time elapsed: 5.247 sec
    [junit] 
    [junit] Testsuite: org.apache.cassandra.locator.SimpleStrategyTest
    [junit] Tests run: 4, Failures: 0, Errors: 0, Time elapsed: 5.488 sec
    [junit] 
    [junit] Testsuite: org.apache.cassandra.locator.TokenMetadataTest
    [junit] Tests run: 3, Failures: 0, Errors: 0, Time elapsed: 0.688 sec
    [junit] 
    [junit] Testsuite: org.apache.cassandra.service.AntiEntropyServiceCounterTest
    [junit] Tests run: 6, Failures: 0, Errors: 0, Time elapsed: 6.494 sec
    [junit] 
    [junit] ------------- Standard Error -----------------
    [junit]  WARN 15:54:11,022 No host ID found, created 21afc481-630c-4f96-9618-f900cdb634c3
(Note: This should happen exactly once per node).
    [junit]  WARN 15:54:11,241 Generated random token Token(bytes[724c3a77cb2f3eef80ef44deb2e2975c]).
Random tokens will result in an unbalanced ring; see http://wiki.apache.org/cassandra/Operations
    [junit] ------------- ---------------- ---------------
    [junit] Testsuite: org.apache.cassandra.service.AntiEntropyServiceStandardTest
    [junit] Tests run: 6, Failures: 0, Errors: 0, Time elapsed: 5.819 sec
    [junit] 
    [junit] ------------- Standard Error -----------------
    [junit]  WARN 15:54:18,453 No host ID found, created fb12501e-3355-477a-b136-391825a9b3a6
(Note: This should happen exactly once per node).
    [junit]  WARN 15:54:18,702 Generated random token Token(bytes[39c4c1caea1d91a69e004eb71480955b]).
Random tokens will result in an unbalanced ring; see http://wiki.apache.org/cassandra/Operations
    [junit] ------------- ---------------- ---------------
    [junit] Testsuite: org.apache.cassandra.service.CassandraServerTest
    [junit] Tests run: 1, Failures: 0, Errors: 0, Time elapsed: 5.664 sec
    [junit] 
    [junit] Testsuite: org.apache.cassandra.service.EmbeddedCassandraServiceTest
    [junit] Tests run: 1, Failures: 0, Errors: 1, Time elapsed: 6.146 sec
    [junit] 
    [junit] ------------- Standard Error -----------------
    [junit]  WARN 15:54:32,152 Unable to lock JVM memory (ENOMEM). This can result in part
of the JVM being swapped out, especially with mmapped I/O enabled. Increase RLIMIT_MEMLOCK
or run Cassandra as root.
    [junit]  WARN 15:54:32,589 No host ID found, created e90cdafe-6016-423e-8438-1e6656f46054
(Note: This should happen exactly once per node).
    [junit]  WARN 15:54:32,769 Generated random token Token(bytes[44b52220b3062d18ca3066202cc64714]).
Random tokens will result in an unbalanced ring; see http://wiki.apache.org/cassandra/Operations
    [junit] ------------- ---------------- ---------------
    [junit] Testcase: testEmbeddedCassandraService(org.apache.cassandra.service.EmbeddedCassandraServiceTest):
Caused an ERROR
    [junit] java.net.ConnectException: Connection refused
    [junit] org.apache.thrift.transport.TTransportException: java.net.ConnectException: Connection
refused
    [junit] 	at org.apache.thrift.transport.TSocket.open(TSocket.java:183)
    [junit] 	at org.apache.thrift.transport.TFramedTransport.open(TFramedTransport.java:81)
    [junit] 	at org.apache.cassandra.service.EmbeddedCassandraServiceTest.getClient(EmbeddedCassandraServiceTest.java:110)
    [junit] 	at org.apache.cassandra.service.EmbeddedCassandraServiceTest.testEmbeddedCassandraService(EmbeddedCassandraServiceTest.java:75)
    [junit] Caused by: java.net.ConnectException: Connection refused
    [junit] 	at java.net.PlainSocketImpl.socketConnect(Native Method)
    [junit] 	at java.net.PlainSocketImpl.doConnect(PlainSocketImpl.java:351)
    [junit] 	at java.net.PlainSocketImpl.connectToAddress(PlainSocketImpl.java:213)
    [junit] 	at java.net.PlainSocketImpl.connect(PlainSocketImpl.java:200)
    [junit] 	at java.net.SocksSocketImpl.connect(SocksSocketImpl.java:366)
    [junit] 	at java.net.Socket.connect(Socket.java:529)
    [junit] 	at org.apache.thrift.transport.TSocket.open(TSocket.java:178)
    [junit] 
    [junit] 
    [junit] Test org.apache.cassandra.service.EmbeddedCassandraServiceTest FAILED
    [junit] Testsuite: org.apache.cassandra.service.InitClientTest
    [junit] Tests run: 1, Failures: 0, Errors: 0, Time elapsed: 1.236 sec
    [junit] 
    [junit] Testsuite: org.apache.cassandra.service.LeaveAndBootstrapTest
    [junit] Tests run: 6, Failures: 0, Errors: 0, Time elapsed: 6.465 sec
    [junit] 
    [junit] ------------- Standard Error -----------------
    [junit]  WARN 15:54:43,215 Node /127.0.0.3 'leaving' token mismatch. Long network partition?
    [junit] ------------- ---------------- ---------------
    [junit] Testsuite: org.apache.cassandra.service.MoveTest
    [junit] Tests run: 3, Failures: 0, Errors: 0, Time elapsed: 6.299 sec
    [junit] 
    [junit] Testsuite: org.apache.cassandra.service.RemoveTest
    [junit] Tests run: 3, Failures: 0, Errors: 0, Time elapsed: 9.05 sec
    [junit] 
    [junit] ------------- Standard Error -----------------
    [junit] ERROR 15:54:58,379 Stream failed because /127.0.0.6 died or was restarted/removed
(streams may still be active in background, but further streams won't be started)
    [junit]  WARN 15:54:58,380 Streaming from /127.0.0.6 failed
    [junit] ERROR 15:54:58,381 Stream failed because /127.0.0.6 died or was restarted/removed
(streams may still be active in background, but further streams won't be started)
    [junit]  WARN 15:54:58,381 Streaming from /127.0.0.6 failed
    [junit] ERROR 15:54:58,381 Stream failed because /127.0.0.6 died or was restarted/removed
(streams may still be active in background, but further streams won't be started)
    [junit]  WARN 15:54:58,382 Streaming from /127.0.0.6 failed
    [junit] ERROR 15:54:58,382 Stream failed because /127.0.0.6 died or was restarted/removed
(streams may still be active in background, but further streams won't be started)
    [junit]  WARN 15:54:58,382 Streaming from /127.0.0.6 failed
    [junit] ERROR 15:54:58,383 Stream failed because /127.0.0.6 died or was restarted/removed
(streams may still be active in background, but further streams won't be started)
    [junit]  WARN 15:54:58,383 Streaming from /127.0.0.6 failed
    [junit] ERROR 15:54:58,383 Stream failed because /127.0.0.6 died or was restarted/removed
(streams may still be active in background, but further streams won't be started)
    [junit]  WARN 15:54:58,383 Streaming from /127.0.0.6 failed
    [junit] ------------- ---------------- ---------------
    [junit] Testsuite: org.apache.cassandra.service.RowResolverTest
    [junit] Tests run: 8, Failures: 0, Errors: 0, Time elapsed: 5.56 sec
    [junit] 
    [junit] Testsuite: org.apache.cassandra.service.SerializationsTest
    [junit] Tests run: 2, Failures: 0, Errors: 0, Time elapsed: 4.672 sec
    [junit] 
    [junit] Testsuite: org.apache.cassandra.service.StorageProxyTest
    [junit] Tests run: 4, Failures: 0, Errors: 0, Time elapsed: 5.794 sec
    [junit] 
    [junit] Testsuite: org.apache.cassandra.service.StorageServiceClientTest
    [junit] Tests run: 1, Failures: 0, Errors: 0, Time elapsed: 2.92 sec
    [junit] 
    [junit] Testsuite: org.apache.cassandra.service.StorageServiceServerTest
    [junit] Tests run: 4, Failures: 0, Errors: 0, Time elapsed: 3.318 sec
    [junit] 
    [junit] ------------- Standard Error -----------------
    [junit]  WARN 15:55:26,137 No host ID found, created 425a7bda-7d2d-45c2-ab7d-1f1435d424d9
(Note: This should happen exactly once per node).
    [junit]  WARN 15:55:26,488 Generated random token Token(bytes[38226be131e37087db997862c7bb7ae0]).
Random tokens will result in an unbalanced ring; see http://wiki.apache.org/cassandra/Operations
    [junit] ------------- ---------------- ---------------
    [junit] Testsuite: org.apache.cassandra.streaming.BootstrapTest
    [junit] Tests run: 1, Failures: 0, Errors: 0, Time elapsed: 5.22 sec
    [junit] 
    [junit] Testsuite: org.apache.cassandra.streaming.SerializationsTest
    [junit] Tests run: 4, Failures: 0, Errors: 0, Time elapsed: 5.512 sec
    [junit] 
    [junit] Testsuite: org.apache.cassandra.streaming.StreamingTransferTest
    [junit] Tests run: 5, Failures: 0, Errors: 0, Time elapsed: 5.247 sec
    [junit] 
    [junit] ------------- Standard Error -----------------
    [junit]  WARN 15:55:46,128 No host ID found, created cde7d2c6-7aa7-48c9-be15-3063ec7694a4
(Note: This should happen exactly once per node).
    [junit]  WARN 15:55:46,340 Generated random token Token(bytes[01292749026949758753cf0e2ef5e1cb]).
Random tokens will result in an unbalanced ring; see http://wiki.apache.org/cassandra/Operations
    [junit] ------------- ---------------- ---------------
    [junit] Testsuite: org.apache.cassandra.thrift.ThriftValidationTest
    [junit] Tests run: 5, Failures: 0, Errors: 0, Time elapsed: 5.273 sec
    [junit] 
    [junit] Testsuite: org.apache.cassandra.tools.SSTableExportTest
    [junit] Tests run: 7, Failures: 0, Errors: 0, Time elapsed: 5.519 sec
    [junit] 
    [junit] ------------- Standard Output ---------------
    [junit] Importing 1 keys...
    [junit] 1 keys imported successfully.
    [junit] [{"columns":[["636f6c4e616d65","76616c",1342108559438],["636f6c4e616d6531","76616c31",1342108559438]],"key":"726f7741","metadata":{"deletionInfo":{"markedForDeleteAt":0,"localDeletionTime":0}}}]
    [junit] ------------- ---------------- ---------------
    [junit] Testsuite: org.apache.cassandra.tools.SSTableImportTest
    [junit] Tests run: 7, Failures: 0, Errors: 0, Time elapsed: 5.568 sec
    [junit] 
    [junit] ------------- Standard Output ---------------
    [junit] Counting keys to import, please wait... (NOTE: to skip this use -n <num_keys>)
    [junit] Importing 2 keys...
    [junit] 2 keys imported successfully.
    [junit] Counting keys to import, please wait... (NOTE: to skip this use -n <num_keys>)
    [junit] Importing 2 keys...
    [junit] 2 keys imported successfully.
    [junit] Counting keys to import, please wait... (NOTE: to skip this use -n <num_keys>)
    [junit] Importing 2 keys...
    [junit] 2 keys imported successfully.
    [junit] Importing 3 keys...
    [junit] Importing 2 keys...
    [junit] 2 keys imported successfully.
    [junit] Counting keys to import, please wait... (NOTE: to skip this use -n <num_keys>)
    [junit] Importing 2 keys...
    [junit] 2 keys imported successfully.
    [junit] Counting keys to import, please wait... (NOTE: to skip this use -n <num_keys>)
    [junit] Importing 1 keys...
    [junit] 1 keys imported successfully.
    [junit] ------------- ---------------- ---------------
    [junit] ------------- Standard Error -----------------
    [junit] Line 2: Key null is greater than previous, collection is not sorted properly.
Aborting import. You might need to delete SSTables manually.
    [junit] ------------- ---------------- ---------------
    [junit] Testsuite: org.apache.cassandra.utils.BloomFilterTest
    [junit] Tests run: 7, Failures: 0, Errors: 0, Time elapsed: 0.415 sec
    [junit] 
    [junit] Testsuite: org.apache.cassandra.utils.BoundedStatsDequeTest
    [junit] Tests run: 1, Failures: 0, Errors: 0, Time elapsed: 0.043 sec
    [junit] 
    [junit] Testsuite: org.apache.cassandra.utils.ByteBufferUtilTest
    [junit] Tests run: 10, Failures: 0, Errors: 0, Time elapsed: 0.059 sec
    [junit] 
    [junit] Testsuite: org.apache.cassandra.utils.BytesReadTrackerTest
    [junit] Tests run: 4, Failures: 0, Errors: 0, Time elapsed: 0.048 sec
    [junit] 
    [junit] Testsuite: org.apache.cassandra.utils.EncodedStreamsTest
    [junit] Tests run: 4, Failures: 0, Errors: 0, Time elapsed: 5.595 sec
    [junit] 
    [junit] Testsuite: org.apache.cassandra.utils.EstimatedHistogramTest
    [junit] Tests run: 5, Failures: 0, Errors: 0, Time elapsed: 0.048 sec
    [junit] 
    [junit] Testsuite: org.apache.cassandra.utils.FBUtilitiesTest
    [junit] Tests run: 2, Failures: 0, Errors: 0, Time elapsed: 0.046 sec
    [junit] 
    [junit] Testsuite: org.apache.cassandra.utils.HexTest
    [junit] Tests run: 2, Failures: 0, Errors: 0, Time elapsed: 0.046 sec
    [junit] 
    [junit] Testsuite: org.apache.cassandra.utils.IntervalTreeTest
    [junit] Tests run: 3, Failures: 0, Errors: 0, Time elapsed: 0.148 sec
    [junit] 
    [junit] Testsuite: org.apache.cassandra.utils.LegacyBloomFilterTest
    [junit] Tests run: 6, Failures: 0, Errors: 0, Time elapsed: 0.404 sec
    [junit] 
    [junit] Testsuite: org.apache.cassandra.utils.MergeIteratorTest
    [junit] Tests run: 1, Failures: 0, Errors: 0, Time elapsed: 0.063 sec
    [junit] 
    [junit] Testsuite: org.apache.cassandra.utils.MerkleTreeTest
    [junit] Tests run: 12, Failures: 0, Errors: 0, Time elapsed: 0.799 sec
    [junit] 
    [junit] Testsuite: org.apache.cassandra.utils.SemanticVersionTest
    [junit] Tests run: 4, Failures: 0, Errors: 0, Time elapsed: 0.06 sec
    [junit] 
    [junit] Testsuite: org.apache.cassandra.utils.SerializationsTest
    [junit] Tests run: 4, Failures: 0, Errors: 0, Time elapsed: 6.233 sec
    [junit] 
    [junit] Testsuite: org.apache.cassandra.utils.StreamingHistogramTest
    [junit] Tests run: 2, Failures: 0, Errors: 0, Time elapsed: 0.064 sec
    [junit] 

BUILD FAILED
/x1/jenkins/jenkins-slave/workspace/Cassandra-quick/build.xml:1094: The following error occurred
while executing this line:
/x1/jenkins/jenkins-slave/workspace/Cassandra-quick/build.xml:1056: Some unit test(s) failed.

Total time: 9 minutes 44 seconds
Build step 'Invoke Ant' marked build as failure
[TASKS] Skipping publisher since build result is FAILURE
Recording test results

Mime
View raw message