incubator-cassandra-dev mailing list archives

Site index · List index
Message view « Date » · « Thread »
Top « Date » · « Thread »
From Apache Jenkins Server <jenk...@builds.apache.org>
Subject Build failed in Jenkins: Cassandra-quick #789
Date Sat, 07 Jul 2012 15:36:43 GMT
See <https://builds.apache.org/job/Cassandra-quick/789/>

------------------------------------------
[...truncated 438 lines...]
    [junit] ------------- Standard Error -----------------
    [junit]  WARN 15:29:56,867 setting live ratio to maximum of 64.0 instead of 90.66666666666667
    [junit] ------------- ---------------- ---------------
    [junit] Testsuite: org.apache.cassandra.io.compress.CompressedRandomAccessReaderTest
    [junit] Tests run: 3, Failures: 0, Errors: 0, Time elapsed: 1.589 sec
    [junit] 
    [junit] ------------- Standard Error -----------------
    [junit]  WARN 15:30:07,521 open(null, O_RDONLY) failed, errno (14).
    [junit] ------------- ---------------- ---------------
    [junit] Testsuite: org.apache.cassandra.io.sstable.DescriptorTest
    [junit] Tests run: 3, Failures: 0, Errors: 0, Time elapsed: 0.065 sec
    [junit] 
    [junit] Testsuite: org.apache.cassandra.io.sstable.IndexHelperTest
    [junit] Tests run: 1, Failures: 0, Errors: 0, Time elapsed: 0.061 sec
    [junit] 
    [junit] Testsuite: org.apache.cassandra.io.sstable.LegacySSTableTest
    [junit] Tests run: 1, Failures: 0, Errors: 0, Time elapsed: 12.095 sec
    [junit] 
    [junit] Testsuite: org.apache.cassandra.io.sstable.SSTableMetadataSerializerTest
    [junit] Tests run: 1, Failures: 0, Errors: 0, Time elapsed: 0.138 sec
    [junit] 
    [junit] Testsuite: org.apache.cassandra.io.sstable.SSTableReaderTest
    [junit] Tests run: 8, Failures: 0, Errors: 0, Time elapsed: 15.942 sec
    [junit] 
    [junit] ------------- Standard Error -----------------
    [junit]  WARN 15:30:35,096 setting live ratio to maximum of 64.0 instead of 85.68888888888888
    [junit]  WARN 15:30:37,286 setting live ratio to maximum of 64.0 instead of 67.63636363636364
    [junit] ------------- ---------------- ---------------
    [junit] Testsuite: org.apache.cassandra.io.sstable.SSTableSimpleWriterTest
    [junit] Tests run: 1, Failures: 0, Errors: 0, Time elapsed: 11.335 sec
    [junit] 
    [junit] Testsuite: org.apache.cassandra.io.sstable.SSTableTest
    [junit] Tests run: 2, Failures: 0, Errors: 0, Time elapsed: 11.861 sec
    [junit] 
    [junit] Testsuite: org.apache.cassandra.io.util.BufferedRandomAccessFileTest
    [junit] Tests run: 18, Failures: 0, Errors: 0, Time elapsed: 2.674 sec
    [junit] 
    [junit] Testsuite: org.apache.cassandra.locator.DynamicEndpointSnitchTest
    [junit] Tests run: 1, Failures: 0, Errors: 0, Time elapsed: 2.253 sec
    [junit] 
    [junit] Testsuite: org.apache.cassandra.locator.EC2SnitchTest
    [junit] Tests run: 2, Failures: 0, Errors: 0, Time elapsed: 0.994 sec
    [junit] 
    [junit] Testsuite: org.apache.cassandra.locator.NetworkTopologyStrategyTest
    [junit] Tests run: 3, Failures: 0, Errors: 0, Time elapsed: 1.032 sec
    [junit] 
    [junit] Testsuite: org.apache.cassandra.locator.OldNetworkTopologyStrategyTest
    [junit] Tests run: 8, Failures: 0, Errors: 0, Time elapsed: 13.844 sec
    [junit] 
    [junit] ------------- Standard Output ---------------
    [junit] toStream : [(158873535527910577765226390751398592512,0], (0,34028236692093846346337460743176821145]]
    [junit] toFetch : [(127605887595351923798765477786913079296,148873535527910577765226390751398592512]]
    [junit] toStreamExpected : [(158873535527910577765226390751398592512,0], (0,34028236692093846346337460743176821145]]
    [junit] toFetchExpected : [(127605887595351923798765477786913079296,148873535527910577765226390751398592512]]
    [junit] ------------- ---------------- ---------------
    [junit] Testsuite: org.apache.cassandra.locator.ReplicationStrategyEndpointCacheTest
    [junit] Tests run: 2, Failures: 0, Errors: 0, Time elapsed: 11.373 sec
    [junit] 
    [junit] Testsuite: org.apache.cassandra.locator.SimpleStrategyTest
    [junit] Tests run: 4, Failures: 0, Errors: 0, Time elapsed: 11.358 sec
    [junit] 
    [junit] Testsuite: org.apache.cassandra.locator.TokenMetadataTest
    [junit] Tests run: 3, Failures: 0, Errors: 0, Time elapsed: 0.908 sec
    [junit] 
    [junit] Testsuite: org.apache.cassandra.service.AntiEntropyServiceCounterTest
    [junit] Tests run: 6, Failures: 0, Errors: 0, Time elapsed: 13.854 sec
    [junit] 
    [junit] ------------- Standard Error -----------------
    [junit]  WARN 15:32:06,421 No host ID found, created 755fa75d-b16f-4b36-9329-07cf88d53aef
(Note: This should happen exactly once per node).
    [junit]  WARN 15:32:06,838 Generated random token Token(bytes[e9088793e88af78b9ff9a2c54dcb1200]).
Random tokens will result in an unbalanced ring; see http://wiki.apache.org/cassandra/Operations
    [junit] ------------- ---------------- ---------------
    [junit] Testsuite: org.apache.cassandra.service.AntiEntropyServiceStandardTest
    [junit] Tests run: 6, Failures: 0, Errors: 0, Time elapsed: 13.609 sec
    [junit] 
    [junit] ------------- Standard Error -----------------
    [junit]  WARN 15:32:21,612 No host ID found, created 681fbd2c-1b91-4474-a864-778e99b6899d
(Note: This should happen exactly once per node).
    [junit]  WARN 15:32:22,007 Generated random token Token(bytes[05182f1b36303c2f5b3f6892249f622e]).
Random tokens will result in an unbalanced ring; see http://wiki.apache.org/cassandra/Operations
    [junit] ------------- ---------------- ---------------
    [junit] Testsuite: org.apache.cassandra.service.CassandraServerTest
    [junit] Tests run: 1, Failures: 0, Errors: 0, Time elapsed: 11.163 sec
    [junit] 
    [junit] Testsuite: org.apache.cassandra.service.EmbeddedCassandraServiceTest
    [junit] Tests run: 1, Failures: 0, Errors: 1, Time elapsed: 12.651 sec
    [junit] 
    [junit] ------------- Standard Error -----------------
    [junit]  WARN 15:32:48,464 Unable to lock JVM memory (ENOMEM). This can result in part
of the JVM being swapped out, especially with mmapped I/O enabled. Increase RLIMIT_MEMLOCK
or run Cassandra as root.
    [junit]  WARN 15:32:49,016 No host ID found, created 68e78f4f-649c-4b18-8ec0-3ab239c7e6b4
(Note: This should happen exactly once per node).
    [junit]  WARN 15:32:49,408 Generated random token Token(bytes[a6f985d1eaeeb2d2833fae7df4757bec]).
Random tokens will result in an unbalanced ring; see http://wiki.apache.org/cassandra/Operations
    [junit] ------------- ---------------- ---------------
    [junit] Testcase: testEmbeddedCassandraService(org.apache.cassandra.service.EmbeddedCassandraServiceTest):
Caused an ERROR
    [junit] java.net.ConnectException: Connection refused
    [junit] org.apache.thrift.transport.TTransportException: java.net.ConnectException: Connection
refused
    [junit] 	at org.apache.thrift.transport.TSocket.open(TSocket.java:183)
    [junit] 	at org.apache.thrift.transport.TFramedTransport.open(TFramedTransport.java:81)
    [junit] 	at org.apache.cassandra.service.EmbeddedCassandraServiceTest.getClient(EmbeddedCassandraServiceTest.java:110)
    [junit] 	at org.apache.cassandra.service.EmbeddedCassandraServiceTest.testEmbeddedCassandraService(EmbeddedCassandraServiceTest.java:75)
    [junit] Caused by: java.net.ConnectException: Connection refused
    [junit] 	at java.net.PlainSocketImpl.socketConnect(Native Method)
    [junit] 	at java.net.PlainSocketImpl.doConnect(PlainSocketImpl.java:351)
    [junit] 	at java.net.PlainSocketImpl.connectToAddress(PlainSocketImpl.java:213)
    [junit] 	at java.net.PlainSocketImpl.connect(PlainSocketImpl.java:200)
    [junit] 	at java.net.SocksSocketImpl.connect(SocksSocketImpl.java:366)
    [junit] 	at java.net.Socket.connect(Socket.java:529)
    [junit] 	at org.apache.thrift.transport.TSocket.open(TSocket.java:178)
    [junit] 
    [junit] 
    [junit] Test org.apache.cassandra.service.EmbeddedCassandraServiceTest FAILED
    [junit] Testsuite: org.apache.cassandra.service.InitClientTest
    [junit] Tests run: 1, Failures: 0, Errors: 0, Time elapsed: 1.506 sec
    [junit] 
    [junit] Testsuite: org.apache.cassandra.service.LeaveAndBootstrapTest
    [junit] Tests run: 6, Failures: 0, Errors: 0, Time elapsed: 23.171 sec
    [junit] 
    [junit] ------------- Standard Error -----------------
    [junit]  WARN 15:33:14,802 Node /127.0.0.3 'leaving' token mismatch. Long network partition?
    [junit] ------------- ---------------- ---------------
    [junit] Testsuite: org.apache.cassandra.service.MoveTest
    [junit] Tests run: 3, Failures: 0, Errors: 0, Time elapsed: 17.81 sec
    [junit] 
    [junit] Testsuite: org.apache.cassandra.service.RemoveTest
    [junit] Tests run: 3, Failures: 0, Errors: 0, Time elapsed: 18.44 sec
    [junit] 
    [junit] ------------- Standard Error -----------------
    [junit] ERROR 15:33:52,521 Stream failed because /127.0.0.6 died or was restarted/removed
(streams may still be active in background, but further streams won't be started)
    [junit]  WARN 15:33:52,522 Streaming from /127.0.0.6 failed
    [junit] ERROR 15:33:52,522 Stream failed because /127.0.0.6 died or was restarted/removed
(streams may still be active in background, but further streams won't be started)
    [junit]  WARN 15:33:52,522 Streaming from /127.0.0.6 failed
    [junit] ERROR 15:33:52,522 Stream failed because /127.0.0.6 died or was restarted/removed
(streams may still be active in background, but further streams won't be started)
    [junit]  WARN 15:33:52,523 Streaming from /127.0.0.6 failed
    [junit] ERROR 15:33:52,523 Stream failed because /127.0.0.6 died or was restarted/removed
(streams may still be active in background, but further streams won't be started)
    [junit]  WARN 15:33:52,523 Streaming from /127.0.0.6 failed
    [junit] ERROR 15:33:52,523 Stream failed because /127.0.0.6 died or was restarted/removed
(streams may still be active in background, but further streams won't be started)
    [junit]  WARN 15:33:52,523 Streaming from /127.0.0.6 failed
    [junit] ERROR 15:33:52,523 Stream failed because /127.0.0.6 died or was restarted/removed
(streams may still be active in background, but further streams won't be started)
    [junit]  WARN 15:33:52,523 Streaming from /127.0.0.6 failed
    [junit] ------------- ---------------- ---------------
    [junit] Testsuite: org.apache.cassandra.service.RowResolverTest
    [junit] Tests run: 8, Failures: 0, Errors: 0, Time elapsed: 11.252 sec
    [junit] 
    [junit] Testsuite: org.apache.cassandra.service.SerializationsTest
    [junit] Tests run: 2, Failures: 0, Errors: 0, Time elapsed: 10.664 sec
    [junit] 
    [junit] Testsuite: org.apache.cassandra.service.StorageProxyTest
    [junit] Tests run: 4, Failures: 0, Errors: 0, Time elapsed: 11.242 sec
    [junit] 
    [junit] Testsuite: org.apache.cassandra.service.StorageServiceClientTest
    [junit] Tests run: 1, Failures: 0, Errors: 0, Time elapsed: 3.106 sec
    [junit] 
    [junit] Testsuite: org.apache.cassandra.service.StorageServiceServerTest
    [junit] Tests run: 4, Failures: 0, Errors: 0, Time elapsed: 3.91 sec
    [junit] 
    [junit] ------------- Standard Error -----------------
    [junit]  WARN 15:34:38,226 No host ID found, created c96fec7c-7c9b-4a6e-913a-acb23434c035
(Note: This should happen exactly once per node).
    [junit]  WARN 15:34:38,783 Generated random token Token(bytes[ec429380c5356f3650a2d5a754c721d0]).
Random tokens will result in an unbalanced ring; see http://wiki.apache.org/cassandra/Operations
    [junit] ------------- ---------------- ---------------
    [junit] Testsuite: org.apache.cassandra.streaming.BootstrapTest
    [junit] Tests run: 1, Failures: 0, Errors: 0, Time elapsed: 11.091 sec
    [junit] 
    [junit] Testsuite: org.apache.cassandra.streaming.SerializationsTest
    [junit] Tests run: 4, Failures: 0, Errors: 0, Time elapsed: 11.249 sec
    [junit] 
    [junit] Testsuite: org.apache.cassandra.streaming.StreamingTransferTest
    [junit] Tests run: 5, Failures: 0, Errors: 0, Time elapsed: 15.732 sec
    [junit] 
    [junit] ------------- Standard Error -----------------
    [junit]  WARN 15:35:15,965 No host ID found, created 267764ef-9378-421e-9c53-1422cc086919
(Note: This should happen exactly once per node).
    [junit]  WARN 15:35:16,342 Generated random token Token(bytes[d44573e7f065492a7d7112cec7ec4ad3]).
Random tokens will result in an unbalanced ring; see http://wiki.apache.org/cassandra/Operations
    [junit] ------------- ---------------- ---------------
    [junit] Testsuite: org.apache.cassandra.thrift.ThriftValidationTest
    [junit] Tests run: 5, Failures: 0, Errors: 0, Time elapsed: 11.379 sec
    [junit] 
    [junit] Testsuite: org.apache.cassandra.tools.SSTableExportTest
    [junit] Tests run: 6, Failures: 0, Errors: 0, Time elapsed: 12.694 sec
    [junit] 
    [junit] ------------- Standard Output ---------------
    [junit] Importing 1 keys...
    [junit] 1 keys imported successfully.
    [junit] ------------- ---------------- ---------------
    [junit] Testsuite: org.apache.cassandra.tools.SSTableImportTest
    [junit] Tests run: 5, Failures: 0, Errors: 0, Time elapsed: 12.127 sec
    [junit] 
    [junit] ------------- Standard Output ---------------
    [junit] Importing 2 keys...
    [junit] 2 keys imported successfully.
    [junit] Importing 2 keys...
    [junit] 2 keys imported successfully.
    [junit] Importing 2 keys...
    [junit] 2 keys imported successfully.
    [junit] Importing 3 keys...
    [junit] Importing 3 keys...
    [junit] 1 keys imported successfully.
    [junit] ------------- ---------------- ---------------
    [junit] ------------- Standard Error -----------------
    [junit] Line 2: Key 303630 is greater than previous, collection is not sorted properly.
Aborting import. You might need to delete SSTables manually.
    [junit] ------------- ---------------- ---------------
    [junit] Testsuite: org.apache.cassandra.utils.BloomFilterTest
    [junit] Tests run: 7, Failures: 0, Errors: 0, Time elapsed: 0.859 sec
    [junit] 
    [junit] Testsuite: org.apache.cassandra.utils.BoundedStatsDequeTest
    [junit] Tests run: 1, Failures: 0, Errors: 0, Time elapsed: 0.057 sec
    [junit] 
    [junit] Testsuite: org.apache.cassandra.utils.ByteBufferUtilTest
    [junit] Tests run: 10, Failures: 0, Errors: 0, Time elapsed: 0.078 sec
    [junit] 
    [junit] Testsuite: org.apache.cassandra.utils.BytesReadTrackerTest
    [junit] Tests run: 4, Failures: 0, Errors: 0, Time elapsed: 0.062 sec
    [junit] 
    [junit] Testsuite: org.apache.cassandra.utils.EncodedStreamsTest
    [junit] Tests run: 4, Failures: 0, Errors: 0, Time elapsed: 11.218 sec
    [junit] 
    [junit] Testsuite: org.apache.cassandra.utils.EstimatedHistogramTest
    [junit] Tests run: 5, Failures: 0, Errors: 0, Time elapsed: 0.064 sec
    [junit] 
    [junit] Testsuite: org.apache.cassandra.utils.FBUtilitiesTest
    [junit] Tests run: 2, Failures: 0, Errors: 0, Time elapsed: 0.065 sec
    [junit] 
    [junit] Testsuite: org.apache.cassandra.utils.HexTest
    [junit] Tests run: 2, Failures: 0, Errors: 0, Time elapsed: 0.062 sec
    [junit] 
    [junit] Testsuite: org.apache.cassandra.utils.IntervalTreeTest
    [junit] Tests run: 3, Failures: 0, Errors: 0, Time elapsed: 0.177 sec
    [junit] 
    [junit] Testsuite: org.apache.cassandra.utils.LegacyBloomFilterTest
    [junit] Tests run: 6, Failures: 0, Errors: 0, Time elapsed: 0.7 sec
    [junit] 
    [junit] Testsuite: org.apache.cassandra.utils.MergeIteratorTest
    [junit] Tests run: 1, Failures: 0, Errors: 0, Time elapsed: 0.076 sec
    [junit] 
    [junit] Testsuite: org.apache.cassandra.utils.MerkleTreeTest
    [junit] Tests run: 12, Failures: 0, Errors: 0, Time elapsed: 0.932 sec
    [junit] 
    [junit] Testsuite: org.apache.cassandra.utils.SemanticVersionTest
    [junit] Tests run: 4, Failures: 0, Errors: 0, Time elapsed: 0.063 sec
    [junit] 
    [junit] Testsuite: org.apache.cassandra.utils.SerializationsTest
    [junit] Tests run: 4, Failures: 0, Errors: 0, Time elapsed: 12.827 sec
    [junit] 
    [junit] Testsuite: org.apache.cassandra.utils.StreamingHistogramTest
    [junit] Tests run: 2, Failures: 0, Errors: 0, Time elapsed: 0.061 sec
    [junit] 

BUILD FAILED
<https://builds.apache.org/job/Cassandra-quick/ws/build.xml>:1094: The following error
occurred while executing this line:
<https://builds.apache.org/job/Cassandra-quick/ws/build.xml>:1056: Some unit test(s)
failed.

Total time: 19 minutes 5 seconds
Build step 'Invoke Ant' marked build as failure
[TASKS] Skipping publisher since build result is FAILURE
Recording test results

Mime
View raw message