incubator-cassandra-dev mailing list archives

Site index · List index
Message view « Date » · « Thread »
Top « Date » · « Thread »
From Apache Jenkins Server <jenk...@builds.apache.org>
Subject Build failed in Jenkins: Cassandra-quick #575
Date Sat, 16 Jun 2012 14:56:59 GMT
See <https://builds.apache.org/job/Cassandra-quick/575/>

------------------------------------------
[...truncated 578 lines...]
    [junit] 	at java.util.concurrent.Executors$RunnableAdapter.call(Executors.java:441)
    [junit] 	at java.util.concurrent.FutureTask$Sync.innerRun(FutureTask.java:303)
    [junit] 	at java.util.concurrent.FutureTask.run(FutureTask.java:138)
    [junit] 	at java.util.concurrent.ThreadPoolExecutor$Worker.runTask(ThreadPoolExecutor.java:886)
    [junit] 	at java.util.concurrent.ThreadPoolExecutor$Worker.run(ThreadPoolExecutor.java:908)
    [junit] 	at java.lang.Thread.run(Thread.java:662)
    [junit] ------------- ---------------- ---------------
    [junit] Testsuite: org.apache.cassandra.service.MoveTest
    [junit] Tests run: 3, Failures: 0, Errors: 0, Time elapsed: 6.271 sec
    [junit] 
    [junit] Testsuite: org.apache.cassandra.service.RemoveTest
    [junit] Tests run: 3, Failures: 0, Errors: 0, Time elapsed: 8.991 sec
    [junit] 
    [junit] ------------- Standard Error -----------------
    [junit] ERROR 14:55:22,661 Stream failed because /127.0.0.6 died or was restarted/removed
(streams may still be active in background, but further streams won't be started)
    [junit]  WARN 14:55:22,661 Streaming from /127.0.0.6 failed
    [junit] ERROR 14:55:22,662 Stream failed because /127.0.0.6 died or was restarted/removed
(streams may still be active in background, but further streams won't be started)
    [junit]  WARN 14:55:22,662 Streaming from /127.0.0.6 failed
    [junit] ERROR 14:55:22,662 Stream failed because /127.0.0.6 died or was restarted/removed
(streams may still be active in background, but further streams won't be started)
    [junit]  WARN 14:55:22,663 Streaming from /127.0.0.6 failed
    [junit] ERROR 14:55:22,663 Stream failed because /127.0.0.6 died or was restarted/removed
(streams may still be active in background, but further streams won't be started)
    [junit]  WARN 14:55:22,663 Streaming from /127.0.0.6 failed
    [junit] ERROR 14:55:22,663 Stream failed because /127.0.0.6 died or was restarted/removed
(streams may still be active in background, but further streams won't be started)
    [junit]  WARN 14:55:22,663 Streaming from /127.0.0.6 failed
    [junit] ERROR 14:55:22,663 Stream failed because /127.0.0.6 died or was restarted/removed
(streams may still be active in background, but further streams won't be started)
    [junit]  WARN 14:55:22,664 Streaming from /127.0.0.6 failed
    [junit] ------------- ---------------- ---------------
    [junit] Testsuite: org.apache.cassandra.service.RowResolverTest
    [junit] Tests run: 8, Failures: 0, Errors: 0, Time elapsed: 5.561 sec
    [junit] 
    [junit] Testsuite: org.apache.cassandra.service.SerializationsTest
    [junit] Tests run: 2, Failures: 0, Errors: 0, Time elapsed: 4.826 sec
    [junit] 
    [junit] Testsuite: org.apache.cassandra.service.StorageProxyTest
    [junit] Tests run: 4, Failures: 0, Errors: 0, Time elapsed: 5.582 sec
    [junit] 
    [junit] Testsuite: org.apache.cassandra.service.StorageServiceClientTest
    [junit] Tests run: 1, Failures: 0, Errors: 0, Time elapsed: 3.032 sec
    [junit] 
    [junit] Testsuite: org.apache.cassandra.service.StorageServiceServerTest
    [junit] Tests run: 4, Failures: 0, Errors: 0, Time elapsed: 3.313 sec
    [junit] 
    [junit] ------------- Standard Error -----------------
    [junit]  WARN 14:55:50,542 No host ID found, created 27e44812-b92a-4302-b7ae-55c579b15ad7
(Note: This should happen exactly once per node).
    [junit]  WARN 14:55:50,810 Generated random token Token(bytes[a8f28fd1bddf17557241961c7b76c7f9]).
Random tokens will result in an unbalanced ring; see http://wiki.apache.org/cassandra/Operations
    [junit] ------------- ---------------- ---------------
    [junit] Testsuite: org.apache.cassandra.streaming.BootstrapTest
    [junit] Tests run: 1, Failures: 0, Errors: 0, Time elapsed: 5.499 sec
    [junit] 
    [junit] Testsuite: org.apache.cassandra.streaming.SerializationsTest
    [junit] Tests run: 4, Failures: 0, Errors: 0, Time elapsed: 5.605 sec
    [junit] 
    [junit] Testsuite: org.apache.cassandra.streaming.StreamingTransferTest
    [junit] Tests run: 5, Failures: 2, Errors: 0, Time elapsed: 5.356 sec
    [junit] 
    [junit] ------------- Standard Error -----------------
    [junit]  WARN 14:56:10,983 No host ID found, created 4635b913-f5e8-438a-a824-fa5b3f3c1005
(Note: This should happen exactly once per node).
    [junit]  WARN 14:56:11,142 Generated random token Token(bytes[1dfa0e4fa2436cdaf9ea18f5694e8bf7]).
Random tokens will result in an unbalanced ring; see http://wiki.apache.org/cassandra/Operations
    [junit] ERROR 14:56:11,239 Fatal exception in thread Thread[Streaming to /127.0.0.1:1,5,main]
    [junit] java.lang.RuntimeException: java.io.EOFException
    [junit] 	at org.apache.cassandra.utils.FBUtilities.unchecked(FBUtilities.java:616)
    [junit] 	at org.apache.cassandra.utils.WrappedRunnable.run(WrappedRunnable.java:30)
    [junit] 	at java.util.concurrent.ThreadPoolExecutor$Worker.runTask(ThreadPoolExecutor.java:886)
    [junit] 	at java.util.concurrent.ThreadPoolExecutor$Worker.run(ThreadPoolExecutor.java:908)
    [junit] 	at java.lang.Thread.run(Thread.java:662)
    [junit] Caused by: java.io.EOFException
    [junit] 	at java.io.DataInputStream.readFully(DataInputStream.java:180)
    [junit] 	at java.io.DataInputStream.readUTF(DataInputStream.java:592)
    [junit] 	at java.io.DataInputStream.readUTF(DataInputStream.java:547)
    [junit] 	at org.apache.cassandra.streaming.FileStreamTask.receiveReply(FileStreamTask.java:194)
    [junit] 	at org.apache.cassandra.streaming.FileStreamTask.stream(FileStreamTask.java:174)
    [junit] 	at org.apache.cassandra.streaming.FileStreamTask.runMayThrow(FileStreamTask.java:89)
    [junit] 	at org.apache.cassandra.utils.WrappedRunnable.run(WrappedRunnable.java:26)
    [junit] 	... 3 more
    [junit] ERROR 14:56:11,288 Fatal exception in thread Thread[Streaming to /127.0.0.1:2,5,main]
    [junit] java.lang.RuntimeException: java.io.EOFException
    [junit] 	at org.apache.cassandra.utils.FBUtilities.unchecked(FBUtilities.java:616)
    [junit] 	at org.apache.cassandra.utils.WrappedRunnable.run(WrappedRunnable.java:30)
    [junit] 	at java.util.concurrent.ThreadPoolExecutor$Worker.runTask(ThreadPoolExecutor.java:886)
    [junit] 	at java.util.concurrent.ThreadPoolExecutor$Worker.run(ThreadPoolExecutor.java:908)
    [junit] 	at java.lang.Thread.run(Thread.java:662)
    [junit] Caused by: java.io.EOFException
    [junit] 	at java.io.DataInputStream.readFully(DataInputStream.java:180)
    [junit] 	at java.io.DataInputStream.readUTF(DataInputStream.java:592)
    [junit] 	at java.io.DataInputStream.readUTF(DataInputStream.java:547)
    [junit] 	at org.apache.cassandra.streaming.FileStreamTask.receiveReply(FileStreamTask.java:194)
    [junit] 	at org.apache.cassandra.streaming.FileStreamTask.stream(FileStreamTask.java:174)
    [junit] 	at org.apache.cassandra.streaming.FileStreamTask.runMayThrow(FileStreamTask.java:89)
    [junit] 	at org.apache.cassandra.utils.WrappedRunnable.run(WrappedRunnable.java:26)
    [junit] 	... 3 more
    [junit] ERROR 14:56:11,343 Fatal exception in thread Thread[Streaming to /127.0.0.1:3,5,main]
    [junit] java.lang.RuntimeException: java.io.EOFException
    [junit] 	at org.apache.cassandra.utils.FBUtilities.unchecked(FBUtilities.java:616)
    [junit] 	at org.apache.cassandra.utils.WrappedRunnable.run(WrappedRunnable.java:30)
    [junit] 	at java.util.concurrent.ThreadPoolExecutor$Worker.runTask(ThreadPoolExecutor.java:886)
    [junit] 	at java.util.concurrent.ThreadPoolExecutor$Worker.run(ThreadPoolExecutor.java:908)
    [junit] 	at java.lang.Thread.run(Thread.java:662)
    [junit] Caused by: java.io.EOFException
    [junit] 	at java.io.DataInputStream.readFully(DataInputStream.java:180)
    [junit] 	at java.io.DataInputStream.readUTF(DataInputStream.java:592)
    [junit] 	at java.io.DataInputStream.readUTF(DataInputStream.java:547)
    [junit] 	at org.apache.cassandra.streaming.FileStreamTask.receiveReply(FileStreamTask.java:194)
    [junit] 	at org.apache.cassandra.streaming.FileStreamTask.stream(FileStreamTask.java:174)
    [junit] 	at org.apache.cassandra.streaming.FileStreamTask.runMayThrow(FileStreamTask.java:89)
    [junit] 	at org.apache.cassandra.utils.WrappedRunnable.run(WrappedRunnable.java:26)
    [junit] 	... 3 more
    [junit] ERROR 14:56:11,362 Fatal exception in thread Thread[Streaming to /127.0.0.1:4,5,main]
    [junit] java.lang.RuntimeException: java.io.EOFException
    [junit] 	at org.apache.cassandra.utils.FBUtilities.unchecked(FBUtilities.java:616)
    [junit] 	at org.apache.cassandra.utils.WrappedRunnable.run(WrappedRunnable.java:30)
    [junit] 	at java.util.concurrent.ThreadPoolExecutor$Worker.runTask(ThreadPoolExecutor.java:886)
    [junit] 	at java.util.concurrent.ThreadPoolExecutor$Worker.run(ThreadPoolExecutor.java:908)
    [junit] 	at java.lang.Thread.run(Thread.java:662)
    [junit] Caused by: java.io.EOFException
    [junit] 	at java.io.DataInputStream.readFully(DataInputStream.java:180)
    [junit] 	at java.io.DataInputStream.readUTF(DataInputStream.java:592)
    [junit] 	at java.io.DataInputStream.readUTF(DataInputStream.java:547)
    [junit] 	at org.apache.cassandra.streaming.FileStreamTask.receiveReply(FileStreamTask.java:194)
    [junit] 	at org.apache.cassandra.streaming.FileStreamTask.stream(FileStreamTask.java:174)
    [junit] 	at org.apache.cassandra.streaming.FileStreamTask.runMayThrow(FileStreamTask.java:89)
    [junit] 	at org.apache.cassandra.utils.WrappedRunnable.run(WrappedRunnable.java:26)
    [junit] 	... 3 more
    [junit] ERROR 14:56:11,401 Fatal exception in thread Thread[Streaming to /127.0.0.1:5,5,main]
    [junit] java.lang.RuntimeException: java.io.EOFException
    [junit] 	at org.apache.cassandra.utils.FBUtilities.unchecked(FBUtilities.java:616)
    [junit] 	at org.apache.cassandra.utils.WrappedRunnable.run(WrappedRunnable.java:30)
    [junit] 	at java.util.concurrent.ThreadPoolExecutor$Worker.runTask(ThreadPoolExecutor.java:886)
    [junit] 	at java.util.concurrent.ThreadPoolExecutor$Worker.run(ThreadPoolExecutor.java:908)
    [junit] 	at java.lang.Thread.run(Thread.java:662)
    [junit] Caused by: java.io.EOFException
    [junit] 	at java.io.DataInputStream.readFully(DataInputStream.java:180)
    [junit] 	at java.io.DataInputStream.readUTF(DataInputStream.java:592)
    [junit] 	at java.io.DataInputStream.readUTF(DataInputStream.java:547)
    [junit] 	at org.apache.cassandra.streaming.FileStreamTask.receiveReply(FileStreamTask.java:194)
    [junit] 	at org.apache.cassandra.streaming.FileStreamTask.stream(FileStreamTask.java:174)
    [junit] 	at org.apache.cassandra.streaming.FileStreamTask.runMayThrow(FileStreamTask.java:89)
    [junit] 	at org.apache.cassandra.utils.WrappedRunnable.run(WrappedRunnable.java:26)
    [junit] 	... 3 more
    [junit] ERROR 14:56:11,472 Fatal exception in thread Thread[Streaming to /127.0.0.1:6,5,main]
    [junit] java.lang.RuntimeException: java.io.EOFException
    [junit] 	at org.apache.cassandra.utils.FBUtilities.unchecked(FBUtilities.java:616)
    [junit] 	at org.apache.cassandra.utils.WrappedRunnable.run(WrappedRunnable.java:30)
    [junit] 	at java.util.concurrent.ThreadPoolExecutor$Worker.runTask(ThreadPoolExecutor.java:886)
    [junit] 	at java.util.concurrent.ThreadPoolExecutor$Worker.run(ThreadPoolExecutor.java:908)
    [junit] 	at java.lang.Thread.run(Thread.java:662)
    [junit] Caused by: java.io.EOFException
    [junit] 	at java.io.DataInputStream.readFully(DataInputStream.java:180)
    [junit] 	at java.io.DataInputStream.readUTF(DataInputStream.java:592)
    [junit] 	at java.io.DataInputStream.readUTF(DataInputStream.java:547)
    [junit] 	at org.apache.cassandra.streaming.FileStreamTask.receiveReply(FileStreamTask.java:194)
    [junit] 	at org.apache.cassandra.streaming.FileStreamTask.stream(FileStreamTask.java:174)
    [junit] 	at org.apache.cassandra.streaming.FileStreamTask.runMayThrow(FileStreamTask.java:89)
    [junit] 	at org.apache.cassandra.utils.WrappedRunnable.run(WrappedRunnable.java:26)
    [junit] 	... 3 more
    [junit] ------------- ---------------- ---------------
    [junit] Testcase: testTransferTableMultiple(org.apache.cassandra.streaming.StreamingTransferTest):
FAILED
    [junit] expected:<2> but was:<0>
    [junit] junit.framework.AssertionFailedError: expected:<2> but was:<0>
    [junit] 	at org.apache.cassandra.streaming.StreamingTransferTest.testTransferTableMultiple(StreamingTransferTest.java:271)
    [junit] 
    [junit] 
    [junit] Testcase: testTransferOfMultipleColumnFamilies(org.apache.cassandra.streaming.StreamingTransferTest):
FAILED
    [junit] [] expected:<1> but was:<0>
    [junit] junit.framework.AssertionFailedError: [] expected:<1> but was:<0>
    [junit] 	at org.apache.cassandra.streaming.StreamingTransferTest.testTransferOfMultipleColumnFamilies(StreamingTransferTest.java:330)
    [junit] 
    [junit] 
    [junit] Test org.apache.cassandra.streaming.StreamingTransferTest FAILED
    [junit] Testsuite: org.apache.cassandra.thrift.ThriftValidationTest
    [junit] Tests run: 5, Failures: 0, Errors: 0, Time elapsed: 5.614 sec
    [junit] 
    [junit] Testsuite: org.apache.cassandra.tools.SSTableExportTest
    [junit] Tests run: 6, Failures: 0, Errors: 0, Time elapsed: 5.671 sec
    [junit] 
    [junit] ------------- Standard Output ---------------
    [junit] Importing 1 keys...
    [junit] 1 keys imported successfully.
    [junit] ------------- ---------------- ---------------
    [junit] Testsuite: org.apache.cassandra.tools.SSTableImportTest
    [junit] Tests run: 5, Failures: 0, Errors: 0, Time elapsed: 5.643 sec
    [junit] 
    [junit] ------------- Standard Output ---------------
    [junit] Importing 2 keys...
    [junit] 2 keys imported successfully.
    [junit] Importing 2 keys...
    [junit] 2 keys imported successfully.
    [junit] Importing 2 keys...
    [junit] 2 keys imported successfully.
    [junit] Importing 3 keys...
    [junit] Importing 3 keys...
    [junit] 1 keys imported successfully.
    [junit] ------------- ---------------- ---------------
    [junit] ------------- Standard Error -----------------
    [junit] Line 2: Key 303630 is greater than previous, collection is not sorted properly.
Aborting import. You might need to delete SSTables manually.
    [junit] ------------- ---------------- ---------------
    [junit] Testsuite: org.apache.cassandra.utils.BloomFilterTest
    [junit] Tests run: 7, Failures: 0, Errors: 0, Time elapsed: 0.551 sec
    [junit] 
    [junit] Testsuite: org.apache.cassandra.utils.BoundedStatsDequeTest
    [junit] Tests run: 1, Failures: 0, Errors: 0, Time elapsed: 0.061 sec
    [junit] 
    [junit] Testsuite: org.apache.cassandra.utils.ByteBufferUtilTest
    [junit] Tests run: 10, Failures: 0, Errors: 0, Time elapsed: 0.079 sec
    [junit] 
    [junit] Testsuite: org.apache.cassandra.utils.BytesReadTrackerTest
    [junit] Tests run: 4, Failures: 0, Errors: 0, Time elapsed: 0.062 sec
    [junit] 
    [junit] Testsuite: org.apache.cassandra.utils.EncodedStreamsTest
    [junit] Tests run: 4, Failures: 0, Errors: 0, Time elapsed: 5.622 sec
    [junit] 
    [junit] Testsuite: org.apache.cassandra.utils.EstimatedHistogramTest
    [junit] Tests run: 5, Failures: 0, Errors: 0, Time elapsed: 0.064 sec
    [junit] 
    [junit] Testsuite: org.apache.cassandra.utils.FBUtilitiesTest
    [junit] Tests run: 2, Failures: 0, Errors: 0, Time elapsed: 0.064 sec
    [junit] 
    [junit] Testsuite: org.apache.cassandra.utils.HexTest
    [junit] Tests run: 2, Failures: 0, Errors: 0, Time elapsed: 0.066 sec
    [junit] 
    [junit] Testsuite: org.apache.cassandra.utils.IntervalTreeTest
    [junit] Tests run: 3, Failures: 0, Errors: 0, Time elapsed: 0.178 sec
    [junit] 
    [junit] Testsuite: org.apache.cassandra.utils.LegacyBloomFilterTest
    [junit] Tests run: 6, Failures: 0, Errors: 0, Time elapsed: 0.455 sec
    [junit] 
    [junit] Testsuite: org.apache.cassandra.utils.MergeIteratorTest
    [junit] Tests run: 1, Failures: 0, Errors: 0, Time elapsed: 0.078 sec
    [junit] 
    [junit] Testsuite: org.apache.cassandra.utils.MerkleTreeTest
    [junit] Tests run: 12, Failures: 0, Errors: 0, Time elapsed: 0.836 sec
    [junit] 
    [junit] Testsuite: org.apache.cassandra.utils.SemanticVersionTest
    [junit] Tests run: 4, Failures: 0, Errors: 0, Time elapsed: 0.065 sec
    [junit] 
    [junit] Testsuite: org.apache.cassandra.utils.SerializationsTest
    [junit] Tests run: 4, Failures: 0, Errors: 0, Time elapsed: 7.301 sec
    [junit] 
    [junit] Testsuite: org.apache.cassandra.utils.StreamingHistogramTest
    [junit] Tests run: 2, Failures: 0, Errors: 0, Time elapsed: 0.065 sec
    [junit] 

BUILD FAILED
<https://builds.apache.org/job/Cassandra-quick/ws/build.xml>:1087: The following error
occurred while executing this line:
<https://builds.apache.org/job/Cassandra-quick/ws/build.xml>:1049: Some unit test(s)
failed.

Total time: 10 minutes 11 seconds
Build step 'Invoke Ant' marked build as failure
[TASKS] Skipping publisher since build result is FAILURE
Recording test results

Mime
View raw message