incubator-cassandra-dev mailing list archives

Site index · List index
Message view « Date » · « Thread »
Top « Date » · « Thread »
From Apache Jenkins Server <jenk...@builds.apache.org>
Subject Build failed in Jenkins: Cassandra-quick #598
Date Mon, 18 Jun 2012 17:11:39 GMT
See <https://builds.apache.org/job/Cassandra-quick/598/>

------------------------------------------
[...truncated 475 lines...]
    [junit] 
    [junit] Testsuite: org.apache.cassandra.service.LeaveAndBootstrapTest
    [junit] Tests run: 6, Failures: 0, Errors: 0, Time elapsed: 6.081 sec
    [junit] 
    [junit] ------------- Standard Error -----------------
    [junit]  WARN 17:09:55,474 Node /127.0.0.3 'leaving' token mismatch. Long network partition?
    [junit] ------------- ---------------- ---------------
    [junit] Testsuite: org.apache.cassandra.service.MoveTest
    [junit] Tests run: 3, Failures: 0, Errors: 0, Time elapsed: 5.557 sec
    [junit] 
    [junit] Testsuite: org.apache.cassandra.service.RemoveTest
    [junit] Tests run: 3, Failures: 0, Errors: 0, Time elapsed: 8.431 sec
    [junit] 
    [junit] ------------- Standard Error -----------------
    [junit] ERROR 17:10:09,182 Stream failed because /127.0.0.6 died or was restarted/removed
(streams may still be active in background, but further streams won't be started)
    [junit]  WARN 17:10:09,183 Streaming from /127.0.0.6 failed
    [junit] ERROR 17:10:09,183 Stream failed because /127.0.0.6 died or was restarted/removed
(streams may still be active in background, but further streams won't be started)
    [junit]  WARN 17:10:09,183 Streaming from /127.0.0.6 failed
    [junit] ERROR 17:10:09,184 Stream failed because /127.0.0.6 died or was restarted/removed
(streams may still be active in background, but further streams won't be started)
    [junit]  WARN 17:10:09,184 Streaming from /127.0.0.6 failed
    [junit] ERROR 17:10:09,184 Stream failed because /127.0.0.6 died or was restarted/removed
(streams may still be active in background, but further streams won't be started)
    [junit]  WARN 17:10:09,184 Streaming from /127.0.0.6 failed
    [junit] ERROR 17:10:09,184 Stream failed because /127.0.0.6 died or was restarted/removed
(streams may still be active in background, but further streams won't be started)
    [junit]  WARN 17:10:09,184 Streaming from /127.0.0.6 failed
    [junit] ERROR 17:10:09,184 Stream failed because /127.0.0.6 died or was restarted/removed
(streams may still be active in background, but further streams won't be started)
    [junit]  WARN 17:10:09,185 Streaming from /127.0.0.6 failed
    [junit] ------------- ---------------- ---------------
    [junit] Testsuite: org.apache.cassandra.service.RowResolverTest
    [junit] Tests run: 8, Failures: 0, Errors: 0, Time elapsed: 5.248 sec
    [junit] 
    [junit] Testsuite: org.apache.cassandra.service.SerializationsTest
    [junit] Tests run: 2, Failures: 0, Errors: 0, Time elapsed: 4.447 sec
    [junit] 
    [junit] Testsuite: org.apache.cassandra.service.StorageProxyTest
    [junit] Tests run: 4, Failures: 0, Errors: 0, Time elapsed: 5.309 sec
    [junit] 
    [junit] Testsuite: org.apache.cassandra.service.StorageServiceClientTest
    [junit] Tests run: 1, Failures: 0, Errors: 0, Time elapsed: 2.869 sec
    [junit] 
    [junit] Testsuite: org.apache.cassandra.service.StorageServiceServerTest
    [junit] Tests run: 4, Failures: 0, Errors: 0, Time elapsed: 3.167 sec
    [junit] 
    [junit] ------------- Standard Error -----------------
    [junit]  WARN 17:10:35,651 No host ID found, created 54b0d801-f4d3-4147-ac72-798a828246ec
(Note: This should happen exactly once per node).
    [junit]  WARN 17:10:35,960 Generated random token Token(bytes[5703afa5cbd2f42ef68426353d5bb57c]).
Random tokens will result in an unbalanced ring; see http://wiki.apache.org/cassandra/Operations
    [junit] ------------- ---------------- ---------------
    [junit] Testsuite: org.apache.cassandra.streaming.BootstrapTest
    [junit] Tests run: 1, Failures: 0, Errors: 0, Time elapsed: 5.05 sec
    [junit] 
    [junit] Testsuite: org.apache.cassandra.streaming.SerializationsTest
    [junit] Tests run: 4, Failures: 0, Errors: 0, Time elapsed: 5.212 sec
    [junit] 
    [junit] Testsuite: org.apache.cassandra.streaming.StreamingTransferTest
    [junit] Tests run: 5, Failures: 2, Errors: 0, Time elapsed: 5.379 sec
    [junit] 
    [junit] ------------- Standard Error -----------------
    [junit]  WARN 17:10:55,158 No host ID found, created 36c1ccc3-eddf-43a4-8933-5b5f65f7b15d
(Note: This should happen exactly once per node).
    [junit]  WARN 17:10:55,332 Generated random token Token(bytes[fae1db0780850a22fe8c07a1a3fb3337]).
Random tokens will result in an unbalanced ring; see http://wiki.apache.org/cassandra/Operations
    [junit] ERROR 17:10:55,425 Fatal exception in thread Thread[Streaming to /127.0.0.1:1,5,main]
    [junit] java.lang.RuntimeException: java.io.EOFException
    [junit] 	at org.apache.cassandra.utils.FBUtilities.unchecked(FBUtilities.java:616)
    [junit] 	at org.apache.cassandra.utils.WrappedRunnable.run(WrappedRunnable.java:30)
    [junit] 	at java.util.concurrent.ThreadPoolExecutor$Worker.runTask(ThreadPoolExecutor.java:886)
    [junit] 	at java.util.concurrent.ThreadPoolExecutor$Worker.run(ThreadPoolExecutor.java:908)
    [junit] 	at java.lang.Thread.run(Thread.java:662)
    [junit] Caused by: java.io.EOFException
    [junit] 	at java.io.DataInputStream.readFully(DataInputStream.java:180)
    [junit] 	at java.io.DataInputStream.readUTF(DataInputStream.java:592)
    [junit] 	at java.io.DataInputStream.readUTF(DataInputStream.java:547)
    [junit] 	at org.apache.cassandra.streaming.FileStreamTask.receiveReply(FileStreamTask.java:194)
    [junit] 	at org.apache.cassandra.streaming.FileStreamTask.stream(FileStreamTask.java:174)
    [junit] 	at org.apache.cassandra.streaming.FileStreamTask.runMayThrow(FileStreamTask.java:89)
    [junit] 	at org.apache.cassandra.utils.WrappedRunnable.run(WrappedRunnable.java:26)
    [junit] 	... 3 more
    [junit] ERROR 17:10:55,479 Fatal exception in thread Thread[Streaming to /127.0.0.1:2,5,main]
    [junit] java.lang.RuntimeException: java.io.EOFException
    [junit] 	at org.apache.cassandra.utils.FBUtilities.unchecked(FBUtilities.java:616)
    [junit] 	at org.apache.cassandra.utils.WrappedRunnable.run(WrappedRunnable.java:30)
    [junit] 	at java.util.concurrent.ThreadPoolExecutor$Worker.runTask(ThreadPoolExecutor.java:886)
    [junit] 	at java.util.concurrent.ThreadPoolExecutor$Worker.run(ThreadPoolExecutor.java:908)
    [junit] 	at java.lang.Thread.run(Thread.java:662)
    [junit] Caused by: java.io.EOFException
    [junit] 	at java.io.DataInputStream.readFully(DataInputStream.java:180)
    [junit] 	at java.io.DataInputStream.readUTF(DataInputStream.java:592)
    [junit] 	at java.io.DataInputStream.readUTF(DataInputStream.java:547)
    [junit] 	at org.apache.cassandra.streaming.FileStreamTask.receiveReply(FileStreamTask.java:194)
    [junit] 	at org.apache.cassandra.streaming.FileStreamTask.stream(FileStreamTask.java:174)
    [junit] 	at org.apache.cassandra.streaming.FileStreamTask.runMayThrow(FileStreamTask.java:89)
    [junit] 	at org.apache.cassandra.utils.WrappedRunnable.run(WrappedRunnable.java:26)
    [junit] 	... 3 more
    [junit] ERROR 17:10:55,534 Fatal exception in thread Thread[Streaming to /127.0.0.1:3,5,main]
    [junit] java.lang.RuntimeException: java.io.EOFException
    [junit] 	at org.apache.cassandra.utils.FBUtilities.unchecked(FBUtilities.java:616)
    [junit] 	at org.apache.cassandra.utils.WrappedRunnable.run(WrappedRunnable.java:30)
    [junit] 	at java.util.concurrent.ThreadPoolExecutor$Worker.runTask(ThreadPoolExecutor.java:886)
    [junit] 	at java.util.concurrent.ThreadPoolExecutor$Worker.run(ThreadPoolExecutor.java:908)
    [junit] 	at java.lang.Thread.run(Thread.java:662)
    [junit] Caused by: java.io.EOFException
    [junit] 	at java.io.DataInputStream.readFully(DataInputStream.java:180)
    [junit] 	at java.io.DataInputStream.readUTF(DataInputStream.java:592)
    [junit] 	at java.io.DataInputStream.readUTF(DataInputStream.java:547)
    [junit] 	at org.apache.cassandra.streaming.FileStreamTask.receiveReply(FileStreamTask.java:194)
    [junit] 	at org.apache.cassandra.streaming.FileStreamTask.stream(FileStreamTask.java:174)
    [junit] 	at org.apache.cassandra.streaming.FileStreamTask.runMayThrow(FileStreamTask.java:89)
    [junit] 	at org.apache.cassandra.utils.WrappedRunnable.run(WrappedRunnable.java:26)
    [junit] 	... 3 more
    [junit] ERROR 17:10:55,560 Fatal exception in thread Thread[Streaming to /127.0.0.1:4,5,main]
    [junit] java.lang.RuntimeException: java.io.EOFException
    [junit] 	at org.apache.cassandra.utils.FBUtilities.unchecked(FBUtilities.java:616)
    [junit] 	at org.apache.cassandra.utils.WrappedRunnable.run(WrappedRunnable.java:30)
    [junit] 	at java.util.concurrent.ThreadPoolExecutor$Worker.runTask(ThreadPoolExecutor.java:886)
    [junit] 	at java.util.concurrent.ThreadPoolExecutor$Worker.run(ThreadPoolExecutor.java:908)
    [junit] 	at java.lang.Thread.run(Thread.java:662)
    [junit] Caused by: java.io.EOFException
    [junit] 	at java.io.DataInputStream.readFully(DataInputStream.java:180)
    [junit] 	at java.io.DataInputStream.readUTF(DataInputStream.java:592)
    [junit] 	at java.io.DataInputStream.readUTF(DataInputStream.java:547)
    [junit] 	at org.apache.cassandra.streaming.FileStreamTask.receiveReply(FileStreamTask.java:194)
    [junit] 	at org.apache.cassandra.streaming.FileStreamTask.stream(FileStreamTask.java:174)
    [junit] 	at org.apache.cassandra.streaming.FileStreamTask.runMayThrow(FileStreamTask.java:89)
    [junit] 	at org.apache.cassandra.utils.WrappedRunnable.run(WrappedRunnable.java:26)
    [junit] 	... 3 more
    [junit] ERROR 17:10:55,589 Fatal exception in thread Thread[Streaming to /127.0.0.1:5,5,main]
    [junit] java.lang.RuntimeException: java.io.EOFException
    [junit] 	at org.apache.cassandra.utils.FBUtilities.unchecked(FBUtilities.java:616)
    [junit] 	at org.apache.cassandra.utils.WrappedRunnable.run(WrappedRunnable.java:30)
    [junit] 	at java.util.concurrent.ThreadPoolExecutor$Worker.runTask(ThreadPoolExecutor.java:886)
    [junit] 	at java.util.concurrent.ThreadPoolExecutor$Worker.run(ThreadPoolExecutor.java:908)
    [junit] 	at java.lang.Thread.run(Thread.java:662)
    [junit] Caused by: java.io.EOFException
    [junit] 	at java.io.DataInputStream.readFully(DataInputStream.java:180)
    [junit] 	at java.io.DataInputStream.readUTF(DataInputStream.java:592)
    [junit] 	at java.io.DataInputStream.readUTF(DataInputStream.java:547)
    [junit] 	at org.apache.cassandra.streaming.FileStreamTask.receiveReply(FileStreamTask.java:194)
    [junit] 	at org.apache.cassandra.streaming.FileStreamTask.stream(FileStreamTask.java:174)
    [junit] 	at org.apache.cassandra.streaming.FileStreamTask.runMayThrow(FileStreamTask.java:89)
    [junit] 	at org.apache.cassandra.utils.WrappedRunnable.run(WrappedRunnable.java:26)
    [junit] 	... 3 more
    [junit] ERROR 17:10:55,624 Fatal exception in thread Thread[Streaming to /127.0.0.1:6,5,main]
    [junit] java.lang.RuntimeException: java.io.EOFException
    [junit] 	at org.apache.cassandra.utils.FBUtilities.unchecked(FBUtilities.java:616)
    [junit] 	at org.apache.cassandra.utils.WrappedRunnable.run(WrappedRunnable.java:30)
    [junit] 	at java.util.concurrent.ThreadPoolExecutor$Worker.runTask(ThreadPoolExecutor.java:886)
    [junit] 	at java.util.concurrent.ThreadPoolExecutor$Worker.run(ThreadPoolExecutor.java:908)
    [junit] 	at java.lang.Thread.run(Thread.java:662)
    [junit] Caused by: java.io.EOFException
    [junit] 	at java.io.DataInputStream.readFully(DataInputStream.java:180)
    [junit] 	at java.io.DataInputStream.readUTF(DataInputStream.java:592)
    [junit] 	at java.io.DataInputStream.readUTF(DataInputStream.java:547)
    [junit] 	at org.apache.cassandra.streaming.FileStreamTask.receiveReply(FileStreamTask.java:194)
    [junit] 	at org.apache.cassandra.streaming.FileStreamTask.stream(FileStreamTask.java:174)
    [junit] 	at org.apache.cassandra.streaming.FileStreamTask.runMayThrow(FileStreamTask.java:89)
    [junit] 	at org.apache.cassandra.utils.WrappedRunnable.run(WrappedRunnable.java:26)
    [junit] 	... 3 more
    [junit] ------------- ---------------- ---------------
    [junit] Testcase: testTransferTableMultiple(org.apache.cassandra.streaming.StreamingTransferTest):
FAILED
    [junit] expected:<2> but was:<0>
    [junit] junit.framework.AssertionFailedError: expected:<2> but was:<0>
    [junit] 	at org.apache.cassandra.streaming.StreamingTransferTest.testTransferTableMultiple(StreamingTransferTest.java:271)
    [junit] 
    [junit] 
    [junit] Testcase: testTransferOfMultipleColumnFamilies(org.apache.cassandra.streaming.StreamingTransferTest):
FAILED
    [junit] [] expected:<1> but was:<0>
    [junit] junit.framework.AssertionFailedError: [] expected:<1> but was:<0>
    [junit] 	at org.apache.cassandra.streaming.StreamingTransferTest.testTransferOfMultipleColumnFamilies(StreamingTransferTest.java:330)
    [junit] 
    [junit] 
    [junit] Test org.apache.cassandra.streaming.StreamingTransferTest FAILED
    [junit] Testsuite: org.apache.cassandra.thrift.ThriftValidationTest
    [junit] Tests run: 5, Failures: 0, Errors: 0, Time elapsed: 5.179 sec
    [junit] 
    [junit] Testsuite: org.apache.cassandra.tools.SSTableExportTest
    [junit] Tests run: 6, Failures: 0, Errors: 0, Time elapsed: 5.26 sec
    [junit] 
    [junit] ------------- Standard Output ---------------
    [junit] Importing 1 keys...
    [junit] 1 keys imported successfully.
    [junit] ------------- ---------------- ---------------
    [junit] Testsuite: org.apache.cassandra.tools.SSTableImportTest
    [junit] Tests run: 5, Failures: 0, Errors: 0, Time elapsed: 5.198 sec
    [junit] 
    [junit] ------------- Standard Output ---------------
    [junit] Importing 2 keys...
    [junit] 2 keys imported successfully.
    [junit] Importing 2 keys...
    [junit] 2 keys imported successfully.
    [junit] Importing 2 keys...
    [junit] 2 keys imported successfully.
    [junit] Importing 3 keys...
    [junit] Importing 3 keys...
    [junit] 1 keys imported successfully.
    [junit] ------------- ---------------- ---------------
    [junit] ------------- Standard Error -----------------
    [junit] Line 2: Key 303630 is greater than previous, collection is not sorted properly.
Aborting import. You might need to delete SSTables manually.
    [junit] ------------- ---------------- ---------------
    [junit] Testsuite: org.apache.cassandra.utils.BloomFilterTest
    [junit] Tests run: 7, Failures: 0, Errors: 0, Time elapsed: 0.429 sec
    [junit] 
    [junit] Testsuite: org.apache.cassandra.utils.BoundedStatsDequeTest
    [junit] Tests run: 1, Failures: 0, Errors: 0, Time elapsed: 0.041 sec
    [junit] 
    [junit] Testsuite: org.apache.cassandra.utils.ByteBufferUtilTest
    [junit] Tests run: 10, Failures: 0, Errors: 0, Time elapsed: 0.056 sec
    [junit] 
    [junit] Testsuite: org.apache.cassandra.utils.BytesReadTrackerTest
    [junit] Tests run: 4, Failures: 0, Errors: 0, Time elapsed: 0.044 sec
    [junit] 
    [junit] Testsuite: org.apache.cassandra.utils.EncodedStreamsTest
    [junit] Tests run: 4, Failures: 0, Errors: 0, Time elapsed: 4.966 sec
    [junit] 
    [junit] Testsuite: org.apache.cassandra.utils.EstimatedHistogramTest
    [junit] Tests run: 5, Failures: 0, Errors: 0, Time elapsed: 0.044 sec
    [junit] 
    [junit] Testsuite: org.apache.cassandra.utils.FBUtilitiesTest
    [junit] Tests run: 2, Failures: 0, Errors: 0, Time elapsed: 0.044 sec
    [junit] 
    [junit] Testsuite: org.apache.cassandra.utils.HexTest
    [junit] Tests run: 2, Failures: 0, Errors: 0, Time elapsed: 0.045 sec
    [junit] 
    [junit] Testsuite: org.apache.cassandra.utils.IntervalTreeTest
    [junit] Tests run: 3, Failures: 0, Errors: 0, Time elapsed: 0.125 sec
    [junit] 
    [junit] Testsuite: org.apache.cassandra.utils.LegacyBloomFilterTest
    [junit] Tests run: 6, Failures: 0, Errors: 0, Time elapsed: 0.376 sec
    [junit] 
    [junit] Testsuite: org.apache.cassandra.utils.MergeIteratorTest
    [junit] Tests run: 1, Failures: 0, Errors: 0, Time elapsed: 0.053 sec
    [junit] 
    [junit] Testsuite: org.apache.cassandra.utils.MerkleTreeTest
    [junit] Tests run: 12, Failures: 0, Errors: 0, Time elapsed: 0.689 sec
    [junit] 
    [junit] Testsuite: org.apache.cassandra.utils.SemanticVersionTest
    [junit] Tests run: 4, Failures: 0, Errors: 0, Time elapsed: 0.043 sec
    [junit] 
    [junit] Testsuite: org.apache.cassandra.utils.SerializationsTest
    [junit] Tests run: 4, Failures: 0, Errors: 0, Time elapsed: 6.197 sec
    [junit] 
    [junit] Testsuite: org.apache.cassandra.utils.StreamingHistogramTest
    [junit] Tests run: 2, Failures: 0, Errors: 0, Time elapsed: 0.044 sec
    [junit] 

BUILD FAILED
/x1/jenkins/jenkins-slave/workspace/Cassandra-quick/build.xml:1094: The following error occurred
while executing this line:
/x1/jenkins/jenkins-slave/workspace/Cassandra-quick/build.xml:1056: Some unit test(s) failed.

Total time: 9 minutes 23 seconds
Build step 'Invoke Ant' marked build as failure
[TASKS] Skipping publisher since build result is FAILURE
Recording test results

Mime
View raw message