incubator-cassandra-dev mailing list archives

Site index · List index
Message view « Date » · « Thread »
Top « Date » · « Thread »
From Apache Jenkins Server <jenk...@builds.apache.org>
Subject Build failed in Jenkins: Cassandra-quick #615
Date Wed, 20 Jun 2012 00:19:26 GMT
See <https://builds.apache.org/job/Cassandra-quick/615/>

------------------------------------------
[...truncated 473 lines...]
    [junit] 
    [junit] Testsuite: org.apache.cassandra.service.LeaveAndBootstrapTest
    [junit] Tests run: 6, Failures: 0, Errors: 0, Time elapsed: 8.281 sec
    [junit] 
    [junit] ------------- Standard Error -----------------
    [junit]  WARN 00:17:23,530 Node /127.0.0.3 'leaving' token mismatch. Long network partition?
    [junit] ------------- ---------------- ---------------
    [junit] Testsuite: org.apache.cassandra.service.MoveTest
    [junit] Tests run: 3, Failures: 0, Errors: 0, Time elapsed: 7.8 sec
    [junit] 
    [junit] Testsuite: org.apache.cassandra.service.RemoveTest
    [junit] Tests run: 3, Failures: 0, Errors: 0, Time elapsed: 9.98 sec
    [junit] 
    [junit] ------------- Standard Error -----------------
    [junit] ERROR 00:17:41,095 Stream failed because /127.0.0.6 died or was restarted/removed
(streams may still be active in background, but further streams won't be started)
    [junit]  WARN 00:17:41,096 Streaming from /127.0.0.6 failed
    [junit] ERROR 00:17:41,096 Stream failed because /127.0.0.6 died or was restarted/removed
(streams may still be active in background, but further streams won't be started)
    [junit]  WARN 00:17:41,097 Streaming from /127.0.0.6 failed
    [junit] ERROR 00:17:41,097 Stream failed because /127.0.0.6 died or was restarted/removed
(streams may still be active in background, but further streams won't be started)
    [junit]  WARN 00:17:41,097 Streaming from /127.0.0.6 failed
    [junit] ERROR 00:17:41,097 Stream failed because /127.0.0.6 died or was restarted/removed
(streams may still be active in background, but further streams won't be started)
    [junit]  WARN 00:17:41,097 Streaming from /127.0.0.6 failed
    [junit] ERROR 00:17:41,097 Stream failed because /127.0.0.6 died or was restarted/removed
(streams may still be active in background, but further streams won't be started)
    [junit]  WARN 00:17:41,097 Streaming from /127.0.0.6 failed
    [junit] ERROR 00:17:41,098 Stream failed because /127.0.0.6 died or was restarted/removed
(streams may still be active in background, but further streams won't be started)
    [junit]  WARN 00:17:41,098 Streaming from /127.0.0.6 failed
    [junit] ------------- ---------------- ---------------
    [junit] Testsuite: org.apache.cassandra.service.RowResolverTest
    [junit] Tests run: 8, Failures: 0, Errors: 0, Time elapsed: 6.05 sec
    [junit] 
    [junit] Testsuite: org.apache.cassandra.service.SerializationsTest
    [junit] Tests run: 2, Failures: 0, Errors: 0, Time elapsed: 5.486 sec
    [junit] 
    [junit] Testsuite: org.apache.cassandra.service.StorageProxyTest
    [junit] Tests run: 4, Failures: 0, Errors: 0, Time elapsed: 6.062 sec
    [junit] 
    [junit] Testsuite: org.apache.cassandra.service.StorageServiceClientTest
    [junit] Tests run: 1, Failures: 0, Errors: 0, Time elapsed: 3.071 sec
    [junit] 
    [junit] Testsuite: org.apache.cassandra.service.StorageServiceServerTest
    [junit] Tests run: 4, Failures: 0, Errors: 0, Time elapsed: 3.409 sec
    [junit] 
    [junit] ------------- Standard Error -----------------
    [junit]  WARN 00:18:10,800 No host ID found, created dd1928e7-1a5d-4007-81b1-6e3baa6f068c
(Note: This should happen exactly once per node).
    [junit]  WARN 00:18:11,093 Generated random token Token(bytes[70a6ebe5123aff658252599a77ee2229]).
Random tokens will result in an unbalanced ring; see http://wiki.apache.org/cassandra/Operations
    [junit] ------------- ---------------- ---------------
    [junit] Testsuite: org.apache.cassandra.streaming.BootstrapTest
    [junit] Tests run: 1, Failures: 0, Errors: 0, Time elapsed: 6.139 sec
    [junit] 
    [junit] Testsuite: org.apache.cassandra.streaming.SerializationsTest
    [junit] Tests run: 4, Failures: 0, Errors: 0, Time elapsed: 6.13 sec
    [junit] 
    [junit] Testsuite: org.apache.cassandra.streaming.StreamingTransferTest
    [junit] Tests run: 5, Failures: 2, Errors: 0, Time elapsed: 6.737 sec
    [junit] 
    [junit] ------------- Standard Error -----------------
    [junit]  WARN 00:18:33,383 No host ID found, created bf5a1dbd-de64-4bd1-82ed-29baae9a19e6
(Note: This should happen exactly once per node).
    [junit]  WARN 00:18:33,554 Generated random token Token(bytes[efeacb3b56c2be6250e7349010d4ce85]).
Random tokens will result in an unbalanced ring; see http://wiki.apache.org/cassandra/Operations
    [junit] ERROR 00:18:33,771 Fatal exception in thread Thread[Streaming to /127.0.0.1:1,5,main]
    [junit] java.lang.RuntimeException: java.io.EOFException
    [junit] 	at org.apache.cassandra.utils.FBUtilities.unchecked(FBUtilities.java:616)
    [junit] 	at org.apache.cassandra.utils.WrappedRunnable.run(WrappedRunnable.java:30)
    [junit] 	at java.util.concurrent.ThreadPoolExecutor$Worker.runTask(ThreadPoolExecutor.java:886)
    [junit] 	at java.util.concurrent.ThreadPoolExecutor$Worker.run(ThreadPoolExecutor.java:908)
    [junit] 	at java.lang.Thread.run(Thread.java:662)
    [junit] Caused by: java.io.EOFException
    [junit] 	at java.io.DataInputStream.readFully(DataInputStream.java:180)
    [junit] 	at java.io.DataInputStream.readUTF(DataInputStream.java:592)
    [junit] 	at java.io.DataInputStream.readUTF(DataInputStream.java:547)
    [junit] 	at org.apache.cassandra.streaming.FileStreamTask.receiveReply(FileStreamTask.java:194)
    [junit] 	at org.apache.cassandra.streaming.FileStreamTask.stream(FileStreamTask.java:174)
    [junit] 	at org.apache.cassandra.streaming.FileStreamTask.runMayThrow(FileStreamTask.java:89)
    [junit] 	at org.apache.cassandra.utils.WrappedRunnable.run(WrappedRunnable.java:26)
    [junit] 	... 3 more
    [junit] ERROR 00:18:33,870 Fatal exception in thread Thread[Streaming to /127.0.0.1:2,5,main]
    [junit] java.lang.RuntimeException: java.io.EOFException
    [junit] 	at org.apache.cassandra.utils.FBUtilities.unchecked(FBUtilities.java:616)
    [junit] 	at org.apache.cassandra.utils.WrappedRunnable.run(WrappedRunnable.java:30)
    [junit] 	at java.util.concurrent.ThreadPoolExecutor$Worker.runTask(ThreadPoolExecutor.java:886)
    [junit] 	at java.util.concurrent.ThreadPoolExecutor$Worker.run(ThreadPoolExecutor.java:908)
    [junit] 	at java.lang.Thread.run(Thread.java:662)
    [junit] Caused by: java.io.EOFException
    [junit] 	at java.io.DataInputStream.readFully(DataInputStream.java:180)
    [junit] 	at java.io.DataInputStream.readUTF(DataInputStream.java:592)
    [junit] 	at java.io.DataInputStream.readUTF(DataInputStream.java:547)
    [junit] 	at org.apache.cassandra.streaming.FileStreamTask.receiveReply(FileStreamTask.java:194)
    [junit] 	at org.apache.cassandra.streaming.FileStreamTask.stream(FileStreamTask.java:174)
    [junit] 	at org.apache.cassandra.streaming.FileStreamTask.runMayThrow(FileStreamTask.java:89)
    [junit] 	at org.apache.cassandra.utils.WrappedRunnable.run(WrappedRunnable.java:26)
    [junit] 	... 3 more
    [junit] ERROR 00:18:34,012 Fatal exception in thread Thread[Streaming to /127.0.0.1:3,5,main]
    [junit] java.lang.RuntimeException: java.io.EOFException
    [junit] 	at org.apache.cassandra.utils.FBUtilities.unchecked(FBUtilities.java:616)
    [junit] 	at org.apache.cassandra.utils.WrappedRunnable.run(WrappedRunnable.java:30)
    [junit] 	at java.util.concurrent.ThreadPoolExecutor$Worker.runTask(ThreadPoolExecutor.java:886)
    [junit] 	at java.util.concurrent.ThreadPoolExecutor$Worker.run(ThreadPoolExecutor.java:908)
    [junit] 	at java.lang.Thread.run(Thread.java:662)
    [junit] Caused by: java.io.EOFException
    [junit] 	at java.io.DataInputStream.readFully(DataInputStream.java:180)
    [junit] 	at java.io.DataInputStream.readUTF(DataInputStream.java:592)
    [junit] 	at java.io.DataInputStream.readUTF(DataInputStream.java:547)
    [junit] 	at org.apache.cassandra.streaming.FileStreamTask.receiveReply(FileStreamTask.java:194)
    [junit] 	at org.apache.cassandra.streaming.FileStreamTask.stream(FileStreamTask.java:174)
    [junit] 	at org.apache.cassandra.streaming.FileStreamTask.runMayThrow(FileStreamTask.java:89)
    [junit] 	at org.apache.cassandra.utils.WrappedRunnable.run(WrappedRunnable.java:26)
    [junit] 	... 3 more
    [junit] ERROR 00:18:34,111 Fatal exception in thread Thread[Streaming to /127.0.0.1:4,5,main]
    [junit] java.lang.RuntimeException: java.io.EOFException
    [junit] 	at org.apache.cassandra.utils.FBUtilities.unchecked(FBUtilities.java:616)
    [junit] 	at org.apache.cassandra.utils.WrappedRunnable.run(WrappedRunnable.java:30)
    [junit] 	at java.util.concurrent.ThreadPoolExecutor$Worker.runTask(ThreadPoolExecutor.java:886)
    [junit] 	at java.util.concurrent.ThreadPoolExecutor$Worker.run(ThreadPoolExecutor.java:908)
    [junit] 	at java.lang.Thread.run(Thread.java:662)
    [junit] Caused by: java.io.EOFException
    [junit] 	at java.io.DataInputStream.readFully(DataInputStream.java:180)
    [junit] 	at java.io.DataInputStream.readUTF(DataInputStream.java:592)
    [junit] 	at java.io.DataInputStream.readUTF(DataInputStream.java:547)
    [junit] 	at org.apache.cassandra.streaming.FileStreamTask.receiveReply(FileStreamTask.java:194)
    [junit] 	at org.apache.cassandra.streaming.FileStreamTask.stream(FileStreamTask.java:174)
    [junit] 	at org.apache.cassandra.streaming.FileStreamTask.runMayThrow(FileStreamTask.java:89)
    [junit] 	at org.apache.cassandra.utils.WrappedRunnable.run(WrappedRunnable.java:26)
    [junit] 	... 3 more
    [junit] ERROR 00:18:34,206 Fatal exception in thread Thread[Streaming to /127.0.0.1:5,5,main]
    [junit] java.lang.RuntimeException: java.io.EOFException
    [junit] 	at org.apache.cassandra.utils.FBUtilities.unchecked(FBUtilities.java:616)
    [junit] 	at org.apache.cassandra.utils.WrappedRunnable.run(WrappedRunnable.java:30)
    [junit] 	at java.util.concurrent.ThreadPoolExecutor$Worker.runTask(ThreadPoolExecutor.java:886)
    [junit] 	at java.util.concurrent.ThreadPoolExecutor$Worker.run(ThreadPoolExecutor.java:908)
    [junit] 	at java.lang.Thread.run(Thread.java:662)
    [junit] Caused by: java.io.EOFException
    [junit] 	at java.io.DataInputStream.readFully(DataInputStream.java:180)
    [junit] 	at java.io.DataInputStream.readUTF(DataInputStream.java:592)
    [junit] 	at java.io.DataInputStream.readUTF(DataInputStream.java:547)
    [junit] 	at org.apache.cassandra.streaming.FileStreamTask.receiveReply(FileStreamTask.java:194)
    [junit] 	at org.apache.cassandra.streaming.FileStreamTask.stream(FileStreamTask.java:174)
    [junit] 	at org.apache.cassandra.streaming.FileStreamTask.runMayThrow(FileStreamTask.java:89)
    [junit] 	at org.apache.cassandra.utils.WrappedRunnable.run(WrappedRunnable.java:26)
    [junit] 	... 3 more
    [junit] ERROR 00:18:34,316 Fatal exception in thread Thread[Streaming to /127.0.0.1:6,5,main]
    [junit] java.lang.RuntimeException: java.io.EOFException
    [junit] 	at org.apache.cassandra.utils.FBUtilities.unchecked(FBUtilities.java:616)
    [junit] 	at org.apache.cassandra.utils.WrappedRunnable.run(WrappedRunnable.java:30)
    [junit] 	at java.util.concurrent.ThreadPoolExecutor$Worker.runTask(ThreadPoolExecutor.java:886)
    [junit] 	at java.util.concurrent.ThreadPoolExecutor$Worker.run(ThreadPoolExecutor.java:908)
    [junit] 	at java.lang.Thread.run(Thread.java:662)
    [junit] Caused by: java.io.EOFException
    [junit] 	at java.io.DataInputStream.readFully(DataInputStream.java:180)
    [junit] 	at java.io.DataInputStream.readUTF(DataInputStream.java:592)
    [junit] 	at java.io.DataInputStream.readUTF(DataInputStream.java:547)
    [junit] 	at org.apache.cassandra.streaming.FileStreamTask.receiveReply(FileStreamTask.java:194)
    [junit] 	at org.apache.cassandra.streaming.FileStreamTask.stream(FileStreamTask.java:174)
    [junit] 	at org.apache.cassandra.streaming.FileStreamTask.runMayThrow(FileStreamTask.java:89)
    [junit] 	at org.apache.cassandra.utils.WrappedRunnable.run(WrappedRunnable.java:26)
    [junit] 	... 3 more
    [junit] ------------- ---------------- ---------------
    [junit] Testcase: testTransferTableMultiple(org.apache.cassandra.streaming.StreamingTransferTest):
FAILED
    [junit] expected:<2> but was:<0>
    [junit] junit.framework.AssertionFailedError: expected:<2> but was:<0>
    [junit] 	at org.apache.cassandra.streaming.StreamingTransferTest.testTransferTableMultiple(StreamingTransferTest.java:271)
    [junit] 
    [junit] 
    [junit] Testcase: testTransferOfMultipleColumnFamilies(org.apache.cassandra.streaming.StreamingTransferTest):
FAILED
    [junit] [] expected:<1> but was:<0>
    [junit] junit.framework.AssertionFailedError: [] expected:<1> but was:<0>
    [junit] 	at org.apache.cassandra.streaming.StreamingTransferTest.testTransferOfMultipleColumnFamilies(StreamingTransferTest.java:330)
    [junit] 
    [junit] 
    [junit] Test org.apache.cassandra.streaming.StreamingTransferTest FAILED
    [junit] Testsuite: org.apache.cassandra.thrift.ThriftValidationTest
    [junit] Tests run: 5, Failures: 0, Errors: 0, Time elapsed: 7.436 sec
    [junit] 
    [junit] Testsuite: org.apache.cassandra.tools.SSTableExportTest
    [junit] Tests run: 6, Failures: 0, Errors: 0, Time elapsed: 6.273 sec
    [junit] 
    [junit] ------------- Standard Output ---------------
    [junit] Importing 1 keys...
    [junit] 1 keys imported successfully.
    [junit] ------------- ---------------- ---------------
    [junit] Testsuite: org.apache.cassandra.tools.SSTableImportTest
    [junit] Tests run: 5, Failures: 0, Errors: 0, Time elapsed: 6.301 sec
    [junit] 
    [junit] ------------- Standard Output ---------------
    [junit] Importing 2 keys...
    [junit] 2 keys imported successfully.
    [junit] Importing 2 keys...
    [junit] 2 keys imported successfully.
    [junit] Importing 2 keys...
    [junit] 2 keys imported successfully.
    [junit] Importing 3 keys...
    [junit] Importing 3 keys...
    [junit] 1 keys imported successfully.
    [junit] ------------- ---------------- ---------------
    [junit] ------------- Standard Error -----------------
    [junit] Line 2: Key 303630 is greater than previous, collection is not sorted properly.
Aborting import. You might need to delete SSTables manually.
    [junit] ------------- ---------------- ---------------
    [junit] Testsuite: org.apache.cassandra.utils.BloomFilterTest
    [junit] Tests run: 7, Failures: 0, Errors: 0, Time elapsed: 0.533 sec
    [junit] 
    [junit] Testsuite: org.apache.cassandra.utils.BoundedStatsDequeTest
    [junit] Tests run: 1, Failures: 0, Errors: 0, Time elapsed: 0.057 sec
    [junit] 
    [junit] Testsuite: org.apache.cassandra.utils.ByteBufferUtilTest
    [junit] Tests run: 10, Failures: 0, Errors: 0, Time elapsed: 0.074 sec
    [junit] 
    [junit] Testsuite: org.apache.cassandra.utils.BytesReadTrackerTest
    [junit] Tests run: 4, Failures: 0, Errors: 0, Time elapsed: 0.058 sec
    [junit] 
    [junit] Testsuite: org.apache.cassandra.utils.EncodedStreamsTest
    [junit] Tests run: 4, Failures: 0, Errors: 0, Time elapsed: 6 sec
    [junit] 
    [junit] Testsuite: org.apache.cassandra.utils.EstimatedHistogramTest
    [junit] Tests run: 5, Failures: 0, Errors: 0, Time elapsed: 0.06 sec
    [junit] 
    [junit] Testsuite: org.apache.cassandra.utils.FBUtilitiesTest
    [junit] Tests run: 2, Failures: 0, Errors: 0, Time elapsed: 0.059 sec
    [junit] 
    [junit] Testsuite: org.apache.cassandra.utils.HexTest
    [junit] Tests run: 2, Failures: 0, Errors: 0, Time elapsed: 0.061 sec
    [junit] 
    [junit] Testsuite: org.apache.cassandra.utils.IntervalTreeTest
    [junit] Tests run: 3, Failures: 0, Errors: 0, Time elapsed: 0.169 sec
    [junit] 
    [junit] Testsuite: org.apache.cassandra.utils.LegacyBloomFilterTest
    [junit] Tests run: 6, Failures: 0, Errors: 0, Time elapsed: 0.449 sec
    [junit] 
    [junit] Testsuite: org.apache.cassandra.utils.MergeIteratorTest
    [junit] Tests run: 1, Failures: 0, Errors: 0, Time elapsed: 0.073 sec
    [junit] 
    [junit] Testsuite: org.apache.cassandra.utils.MerkleTreeTest
    [junit] Tests run: 12, Failures: 0, Errors: 0, Time elapsed: 0.918 sec
    [junit] 
    [junit] Testsuite: org.apache.cassandra.utils.SemanticVersionTest
    [junit] Tests run: 4, Failures: 0, Errors: 0, Time elapsed: 0.06 sec
    [junit] 
    [junit] Testsuite: org.apache.cassandra.utils.SerializationsTest
    [junit] Tests run: 4, Failures: 0, Errors: 0, Time elapsed: 7.784 sec
    [junit] 
    [junit] Testsuite: org.apache.cassandra.utils.StreamingHistogramTest
    [junit] Tests run: 2, Failures: 0, Errors: 0, Time elapsed: 0.062 sec
    [junit] 

BUILD FAILED
<https://builds.apache.org/job/Cassandra-quick/ws/build.xml>:1094: The following error
occurred while executing this line:
<https://builds.apache.org/job/Cassandra-quick/ws/build.xml>:1056: Some unit test(s)
failed.

Total time: 11 minutes 12 seconds
Build step 'Invoke Ant' marked build as failure
[TASKS] Skipping publisher since build result is FAILURE
Recording test results

Mime
View raw message