incubator-cassandra-dev mailing list archives

Site index · List index
Message view « Date » · « Thread »
Top « Date » · « Thread »
From Apache Jenkins Server <jenk...@builds.apache.org>
Subject Build failed in Jenkins: Cassandra-quick #626
Date Wed, 20 Jun 2012 18:25:04 GMT
See <https://builds.apache.org/job/Cassandra-quick/626/>

------------------------------------------
[...truncated 474 lines...]
    [junit] 
    [junit] Testsuite: org.apache.cassandra.service.LeaveAndBootstrapTest
    [junit] Tests run: 6, Failures: 0, Errors: 0, Time elapsed: 24.333 sec
    [junit] 
    [junit] ------------- Standard Error -----------------
    [junit]  WARN 18:21:31,489 Node /127.0.0.3 'leaving' token mismatch. Long network partition?
    [junit] ------------- ---------------- ---------------
    [junit] Testsuite: org.apache.cassandra.service.MoveTest
    [junit] Tests run: 3, Failures: 0, Errors: 0, Time elapsed: 18.643 sec
    [junit] 
    [junit] Testsuite: org.apache.cassandra.service.RemoveTest
    [junit] Tests run: 3, Failures: 0, Errors: 0, Time elapsed: 19.22 sec
    [junit] 
    [junit] ------------- Standard Error -----------------
    [junit] ERROR 18:22:10,958 Stream failed because /127.0.0.6 died or was restarted/removed
(streams may still be active in background, but further streams won't be started)
    [junit]  WARN 18:22:10,959 Streaming from /127.0.0.6 failed
    [junit] ERROR 18:22:10,959 Stream failed because /127.0.0.6 died or was restarted/removed
(streams may still be active in background, but further streams won't be started)
    [junit]  WARN 18:22:10,959 Streaming from /127.0.0.6 failed
    [junit] ERROR 18:22:10,959 Stream failed because /127.0.0.6 died or was restarted/removed
(streams may still be active in background, but further streams won't be started)
    [junit]  WARN 18:22:10,960 Streaming from /127.0.0.6 failed
    [junit] ERROR 18:22:10,960 Stream failed because /127.0.0.6 died or was restarted/removed
(streams may still be active in background, but further streams won't be started)
    [junit]  WARN 18:22:10,960 Streaming from /127.0.0.6 failed
    [junit] ERROR 18:22:10,960 Stream failed because /127.0.0.6 died or was restarted/removed
(streams may still be active in background, but further streams won't be started)
    [junit]  WARN 18:22:10,960 Streaming from /127.0.0.6 failed
    [junit] ERROR 18:22:10,960 Stream failed because /127.0.0.6 died or was restarted/removed
(streams may still be active in background, but further streams won't be started)
    [junit]  WARN 18:22:10,960 Streaming from /127.0.0.6 failed
    [junit] ------------- ---------------- ---------------
    [junit] Testsuite: org.apache.cassandra.service.RowResolverTest
    [junit] Tests run: 8, Failures: 0, Errors: 0, Time elapsed: 11.594 sec
    [junit] 
    [junit] Testsuite: org.apache.cassandra.service.SerializationsTest
    [junit] Tests run: 2, Failures: 0, Errors: 0, Time elapsed: 10.403 sec
    [junit] 
    [junit] Testsuite: org.apache.cassandra.service.StorageProxyTest
    [junit] Tests run: 4, Failures: 0, Errors: 0, Time elapsed: 12.05 sec
    [junit] 
    [junit] Testsuite: org.apache.cassandra.service.StorageServiceClientTest
    [junit] Tests run: 1, Failures: 0, Errors: 0, Time elapsed: 3.082 sec
    [junit] 
    [junit] Testsuite: org.apache.cassandra.service.StorageServiceServerTest
    [junit] Tests run: 4, Failures: 0, Errors: 0, Time elapsed: 3.905 sec
    [junit] 
    [junit] ------------- Standard Error -----------------
    [junit]  WARN 18:22:57,509 No host ID found, created 3f83a1ca-d823-4fc6-be75-473970f1d3d9
(Note: This should happen exactly once per node).
    [junit]  WARN 18:22:58,073 Generated random token Token(bytes[4b3befb2b3a2427b14549e618b59a788]).
Random tokens will result in an unbalanced ring; see http://wiki.apache.org/cassandra/Operations
    [junit] ------------- ---------------- ---------------
    [junit] Testsuite: org.apache.cassandra.streaming.BootstrapTest
    [junit] Tests run: 1, Failures: 0, Errors: 0, Time elapsed: 11.397 sec
    [junit] 
    [junit] Testsuite: org.apache.cassandra.streaming.SerializationsTest
    [junit] Tests run: 4, Failures: 0, Errors: 0, Time elapsed: 11.395 sec
    [junit] 
    [junit] Testsuite: org.apache.cassandra.streaming.StreamingTransferTest
    [junit] Tests run: 5, Failures: 2, Errors: 0, Time elapsed: 15.706 sec
    [junit] 
    [junit] ------------- Standard Error -----------------
    [junit]  WARN 18:23:35,950 No host ID found, created 29add90f-2419-4c9d-9e4d-b666cf9ce52a
(Note: This should happen exactly once per node).
    [junit]  WARN 18:23:36,297 Generated random token Token(bytes[46bbd0f44593234cd40be1a6dd7fe326]).
Random tokens will result in an unbalanced ring; see http://wiki.apache.org/cassandra/Operations
    [junit] ERROR 18:23:37,529 Fatal exception in thread Thread[Streaming to /127.0.0.1:1,5,main]
    [junit] java.lang.RuntimeException: java.io.EOFException
    [junit] 	at org.apache.cassandra.utils.FBUtilities.unchecked(FBUtilities.java:616)
    [junit] 	at org.apache.cassandra.utils.WrappedRunnable.run(WrappedRunnable.java:30)
    [junit] 	at java.util.concurrent.ThreadPoolExecutor$Worker.runTask(ThreadPoolExecutor.java:886)
    [junit] 	at java.util.concurrent.ThreadPoolExecutor$Worker.run(ThreadPoolExecutor.java:908)
    [junit] 	at java.lang.Thread.run(Thread.java:662)
    [junit] Caused by: java.io.EOFException
    [junit] 	at java.io.DataInputStream.readFully(DataInputStream.java:180)
    [junit] 	at java.io.DataInputStream.readUTF(DataInputStream.java:592)
    [junit] 	at java.io.DataInputStream.readUTF(DataInputStream.java:547)
    [junit] 	at org.apache.cassandra.streaming.FileStreamTask.receiveReply(FileStreamTask.java:194)
    [junit] 	at org.apache.cassandra.streaming.FileStreamTask.stream(FileStreamTask.java:174)
    [junit] 	at org.apache.cassandra.streaming.FileStreamTask.runMayThrow(FileStreamTask.java:89)
    [junit] 	at org.apache.cassandra.utils.WrappedRunnable.run(WrappedRunnable.java:26)
    [junit] 	... 3 more
    [junit] ERROR 18:23:38,238 Fatal exception in thread Thread[Streaming to /127.0.0.1:2,5,main]
    [junit] java.lang.RuntimeException: java.io.EOFException
    [junit] 	at org.apache.cassandra.utils.FBUtilities.unchecked(FBUtilities.java:616)
    [junit] 	at org.apache.cassandra.utils.WrappedRunnable.run(WrappedRunnable.java:30)
    [junit] 	at java.util.concurrent.ThreadPoolExecutor$Worker.runTask(ThreadPoolExecutor.java:886)
    [junit] 	at java.util.concurrent.ThreadPoolExecutor$Worker.run(ThreadPoolExecutor.java:908)
    [junit] 	at java.lang.Thread.run(Thread.java:662)
    [junit] Caused by: java.io.EOFException
    [junit] 	at java.io.DataInputStream.readFully(DataInputStream.java:180)
    [junit] 	at java.io.DataInputStream.readUTF(DataInputStream.java:592)
    [junit] 	at java.io.DataInputStream.readUTF(DataInputStream.java:547)
    [junit] 	at org.apache.cassandra.streaming.FileStreamTask.receiveReply(FileStreamTask.java:194)
    [junit] 	at org.apache.cassandra.streaming.FileStreamTask.stream(FileStreamTask.java:174)
    [junit] 	at org.apache.cassandra.streaming.FileStreamTask.runMayThrow(FileStreamTask.java:89)
    [junit] 	at org.apache.cassandra.utils.WrappedRunnable.run(WrappedRunnable.java:26)
    [junit] 	... 3 more
    [junit] ERROR 18:23:39,249 Fatal exception in thread Thread[Streaming to /127.0.0.1:3,5,main]
    [junit] java.lang.RuntimeException: java.io.EOFException
    [junit] 	at org.apache.cassandra.utils.FBUtilities.unchecked(FBUtilities.java:616)
    [junit] 	at org.apache.cassandra.utils.WrappedRunnable.run(WrappedRunnable.java:30)
    [junit] 	at java.util.concurrent.ThreadPoolExecutor$Worker.runTask(ThreadPoolExecutor.java:886)
    [junit] 	at java.util.concurrent.ThreadPoolExecutor$Worker.run(ThreadPoolExecutor.java:908)
    [junit] 	at java.lang.Thread.run(Thread.java:662)
    [junit] Caused by: java.io.EOFException
    [junit] 	at java.io.DataInputStream.readFully(DataInputStream.java:180)
    [junit] 	at java.io.DataInputStream.readUTF(DataInputStream.java:592)
    [junit] 	at java.io.DataInputStream.readUTF(DataInputStream.java:547)
    [junit] 	at org.apache.cassandra.streaming.FileStreamTask.receiveReply(FileStreamTask.java:194)
    [junit] 	at org.apache.cassandra.streaming.FileStreamTask.stream(FileStreamTask.java:174)
    [junit] 	at org.apache.cassandra.streaming.FileStreamTask.runMayThrow(FileStreamTask.java:89)
    [junit] 	at org.apache.cassandra.utils.WrappedRunnable.run(WrappedRunnable.java:26)
    [junit] 	... 3 more
    [junit] ERROR 18:23:39,656 Fatal exception in thread Thread[Streaming to /127.0.0.1:4,5,main]
    [junit] java.lang.RuntimeException: java.io.EOFException
    [junit] 	at org.apache.cassandra.utils.FBUtilities.unchecked(FBUtilities.java:616)
    [junit] 	at org.apache.cassandra.utils.WrappedRunnable.run(WrappedRunnable.java:30)
    [junit] 	at java.util.concurrent.ThreadPoolExecutor$Worker.runTask(ThreadPoolExecutor.java:886)
    [junit] 	at java.util.concurrent.ThreadPoolExecutor$Worker.run(ThreadPoolExecutor.java:908)
    [junit] 	at java.lang.Thread.run(Thread.java:662)
    [junit] Caused by: java.io.EOFException
    [junit] 	at java.io.DataInputStream.readFully(DataInputStream.java:180)
    [junit] 	at java.io.DataInputStream.readUTF(DataInputStream.java:592)
    [junit] 	at java.io.DataInputStream.readUTF(DataInputStream.java:547)
    [junit] 	at org.apache.cassandra.streaming.FileStreamTask.receiveReply(FileStreamTask.java:194)
    [junit] 	at org.apache.cassandra.streaming.FileStreamTask.stream(FileStreamTask.java:174)
    [junit] 	at org.apache.cassandra.streaming.FileStreamTask.runMayThrow(FileStreamTask.java:89)
    [junit] 	at org.apache.cassandra.utils.WrappedRunnable.run(WrappedRunnable.java:26)
    [junit] 	... 3 more
    [junit] ERROR 18:23:40,268 Fatal exception in thread Thread[Streaming to /127.0.0.1:5,5,main]
    [junit] java.lang.RuntimeException: java.io.EOFException
    [junit] 	at org.apache.cassandra.utils.FBUtilities.unchecked(FBUtilities.java:616)
    [junit] 	at org.apache.cassandra.utils.WrappedRunnable.run(WrappedRunnable.java:30)
    [junit] 	at java.util.concurrent.ThreadPoolExecutor$Worker.runTask(ThreadPoolExecutor.java:886)
    [junit] 	at java.util.concurrent.ThreadPoolExecutor$Worker.run(ThreadPoolExecutor.java:908)
    [junit] 	at java.lang.Thread.run(Thread.java:662)
    [junit] Caused by: java.io.EOFException
    [junit] 	at java.io.DataInputStream.readFully(DataInputStream.java:180)
    [junit] 	at java.io.DataInputStream.readUTF(DataInputStream.java:592)
    [junit] 	at java.io.DataInputStream.readUTF(DataInputStream.java:547)
    [junit] 	at org.apache.cassandra.streaming.FileStreamTask.receiveReply(FileStreamTask.java:194)
    [junit] 	at org.apache.cassandra.streaming.FileStreamTask.stream(FileStreamTask.java:174)
    [junit] 	at org.apache.cassandra.streaming.FileStreamTask.runMayThrow(FileStreamTask.java:89)
    [junit] 	at org.apache.cassandra.utils.WrappedRunnable.run(WrappedRunnable.java:26)
    [junit] 	... 3 more
    [junit] ERROR 18:23:40,983 Fatal exception in thread Thread[Streaming to /127.0.0.1:6,5,main]
    [junit] java.lang.RuntimeException: java.io.EOFException
    [junit] 	at org.apache.cassandra.utils.FBUtilities.unchecked(FBUtilities.java:616)
    [junit] 	at org.apache.cassandra.utils.WrappedRunnable.run(WrappedRunnable.java:30)
    [junit] 	at java.util.concurrent.ThreadPoolExecutor$Worker.runTask(ThreadPoolExecutor.java:886)
    [junit] 	at java.util.concurrent.ThreadPoolExecutor$Worker.run(ThreadPoolExecutor.java:908)
    [junit] 	at java.lang.Thread.run(Thread.java:662)
    [junit] Caused by: java.io.EOFException
    [junit] 	at java.io.DataInputStream.readFully(DataInputStream.java:180)
    [junit] 	at java.io.DataInputStream.readUTF(DataInputStream.java:592)
    [junit] 	at java.io.DataInputStream.readUTF(DataInputStream.java:547)
    [junit] 	at org.apache.cassandra.streaming.FileStreamTask.receiveReply(FileStreamTask.java:194)
    [junit] 	at org.apache.cassandra.streaming.FileStreamTask.stream(FileStreamTask.java:174)
    [junit] 	at org.apache.cassandra.streaming.FileStreamTask.runMayThrow(FileStreamTask.java:89)
    [junit] 	at org.apache.cassandra.utils.WrappedRunnable.run(WrappedRunnable.java:26)
    [junit] 	... 3 more
    [junit] ------------- ---------------- ---------------
    [junit] Testcase: testTransferTableMultiple(org.apache.cassandra.streaming.StreamingTransferTest):
FAILED
    [junit] expected:<2> but was:<0>
    [junit] junit.framework.AssertionFailedError: expected:<2> but was:<0>
    [junit] 	at org.apache.cassandra.streaming.StreamingTransferTest.testTransferTableMultiple(StreamingTransferTest.java:271)
    [junit] 
    [junit] 
    [junit] Testcase: testTransferOfMultipleColumnFamilies(org.apache.cassandra.streaming.StreamingTransferTest):
FAILED
    [junit] [] expected:<1> but was:<0>
    [junit] junit.framework.AssertionFailedError: [] expected:<1> but was:<0>
    [junit] 	at org.apache.cassandra.streaming.StreamingTransferTest.testTransferOfMultipleColumnFamilies(StreamingTransferTest.java:330)
    [junit] 
    [junit] 
    [junit] Test org.apache.cassandra.streaming.StreamingTransferTest FAILED
    [junit] Testsuite: org.apache.cassandra.thrift.ThriftValidationTest
    [junit] Tests run: 5, Failures: 0, Errors: 0, Time elapsed: 11.759 sec
    [junit] 
    [junit] Testsuite: org.apache.cassandra.tools.SSTableExportTest
    [junit] Tests run: 6, Failures: 0, Errors: 0, Time elapsed: 13.289 sec
    [junit] 
    [junit] ------------- Standard Output ---------------
    [junit] Importing 1 keys...
    [junit] 1 keys imported successfully.
    [junit] ------------- ---------------- ---------------
    [junit] Testsuite: org.apache.cassandra.tools.SSTableImportTest
    [junit] Tests run: 5, Failures: 0, Errors: 0, Time elapsed: 12.31 sec
    [junit] 
    [junit] ------------- Standard Output ---------------
    [junit] Importing 2 keys...
    [junit] 2 keys imported successfully.
    [junit] Importing 2 keys...
    [junit] 2 keys imported successfully.
    [junit] Importing 2 keys...
    [junit] 2 keys imported successfully.
    [junit] Importing 3 keys...
    [junit] Importing 3 keys...
    [junit] 1 keys imported successfully.
    [junit] ------------- ---------------- ---------------
    [junit] ------------- Standard Error -----------------
    [junit] Line 2: Key 303630 is greater than previous, collection is not sorted properly.
Aborting import. You might need to delete SSTables manually.
    [junit] ------------- ---------------- ---------------
    [junit] Testsuite: org.apache.cassandra.utils.BloomFilterTest
    [junit] Tests run: 7, Failures: 0, Errors: 0, Time elapsed: 0.799 sec
    [junit] 
    [junit] Testsuite: org.apache.cassandra.utils.BoundedStatsDequeTest
    [junit] Tests run: 1, Failures: 0, Errors: 0, Time elapsed: 0.057 sec
    [junit] 
    [junit] Testsuite: org.apache.cassandra.utils.ByteBufferUtilTest
    [junit] Tests run: 10, Failures: 0, Errors: 0, Time elapsed: 0.074 sec
    [junit] 
    [junit] Testsuite: org.apache.cassandra.utils.BytesReadTrackerTest
    [junit] Tests run: 4, Failures: 0, Errors: 0, Time elapsed: 0.059 sec
    [junit] 
    [junit] Testsuite: org.apache.cassandra.utils.EncodedStreamsTest
    [junit] Tests run: 4, Failures: 0, Errors: 0, Time elapsed: 12.021 sec
    [junit] 
    [junit] Testsuite: org.apache.cassandra.utils.EstimatedHistogramTest
    [junit] Tests run: 5, Failures: 0, Errors: 0, Time elapsed: 0.061 sec
    [junit] 
    [junit] Testsuite: org.apache.cassandra.utils.FBUtilitiesTest
    [junit] Tests run: 2, Failures: 0, Errors: 0, Time elapsed: 0.06 sec
    [junit] 
    [junit] Testsuite: org.apache.cassandra.utils.HexTest
    [junit] Tests run: 2, Failures: 0, Errors: 0, Time elapsed: 0.062 sec
    [junit] 
    [junit] Testsuite: org.apache.cassandra.utils.IntervalTreeTest
    [junit] Tests run: 3, Failures: 0, Errors: 0, Time elapsed: 0.171 sec
    [junit] 
    [junit] Testsuite: org.apache.cassandra.utils.LegacyBloomFilterTest
    [junit] Tests run: 6, Failures: 0, Errors: 0, Time elapsed: 0.721 sec
    [junit] 
    [junit] Testsuite: org.apache.cassandra.utils.MergeIteratorTest
    [junit] Tests run: 1, Failures: 0, Errors: 0, Time elapsed: 0.073 sec
    [junit] 
    [junit] Testsuite: org.apache.cassandra.utils.MerkleTreeTest
    [junit] Tests run: 12, Failures: 0, Errors: 0, Time elapsed: 0.894 sec
    [junit] 
    [junit] Testsuite: org.apache.cassandra.utils.SemanticVersionTest
    [junit] Tests run: 4, Failures: 0, Errors: 0, Time elapsed: 0.06 sec
    [junit] 
    [junit] Testsuite: org.apache.cassandra.utils.SerializationsTest
    [junit] Tests run: 4, Failures: 0, Errors: 0, Time elapsed: 13.581 sec
    [junit] 
    [junit] Testsuite: org.apache.cassandra.utils.StreamingHistogramTest
    [junit] Tests run: 2, Failures: 0, Errors: 0, Time elapsed: 0.061 sec
    [junit] 

BUILD FAILED
<https://builds.apache.org/job/Cassandra-quick/ws/build.xml>:1094: The following error
occurred while executing this line:
<https://builds.apache.org/job/Cassandra-quick/ws/build.xml>:1056: Some unit test(s)
failed.

Total time: 22 minutes 12 seconds
Build step 'Invoke Ant' marked build as failure
[TASKS] Skipping publisher since build result is FAILURE
Recording test results

Mime
View raw message