incubator-cassandra-dev mailing list archives

Site index · List index
Message view « Date » · « Thread »
Top « Date » · « Thread »
From Jonathan Ellis <jbel...@gmail.com>
Subject Re: Build failed in Jenkins: Cassandra-quick #162
Date Wed, 07 Dec 2011 16:49:14 GMT
Unfortunately Jenkins tries to run all the Cassandra branches at once
and gets port conflicts like this.  Maybe we should restrict Jenkins
to either current-stable or to trunk.

On Wed, Dec 7, 2011 at 10:21 AM, Ted Crossman <tedoc2000@gmail.com> wrote:
> Hi all,
>
> I was just wondering if this mailing list only sees the failures,
>  while successful builds are happening and the list is not being alerted to
> them?
>
> Seems kind of pointless to have the e-mail being sent if no one does
> anything about them :)
>
> Just curious,
>
> tedo
>
> On 12/7/11 7:57 AM, Apache Jenkins Server wrote:
>>
>> See<https://builds.apache.org/job/Cassandra-quick/162/changes>
>>
>> Changes:
>>
>> [jbellis] update CHANGES
>>
>> ------------------------------------------
>> [...truncated 1694 lines...]
>>     [junit] Tests run: 4, Failures: 0, Errors: 0, Time elapsed: 0.833 sec
>>     [junit]
>>     [junit] Testsuite: org.apache.cassandra.locator.TokenMetadataTest
>>     [junit] Tests run: 3, Failures: 0, Errors: 0, Time elapsed: 0.454 sec
>>     [junit]
>>     [junit] Testsuite:
>> org.apache.cassandra.service.AntiEntropyServiceCounterTest
>>     [junit] Tests run: 6, Failures: 0, Errors: 1, Time elapsed: 2.904 sec
>>     [junit]
>>     [junit] Testcase:
>> testValidatorPrepare(org.apache.cassandra.service.AntiEntropyServiceCounterTest):
>>        Caused an ERROR
>>     [junit] /127.0.0.1:7010 is in use by another process.  Change
>> listen_address:storage_port in cassandra.yaml to values that do not conflict
>> with other services
>>     [junit] org.apache.cassandra.config.ConfigurationException:
>> /127.0.0.1:7010 is in use by another process.  Change
>> listen_address:storage_port in cassandra.yaml to values that do not conflict
>> with other services
>>     [junit]    at
>> org.apache.cassandra.net.MessagingService.getServerSocket(MessagingService.java:281)
>>     [junit]    at
>> org.apache.cassandra.net.MessagingService.listen(MessagingService.java:251)
>>     [junit]    at
>> org.apache.cassandra.service.StorageService.joinTokenRing(StorageService.java:484)
>>     [junit]    at
>> org.apache.cassandra.service.StorageService.initServer(StorageService.java:461)
>>     [junit]    at
>> org.apache.cassandra.service.AntiEntropyServiceTestAbstract.prepare(AntiEntropyServiceTestAbstract.java:80)
>>     [junit]
>>     [junit]
>>     [junit] Test
>> org.apache.cassandra.service.AntiEntropyServiceCounterTest FAILED
>>     [junit] Testsuite:
>> org.apache.cassandra.service.AntiEntropyServiceStandardTest
>>     [junit] Tests run: 6, Failures: 0, Errors: 1, Time elapsed: 2.704 sec
>>     [junit]
>>     [junit] Testcase:
>> testValidatorPrepare(org.apache.cassandra.service.AntiEntropyServiceStandardTest):
>>       Caused an ERROR
>>     [junit] /127.0.0.1:7010 is in use by another process.  Change
>> listen_address:storage_port in cassandra.yaml to values that do not conflict
>> with other services
>>     [junit] org.apache.cassandra.config.ConfigurationException:
>> /127.0.0.1:7010 is in use by another process.  Change
>> listen_address:storage_port in cassandra.yaml to values that do not conflict
>> with other services
>>     [junit]    at
>> org.apache.cassandra.net.MessagingService.getServerSocket(MessagingService.java:281)
>>     [junit]    at
>> org.apache.cassandra.net.MessagingService.listen(MessagingService.java:251)
>>     [junit]    at
>> org.apache.cassandra.service.StorageService.joinTokenRing(StorageService.java:484)
>>     [junit]    at
>> org.apache.cassandra.service.StorageService.initServer(StorageService.java:461)
>>     [junit]    at
>> org.apache.cassandra.service.AntiEntropyServiceTestAbstract.prepare(AntiEntropyServiceTestAbstract.java:80)
>>     [junit]
>>     [junit]
>>     [junit] Test
>> org.apache.cassandra.service.AntiEntropyServiceStandardTest FAILED
>>     [junit] Testsuite: org.apache.cassandra.service.CassandraServerTest
>>     [junit] Tests run: 1, Failures: 0, Errors: 0, Time elapsed: 0.57 sec
>>     [junit]
>>     [junit] Testsuite: org.apache.cassandra.service.ConsistencyLevelTest
>>     [junit] Tests run: 1, Failures: 1, Errors: 0, Time elapsed: 1.04 sec
>>     [junit]
>>     [junit] ------------- Standard Error -----------------
>>     [junit] ERROR 15:55:18,376 unknown endpoint /127.0.0.2
>>     [junit] ERROR 15:55:18,382 unknown endpoint /127.0.0.2
>>     [junit] ------------- ---------------- ---------------
>>     [junit] Testcase:
>> testReadWriteConsistencyChecks(org.apache.cassandra.service.ConsistencyLevelTest):
>>       FAILED
>>     [junit]
>>     [junit] junit.framework.AssertionFailedError:
>>     [junit]    at
>> org.apache.cassandra.service.ConsistencyLevelTest.testReadWriteConsistencyChecks(ConsistencyLevelTest.java:165)
>>     [junit]
>>     [junit]
>>     [junit] Test org.apache.cassandra.service.ConsistencyLevelTest FAILED
>>     [junit] Testsuite:
>> org.apache.cassandra.service.EmbeddedCassandraServiceTest
>>     [junit] Testsuite:
>> org.apache.cassandra.service.EmbeddedCassandraServiceTest
>>     [junit] Tests run: 1, Failures: 0, Errors: 1, Time elapsed: 0 sec
>>     [junit]
>>     [junit] Testcase:
>> org.apache.cassandra.service.EmbeddedCassandraServiceTest:BeforeFirstTest:
>>     Caused an ERROR
>>     [junit] Forked Java VM exited abnormally. Please note the time in the
>> report does not reflect the time until the VM exit.
>>     [junit] junit.framework.AssertionFailedError: Forked Java VM exited
>> abnormally. Please note the time in the report does not reflect the time
>> until the VM exit.
>>     [junit]
>>     [junit]
>>     [junit] Test org.apache.cassandra.service.EmbeddedCassandraServiceTest
>> FAILED (crashed)
>>     [junit] Testsuite: org.apache.cassandra.service.InitClientTest
>>     [junit] Tests run: 1, Failures: 0, Errors: 1, Time elapsed: 0.459 sec
>>     [junit]
>>     [junit] Testcase:
>> testInitClientStartup(org.apache.cassandra.service.InitClientTest):
>>  Caused an ERROR
>>     [junit] /127.0.0.1:7010 is in use by another process.  Change
>> listen_address:storage_port in cassandra.yaml to values that do not conflict
>> with other services
>>     [junit] org.apache.cassandra.config.ConfigurationException:
>> /127.0.0.1:7010 is in use by another process.  Change
>> listen_address:storage_port in cassandra.yaml to values that do not conflict
>> with other services
>>     [junit]    at
>> org.apache.cassandra.net.MessagingService.getServerSocket(MessagingService.java:281)
>>     [junit]    at
>> org.apache.cassandra.net.MessagingService.listen(MessagingService.java:251)
>>     [junit]    at
>> org.apache.cassandra.service.StorageService.initClient(StorageService.java:366)
>>     [junit]    at
>> org.apache.cassandra.service.InitClientTest.testInitClientStartup(InitClientTest.java:33)
>>     [junit]
>>     [junit]
>>     [junit] Test org.apache.cassandra.service.InitClientTest FAILED
>>     [junit] Testsuite: org.apache.cassandra.service.LeaveAndBootstrapTest
>>     [junit] Tests run: 6, Failures: 0, Errors: 0, Time elapsed: 2.856 sec
>>     [junit]
>>     [junit] ------------- Standard Error -----------------
>>     [junit]  WARN 15:55:24,645 Node /127.0.0.3 'leaving' token mismatch.
>> Long network partition?
>>     [junit] ------------- ---------------- ---------------
>>     [junit] Testsuite: org.apache.cassandra.service.MoveTest
>>     [junit] Testsuite: org.apache.cassandra.service.MoveTest
>>     [junit] Tests run: 1, Failures: 0, Errors: 1, Time elapsed: 0 sec
>>     [junit]
>>     [junit] Testcase:
>> org.apache.cassandra.service.MoveTest:BeforeFirstTest:   Caused an ERROR
>>     [junit] Timeout occurred. Please note the time in the report does not
>> reflect the time until the timeout.
>>     [junit] junit.framework.AssertionFailedError: Timeout occurred. Please
>> note the time in the report does not reflect the time until the timeout.
>>     [junit]
>>     [junit]
>>     [junit] Test org.apache.cassandra.service.MoveTest FAILED (timeout)
>>     [junit] Testsuite: org.apache.cassandra.service.RemoveTest
>>     [junit] Tests run: 3, Failures: 0, Errors: 3, Time elapsed: 1.516 sec
>>     [junit]
>>     [junit] Testcase:
>> testBadToken(org.apache.cassandra.service.RemoveTest):   Caused an ERROR
>>     [junit] /127.0.0.1:7010 is in use by another process.  Change
>> listen_address:storage_port in cassandra.yaml to values that do not conflict
>> with other services
>>     [junit] org.apache.cassandra.config.ConfigurationException:
>> /127.0.0.1:7010 is in use by another process.  Change
>> listen_address:storage_port in cassandra.yaml to values that do not conflict
>> with other services
>>     [junit]    at
>> org.apache.cassandra.net.MessagingService.getServerSocket(MessagingService.java:281)
>>     [junit]    at
>> org.apache.cassandra.net.MessagingService.listen(MessagingService.java:251)
>>     [junit]    at
>> org.apache.cassandra.service.RemoveTest.setup(RemoveTest.java:74)
>>     [junit]
>>     [junit]
>>     [junit] Testcase:
>> testLocalToken(org.apache.cassandra.service.RemoveTest): Caused an ERROR
>>     [junit] /127.0.0.1:7010 is in use by another process.  Change
>> listen_address:storage_port in cassandra.yaml to values that do not conflict
>> with other services
>>     [junit] org.apache.cassandra.config.ConfigurationException:
>> /127.0.0.1:7010 is in use by another process.  Change
>> listen_address:storage_port in cassandra.yaml to values that do not conflict
>> with other services
>>     [junit]    at
>> org.apache.cassandra.net.MessagingService.getServerSocket(MessagingService.java:281)
>>     [junit]    at
>> org.apache.cassandra.net.MessagingService.listen(MessagingService.java:251)
>>     [junit]    at
>> org.apache.cassandra.service.RemoveTest.setup(RemoveTest.java:74)
>>     [junit]
>>     [junit]
>>     [junit] Testcase:
>> testRemoveToken(org.apache.cassandra.service.RemoveTest):        Caused an
>> ERROR
>>     [junit] /127.0.0.1:7010 is in use by another process.  Change
>> listen_address:storage_port in cassandra.yaml to values that do not conflict
>> with other services
>>     [junit] org.apache.cassandra.config.ConfigurationException:
>> /127.0.0.1:7010 is in use by another process.  Change
>> listen_address:storage_port in cassandra.yaml to values that do not conflict
>> with other services
>>     [junit]    at
>> org.apache.cassandra.net.MessagingService.getServerSocket(MessagingService.java:281)
>>     [junit]    at
>> org.apache.cassandra.net.MessagingService.listen(MessagingService.java:251)
>>     [junit]    at
>> org.apache.cassandra.service.RemoveTest.setup(RemoveTest.java:74)
>>     [junit]
>>     [junit]
>>     [junit] Test org.apache.cassandra.service.RemoveTest FAILED
>>     [junit] Testsuite: org.apache.cassandra.service.RowResolverTest
>>     [junit] Tests run: 8, Failures: 0, Errors: 0, Time elapsed: 0.56 sec
>>     [junit]
>>     [junit] Testsuite: org.apache.cassandra.service.SerializationsTest
>>     [junit] Tests run: 2, Failures: 0, Errors: 0, Time elapsed: 0.283 sec
>>     [junit]
>>     [junit] Testsuite: org.apache.cassandra.service.StorageProxyTest
>>     [junit] Tests run: 4, Failures: 0, Errors: 0, Time elapsed: 0.639 sec
>>     [junit]
>>     [junit] Testsuite:
>> org.apache.cassandra.service.StorageServiceClientTest
>>     [junit] Tests run: 1, Failures: 0, Errors: 1, Time elapsed: 0.485 sec
>>     [junit]
>>     [junit] Testcase:
>> testClientOnlyMode(org.apache.cassandra.service.StorageServiceClientTest):
>>     Caused an ERROR
>>     [junit] /127.0.0.1:7010 is in use by another process.  Change
>> listen_address:storage_port in cassandra.yaml to values that do not conflict
>> with other services
>>     [junit] org.apache.cassandra.config.ConfigurationException:
>> /127.0.0.1:7010 is in use by another process.  Change
>> listen_address:storage_port in cassandra.yaml to values that do not conflict
>> with other services
>>     [junit]    at
>> org.apache.cassandra.net.MessagingService.getServerSocket(MessagingService.java:281)
>>     [junit]    at
>> org.apache.cassandra.net.MessagingService.listen(MessagingService.java:251)
>>     [junit]    at
>> org.apache.cassandra.service.StorageService.initClient(StorageService.java:366)
>>     [junit]    at
>> org.apache.cassandra.service.StorageServiceClientTest.testClientOnlyMode(StorageServiceClientTest.java:39)
>>     [junit]
>>     [junit]
>>     [junit] Test org.apache.cassandra.service.StorageServiceClientTest
>> FAILED
>>     [junit] Testsuite:
>> org.apache.cassandra.service.StorageServiceServerTest
>>     [junit] Tests run: 3, Failures: 0, Errors: 1, Time elapsed: 0.803 sec
>>     [junit]
>>     [junit] Testcase:
>> testRegularMode(org.apache.cassandra.service.StorageServiceServerTest):
>>  Caused an ERROR
>>     [junit] /127.0.0.1:7010 is in use by another process.  Change
>> listen_address:storage_port in cassandra.yaml to values that do not conflict
>> with other services
>>     [junit] org.apache.cassandra.config.ConfigurationException:
>> /127.0.0.1:7010 is in use by another process.  Change
>> listen_address:storage_port in cassandra.yaml to values that do not conflict
>> with other services
>>     [junit]    at
>> org.apache.cassandra.net.MessagingService.getServerSocket(MessagingService.java:281)
>>     [junit]    at
>> org.apache.cassandra.net.MessagingService.listen(MessagingService.java:251)
>>     [junit]    at
>> org.apache.cassandra.service.StorageService.joinTokenRing(StorageService.java:484)
>>     [junit]    at
>> org.apache.cassandra.service.StorageService.initServer(StorageService.java:461)
>>     [junit]    at
>> org.apache.cassandra.service.StorageServiceServerTest.testRegularMode(StorageServiceServerTest.java:45)
>>     [junit]
>>     [junit]
>>     [junit] Test org.apache.cassandra.service.StorageServiceServerTest
>> FAILED
>>     [junit] Testsuite: org.apache.cassandra.streaming.BootstrapTest
>>     [junit] Tests run: 1, Failures: 0, Errors: 0, Time elapsed: 0.717 sec
>>     [junit]
>>     [junit] Testsuite: org.apache.cassandra.streaming.SerializationsTest
>>     [junit] Tests run: 4, Failures: 0, Errors: 0, Time elapsed: 0.617 sec
>>     [junit]
>>     [junit] Testsuite:
>> org.apache.cassandra.streaming.StreamingTransferTest
>>     [junit] Tests run: 0, Failures: 0, Errors: 1, Time elapsed: 0.477 sec
>>     [junit]
>>     [junit] Testcase:
>> org.apache.cassandra.streaming.StreamingTransferTest:    Caused an ERROR
>>     [junit] /127.0.0.1:7010 is in use by another process.  Change
>> listen_address:storage_port in cassandra.yaml to values that do not conflict
>> with other services
>>     [junit] org.apache.cassandra.config.ConfigurationException:
>> /127.0.0.1:7010 is in use by another process.  Change
>> listen_address:storage_port in cassandra.yaml to values that do not conflict
>> with other services
>>     [junit]    at
>> org.apache.cassandra.net.MessagingService.getServerSocket(MessagingService.java:281)
>>     [junit]    at
>> org.apache.cassandra.net.MessagingService.listen(MessagingService.java:251)
>>     [junit]    at
>> org.apache.cassandra.service.StorageService.joinTokenRing(StorageService.java:484)
>>     [junit]    at
>> org.apache.cassandra.service.StorageService.initServer(StorageService.java:461)
>>     [junit]    at
>> org.apache.cassandra.service.StorageService.initServer(StorageService.java:382)
>>     [junit]    at
>> org.apache.cassandra.streaming.StreamingTransferTest.setup(StreamingTransferTest.java:65)
>>     [junit]
>>     [junit]
>>     [junit] Test org.apache.cassandra.streaming.StreamingTransferTest
>> FAILED
>>     [junit] Testsuite: org.apache.cassandra.thrift.ThriftValidationTest
>>     [junit] Tests run: 5, Failures: 0, Errors: 0, Time elapsed: 0.83 sec
>>     [junit]
>>     [junit] Testsuite: org.apache.cassandra.tools.SSTableExportTest
>>     [junit] Tests run: 6, Failures: 0, Errors: 0, Time elapsed: 0.985 sec
>>     [junit]
>>     [junit] ------------- Standard Output ---------------
>>     [junit] Importing 1 keys...
>>     [junit] 1 keys imported successfully.
>>     [junit] ------------- ---------------- ---------------
>>     [junit] Testsuite: org.apache.cassandra.tools.SSTableImportTest
>>     [junit] Tests run: 5, Failures: 0, Errors: 0, Time elapsed: 0.858 sec
>>     [junit]
>>     [junit] ------------- Standard Output ---------------
>>     [junit] Importing 2 keys...
>>     [junit] 2 keys imported successfully.
>>     [junit] Importing 2 keys...
>>     [junit] 2 keys imported successfully.
>>     [junit] Importing 2 keys...
>>     [junit] 2 keys imported successfully.
>>     [junit] Importing 3 keys...
>>     [junit] Importing 3 keys...
>>     [junit] 1 keys imported successfully.
>>     [junit] ------------- ---------------- ---------------
>>     [junit] ------------- Standard Error -----------------
>>     [junit] Line 2: Key 303630 is greater than previous, collection is not
>> sorted properly. Aborting import. You might need to delete SSTables
>> manually.
>>     [junit] ------------- ---------------- ---------------
>>     [junit] Testsuite: org.apache.cassandra.utils.BloomFilterTest
>>     [junit] Tests run: 7, Failures: 0, Errors: 0, Time elapsed: 0.526 sec
>>     [junit]
>>     [junit] Testsuite: org.apache.cassandra.utils.BoundedStatsDequeTest
>>     [junit] Tests run: 1, Failures: 0, Errors: 0, Time elapsed: 0.056 sec
>>     [junit]
>>     [junit] Testsuite: org.apache.cassandra.utils.ByteBufferUtilTest
>>     [junit] Tests run: 10, Failures: 0, Errors: 0, Time elapsed: 0.079 sec
>>     [junit]
>>     [junit] Testsuite: org.apache.cassandra.utils.BytesReadTrackerTest
>>     [junit] Tests run: 4, Failures: 0, Errors: 0, Time elapsed: 0.058 sec
>>     [junit]
>>     [junit] Testsuite: org.apache.cassandra.utils.EstimatedHistogramTest
>>     [junit] Tests run: 4, Failures: 0, Errors: 0, Time elapsed: 0.059 sec
>>     [junit]
>>     [junit] Testsuite: org.apache.cassandra.utils.FBUtilitiesTest
>>     [junit] Tests run: 3, Failures: 0, Errors: 0, Time elapsed: 0.139 sec
>>     [junit]
>>     [junit] Testsuite: org.apache.cassandra.utils.HexTest
>>     [junit] Tests run: 2, Failures: 0, Errors: 0, Time elapsed: 0.062 sec
>>     [junit]
>>     [junit] Testsuite: org.apache.cassandra.utils.IntervalTest
>>     [junit] Tests run: 3, Failures: 0, Errors: 0, Time elapsed: 0.052 sec
>>     [junit]
>>     [junit] Testsuite: org.apache.cassandra.utils.IntervalTreeTest
>>     [junit] Tests run: 1, Failures: 0, Errors: 0, Time elapsed: 0.147 sec
>>     [junit]
>>     [junit] Testsuite: org.apache.cassandra.utils.LegacyBloomFilterTest
>>     [junit] Tests run: 6, Failures: 0, Errors: 0, Time elapsed: 0.448 sec
>>     [junit]
>>     [junit] Testsuite: org.apache.cassandra.utils.MergeIteratorTest
>>     [junit] Tests run: 1, Failures: 0, Errors: 0, Time elapsed: 0.073 sec
>>     [junit]
>>     [junit] Testsuite: org.apache.cassandra.utils.MerkleTreeTest
>>     [junit] Tests run: 12, Failures: 0, Errors: 0, Time elapsed: 0.451 sec
>>     [junit]
>>     [junit] Testsuite: org.apache.cassandra.utils.SerializationsTest
>>     [junit] Tests run: 3, Failures: 0, Errors: 0, Time elapsed: 0.814 sec
>>     [junit]
>>
>> BUILD FAILED
>>
>> <https://builds.apache.org/job/Cassandra-quick/ws/cassandra/build.xml>:1036:
>> The following error occurred while executing this line:
>>
>> <https://builds.apache.org/job/Cassandra-quick/ws/cassandra/build.xml>:1022:
>> Some unit test(s) failed.
>>
>> Total time: 7 minutes 50 seconds
>> Build step 'Invoke Ant' marked build as failure
>> [TASKS] Skipping publisher since build result is FAILURE
>> Recording test results
>>
>



-- 
Jonathan Ellis
Project Chair, Apache Cassandra
co-founder of DataStax, the source for professional Cassandra support
http://www.datastax.com

Mime
View raw message