incubator-cassandra-dev mailing list archives

Site index · List index
Message view « Date » · « Thread »
Top « Date » · « Thread »
From Apache Jenkins Server <jenk...@builds.apache.org>
Subject Build failed in Jenkins: Cassandra-quick #180
Date Thu, 15 Dec 2011 22:18:21 GMT
See <https://builds.apache.org/job/Cassandra-quick/180/changes>

Changes:

[jbellis] merge from 1.0

------------------------------------------
[...truncated 2057 lines...]
    [junit] ------------- ---------------- ---------------
    [junit] Testcase: testInitClientStartup(org.apache.cassandra.service.InitClientTest):
Caused an ERROR
    [junit] /127.0.0.1:7010 is in use by another process.  Change listen_address:storage_port
in cassandra.yaml to values that do not conflict with other services
    [junit] org.apache.cassandra.config.ConfigurationException: /127.0.0.1:7010 is in use
by another process.  Change listen_address:storage_port in cassandra.yaml to values that do
not conflict with other services
    [junit] 	at org.apache.cassandra.net.MessagingService.getServerSocket(MessagingService.java:281)
    [junit] 	at org.apache.cassandra.net.MessagingService.listen(MessagingService.java:251)
    [junit] 	at org.apache.cassandra.service.StorageService.initClient(StorageService.java:380)
    [junit] 	at org.apache.cassandra.service.InitClientTest.testInitClientStartup(InitClientTest.java:33)
    [junit] 
    [junit] 
    [junit] Test org.apache.cassandra.service.InitClientTest FAILED
    [junit] Testsuite: org.apache.cassandra.service.LeaveAndBootstrapTest
    [junit] Tests run: 6, Failures: 0, Errors: 0, Time elapsed: 3.01 sec
    [junit] 
    [junit] ------------- Standard Error -----------------
    [junit]  WARN 22:16:28,186 Overriding RING_DELAY to 1000ms
    [junit]  WARN 22:16:30,616 Node /127.0.0.3 'leaving' token mismatch. Long network partition?
    [junit] ------------- ---------------- ---------------
    [junit] Testsuite: org.apache.cassandra.service.MoveTest
    [junit] Testsuite: org.apache.cassandra.service.MoveTest
    [junit] Tests run: 1, Failures: 0, Errors: 1, Time elapsed: 0 sec
    [junit] 
    [junit] Testcase: org.apache.cassandra.service.MoveTest:BeforeFirstTest:	Caused an ERROR
    [junit] Timeout occurred. Please note the time in the report does not reflect the time
until the timeout.
    [junit] junit.framework.AssertionFailedError: Timeout occurred. Please note the time in
the report does not reflect the time until the timeout.
    [junit] 
    [junit] 
    [junit] Test org.apache.cassandra.service.MoveTest FAILED (timeout)
    [junit] Testsuite: org.apache.cassandra.service.RemoveTest
    [junit] Tests run: 3, Failures: 0, Errors: 3, Time elapsed: 1.717 sec
    [junit] 
    [junit] ------------- Standard Error -----------------
    [junit]  WARN 22:17:32,124 Overriding RING_DELAY to 1000ms
    [junit] ------------- ---------------- ---------------
    [junit] Testcase: testBadToken(org.apache.cassandra.service.RemoveTest):	Caused an ERROR
    [junit] /127.0.0.1:7010 is in use by another process.  Change listen_address:storage_port
in cassandra.yaml to values that do not conflict with other services
    [junit] org.apache.cassandra.config.ConfigurationException: /127.0.0.1:7010 is in use
by another process.  Change listen_address:storage_port in cassandra.yaml to values that do
not conflict with other services
    [junit] 	at org.apache.cassandra.net.MessagingService.getServerSocket(MessagingService.java:281)
    [junit] 	at org.apache.cassandra.net.MessagingService.listen(MessagingService.java:251)
    [junit] 	at org.apache.cassandra.service.RemoveTest.setup(RemoveTest.java:74)
    [junit] 
    [junit] 
    [junit] Testcase: testLocalToken(org.apache.cassandra.service.RemoveTest):	Caused an ERROR
    [junit] /127.0.0.1:7010 is in use by another process.  Change listen_address:storage_port
in cassandra.yaml to values that do not conflict with other services
    [junit] org.apache.cassandra.config.ConfigurationException: /127.0.0.1:7010 is in use
by another process.  Change listen_address:storage_port in cassandra.yaml to values that do
not conflict with other services
    [junit] 	at org.apache.cassandra.net.MessagingService.getServerSocket(MessagingService.java:281)
    [junit] 	at org.apache.cassandra.net.MessagingService.listen(MessagingService.java:251)
    [junit] 	at org.apache.cassandra.service.RemoveTest.setup(RemoveTest.java:74)
    [junit] 
    [junit] 
    [junit] Testcase: testRemoveToken(org.apache.cassandra.service.RemoveTest):	Caused an
ERROR
    [junit] /127.0.0.1:7010 is in use by another process.  Change listen_address:storage_port
in cassandra.yaml to values that do not conflict with other services
    [junit] org.apache.cassandra.config.ConfigurationException: /127.0.0.1:7010 is in use
by another process.  Change listen_address:storage_port in cassandra.yaml to values that do
not conflict with other services
    [junit] 	at org.apache.cassandra.net.MessagingService.getServerSocket(MessagingService.java:281)
    [junit] 	at org.apache.cassandra.net.MessagingService.listen(MessagingService.java:251)
    [junit] 	at org.apache.cassandra.service.RemoveTest.setup(RemoveTest.java:74)
    [junit] 
    [junit] 
    [junit] Test org.apache.cassandra.service.RemoveTest FAILED
    [junit] Testsuite: org.apache.cassandra.service.RowResolverTest
    [junit] Tests run: 8, Failures: 0, Errors: 0, Time elapsed: 0.563 sec
    [junit] 
    [junit] ------------- Standard Error -----------------
    [junit]  WARN 22:17:34,618 Overriding RING_DELAY to 1000ms
    [junit] ------------- ---------------- ---------------
    [junit] Testsuite: org.apache.cassandra.service.SerializationsTest
    [junit] Tests run: 2, Failures: 0, Errors: 0, Time elapsed: 0.283 sec
    [junit] 
    [junit] ------------- Standard Error -----------------
    [junit]  WARN 22:17:35,729 Overriding RING_DELAY to 1000ms
    [junit] ------------- ---------------- ---------------
    [junit] Testsuite: org.apache.cassandra.service.StorageProxyTest
    [junit] Tests run: 4, Failures: 0, Errors: 0, Time elapsed: 0.646 sec
    [junit] 
    [junit] ------------- Standard Error -----------------
    [junit]  WARN 22:17:37,365 Overriding RING_DELAY to 1000ms
    [junit] ------------- ---------------- ---------------
    [junit] Testsuite: org.apache.cassandra.service.StorageServiceClientTest
    [junit] Tests run: 1, Failures: 0, Errors: 1, Time elapsed: 0.47 sec
    [junit] 
    [junit] ------------- Standard Error -----------------
    [junit]  WARN 22:17:38,795 Overriding RING_DELAY to 1000ms
    [junit] ------------- ---------------- ---------------
    [junit] Testcase: testClientOnlyMode(org.apache.cassandra.service.StorageServiceClientTest):
Caused an ERROR
    [junit] /127.0.0.1:7010 is in use by another process.  Change listen_address:storage_port
in cassandra.yaml to values that do not conflict with other services
    [junit] org.apache.cassandra.config.ConfigurationException: /127.0.0.1:7010 is in use
by another process.  Change listen_address:storage_port in cassandra.yaml to values that do
not conflict with other services
    [junit] 	at org.apache.cassandra.net.MessagingService.getServerSocket(MessagingService.java:281)
    [junit] 	at org.apache.cassandra.net.MessagingService.listen(MessagingService.java:251)
    [junit] 	at org.apache.cassandra.service.StorageService.initClient(StorageService.java:380)
    [junit] 	at org.apache.cassandra.service.StorageServiceClientTest.testClientOnlyMode(StorageServiceClientTest.java:39)
    [junit] 
    [junit] 
    [junit] Test org.apache.cassandra.service.StorageServiceClientTest FAILED
    [junit] Testsuite: org.apache.cassandra.service.StorageServiceServerTest
    [junit] Tests run: 3, Failures: 0, Errors: 1, Time elapsed: 0.845 sec
    [junit] 
    [junit] ------------- Standard Error -----------------
    [junit]  WARN 22:17:39,965 Overriding RING_DELAY to 1000ms
    [junit] ------------- ---------------- ---------------
    [junit] Testcase: testRegularMode(org.apache.cassandra.service.StorageServiceServerTest):
Caused an ERROR
    [junit] /127.0.0.1:7010 is in use by another process.  Change listen_address:storage_port
in cassandra.yaml to values that do not conflict with other services
    [junit] org.apache.cassandra.config.ConfigurationException: /127.0.0.1:7010 is in use
by another process.  Change listen_address:storage_port in cassandra.yaml to values that do
not conflict with other services
    [junit] 	at org.apache.cassandra.net.MessagingService.getServerSocket(MessagingService.java:281)
    [junit] 	at org.apache.cassandra.net.MessagingService.listen(MessagingService.java:251)
    [junit] 	at org.apache.cassandra.service.StorageService.joinTokenRing(StorageService.java:506)
    [junit] 	at org.apache.cassandra.service.StorageService.initServer(StorageService.java:483)
    [junit] 	at org.apache.cassandra.service.StorageServiceServerTest.testRegularMode(StorageServiceServerTest.java:45)
    [junit] 
    [junit] 
    [junit] Test org.apache.cassandra.service.StorageServiceServerTest FAILED
    [junit] Testsuite: org.apache.cassandra.streaming.BootstrapTest
    [junit] Tests run: 1, Failures: 0, Errors: 0, Time elapsed: 0.717 sec
    [junit] 
    [junit] ------------- Standard Error -----------------
    [junit]  WARN 22:17:41,590 Overriding RING_DELAY to 1000ms
    [junit] ------------- ---------------- ---------------
    [junit] Testsuite: org.apache.cassandra.streaming.SerializationsTest
    [junit] Tests run: 4, Failures: 0, Errors: 0, Time elapsed: 0.627 sec
    [junit] 
    [junit] ------------- Standard Error -----------------
    [junit]  WARN 22:17:43,137 Overriding RING_DELAY to 1000ms
    [junit] ------------- ---------------- ---------------
    [junit] Testsuite: org.apache.cassandra.streaming.StreamingTransferTest
    [junit] Tests run: 0, Failures: 0, Errors: 1, Time elapsed: 0.493 sec
    [junit] 
    [junit] ------------- Standard Error -----------------
    [junit]  WARN 22:17:44,462 Overriding RING_DELAY to 1000ms
    [junit] ------------- ---------------- ---------------
    [junit] Testcase: org.apache.cassandra.streaming.StreamingTransferTest:	Caused an ERROR
    [junit] /127.0.0.1:7010 is in use by another process.  Change listen_address:storage_port
in cassandra.yaml to values that do not conflict with other services
    [junit] org.apache.cassandra.config.ConfigurationException: /127.0.0.1:7010 is in use
by another process.  Change listen_address:storage_port in cassandra.yaml to values that do
not conflict with other services
    [junit] 	at org.apache.cassandra.net.MessagingService.getServerSocket(MessagingService.java:281)
    [junit] 	at org.apache.cassandra.net.MessagingService.listen(MessagingService.java:251)
    [junit] 	at org.apache.cassandra.service.StorageService.joinTokenRing(StorageService.java:506)
    [junit] 	at org.apache.cassandra.service.StorageService.initServer(StorageService.java:483)
    [junit] 	at org.apache.cassandra.service.StorageService.initServer(StorageService.java:396)
    [junit] 	at org.apache.cassandra.streaming.StreamingTransferTest.setup(StreamingTransferTest.java:65)
    [junit] 
    [junit] 
    [junit] Test org.apache.cassandra.streaming.StreamingTransferTest FAILED
    [junit] Testsuite: org.apache.cassandra.thrift.ThriftValidationTest
    [junit] Tests run: 5, Failures: 0, Errors: 0, Time elapsed: 0.846 sec
    [junit] 
    [junit] ------------- Standard Error -----------------
    [junit]  WARN 22:17:46,208 Overriding RING_DELAY to 1000ms
    [junit] ------------- ---------------- ---------------
    [junit] Testsuite: org.apache.cassandra.tools.SSTableExportTest
    [junit] Tests run: 6, Failures: 0, Errors: 0, Time elapsed: 1.114 sec
    [junit] 
    [junit] ------------- Standard Output ---------------
    [junit] Importing 1 keys...
    [junit] 1 keys imported successfully.
    [junit] ------------- ---------------- ---------------
    [junit] ------------- Standard Error -----------------
    [junit]  WARN 22:17:47,850 Overriding RING_DELAY to 1000ms
    [junit] ------------- ---------------- ---------------
    [junit] Testsuite: org.apache.cassandra.tools.SSTableImportTest
    [junit] Tests run: 5, Failures: 0, Errors: 2, Time elapsed: 1.058 sec
    [junit] 
    [junit] ------------- Standard Output ---------------
    [junit] Importing 2 keys...
    [junit] Importing 2 keys...
    [junit] Importing 2 keys...
    [junit] 2 keys imported successfully.
    [junit] Importing 3 keys...
    [junit] Importing 3 keys...
    [junit] 1 keys imported successfully.
    [junit] ------------- ---------------- ---------------
    [junit] ------------- Standard Error -----------------
    [junit]  WARN 22:17:49,764 Overriding RING_DELAY to 1000ms
    [junit] Line 2: Key 303630 is greater than previous, collection is not sorted properly.
Aborting import. You might need to delete SSTables manually.
    [junit] ------------- ---------------- ---------------
    [junit] Testcase: testImportSimpleCf(org.apache.cassandra.tools.SSTableImportTest):	Caused
an ERROR
    [junit] java.lang.Integer cannot be cast to java.lang.Long
    [junit] java.lang.ClassCastException: java.lang.Integer cannot be cast to java.lang.Long
    [junit] 	at org.apache.cassandra.tools.SSTableImport$JsonColumn.<init>(SSTableImport.java:132)
    [junit] 	at org.apache.cassandra.tools.SSTableImport.addColumnsToCF(SSTableImport.java:191)
    [junit] 	at org.apache.cassandra.tools.SSTableImport.addToStandardCF(SSTableImport.java:174)
    [junit] 	at org.apache.cassandra.tools.SSTableImport.importUnsorted(SSTableImport.java:290)
    [junit] 	at org.apache.cassandra.tools.SSTableImport.importJson(SSTableImport.java:255)
    [junit] 	at org.apache.cassandra.tools.SSTableImportTest.testImportSimpleCf(SSTableImportTest.java:60)
    [junit] 
    [junit] 
    [junit] Testcase: testImportSimpleCfOldFormat(org.apache.cassandra.tools.SSTableImportTest):
Caused an ERROR
    [junit] java.lang.Integer cannot be cast to java.lang.Long
    [junit] java.lang.ClassCastException: java.lang.Integer cannot be cast to java.lang.Long
    [junit] 	at org.apache.cassandra.tools.SSTableImport$JsonColumn.<init>(SSTableImport.java:119)
    [junit] 	at org.apache.cassandra.tools.SSTableImport.addColumnsToCF(SSTableImport.java:191)
    [junit] 	at org.apache.cassandra.tools.SSTableImport.addToStandardCF(SSTableImport.java:174)
    [junit] 	at org.apache.cassandra.tools.SSTableImport.importUnsorted(SSTableImport.java:290)
    [junit] 	at org.apache.cassandra.tools.SSTableImport.importJson(SSTableImport.java:255)
    [junit] 	at org.apache.cassandra.tools.SSTableImportTest.testImportSimpleCfOldFormat(SSTableImportTest.java:89)
    [junit] 
    [junit] 
    [junit] Test org.apache.cassandra.tools.SSTableImportTest FAILED
    [junit] Testsuite: org.apache.cassandra.utils.BloomFilterTest
    [junit] Tests run: 7, Failures: 0, Errors: 0, Time elapsed: 0.553 sec
    [junit] 
    [junit] Testsuite: org.apache.cassandra.utils.BoundedStatsDequeTest
    [junit] Tests run: 1, Failures: 0, Errors: 0, Time elapsed: 0.056 sec
    [junit] 
    [junit] Testsuite: org.apache.cassandra.utils.ByteBufferUtilTest
    [junit] Tests run: 10, Failures: 0, Errors: 0, Time elapsed: 0.08 sec
    [junit] 
    [junit] Testsuite: org.apache.cassandra.utils.BytesReadTrackerTest
    [junit] Tests run: 4, Failures: 0, Errors: 0, Time elapsed: 0.06 sec
    [junit] 
    [junit] Testsuite: org.apache.cassandra.utils.EstimatedHistogramTest
    [junit] Tests run: 4, Failures: 0, Errors: 0, Time elapsed: 0.064 sec
    [junit] 
    [junit] Testsuite: org.apache.cassandra.utils.FBUtilitiesTest
    [junit] Tests run: 3, Failures: 0, Errors: 0, Time elapsed: 0.141 sec
    [junit] 
    [junit] Testsuite: org.apache.cassandra.utils.HexTest
    [junit] Tests run: 2, Failures: 0, Errors: 0, Time elapsed: 0.061 sec
    [junit] 
    [junit] Testsuite: org.apache.cassandra.utils.IntervalTest
    [junit] Tests run: 3, Failures: 0, Errors: 0, Time elapsed: 0.053 sec
    [junit] 
    [junit] Testsuite: org.apache.cassandra.utils.IntervalTreeTest
    [junit] Tests run: 1, Failures: 0, Errors: 0, Time elapsed: 0.15 sec
    [junit] 
    [junit] Testsuite: org.apache.cassandra.utils.LegacyBloomFilterTest
    [junit] Tests run: 6, Failures: 0, Errors: 0, Time elapsed: 0.453 sec
    [junit] 
    [junit] Testsuite: org.apache.cassandra.utils.MergeIteratorTest
    [junit] Tests run: 1, Failures: 0, Errors: 0, Time elapsed: 0.079 sec
    [junit] 
    [junit] Testsuite: org.apache.cassandra.utils.MerkleTreeTest
    [junit] Tests run: 12, Failures: 0, Errors: 0, Time elapsed: 0.463 sec
    [junit] 
    [junit] ------------- Standard Error -----------------
    [junit]  WARN 22:18:00,849 Overriding RING_DELAY to 1000ms
    [junit] ------------- ---------------- ---------------
    [junit] Testsuite: org.apache.cassandra.utils.SerializationsTest
    [junit] Tests run: 3, Failures: 0, Errors: 0, Time elapsed: 0.819 sec
    [junit] 
    [junit] ------------- Standard Error -----------------
    [junit]  WARN 22:18:02,237 Overriding RING_DELAY to 1000ms
    [junit] ------------- ---------------- ---------------

BUILD FAILED
<https://builds.apache.org/job/Cassandra-quick/ws/cassandra/build.xml>:1016: The following
error occurred while executing this line:
<https://builds.apache.org/job/Cassandra-quick/ws/cassandra/build.xml>:1002: Some unit
test(s) failed.

Total time: 7 minutes 56 seconds
Build step 'Invoke Ant' marked build as failure
[TASKS] Skipping publisher since build result is FAILURE
Recording test results


Mime
View raw message