incubator-cassandra-dev mailing list archives

Site index · List index
Message view « Date » · « Thread »
Top « Date » · « Thread »
From Apache Jenkins Server <jenk...@builds.apache.org>
Subject Build failed in Jenkins: Cassandra-quick #197
Date Tue, 27 Dec 2011 20:28:26 GMT
See <https://builds.apache.org/job/Cassandra-quick/197/changes>

Changes:

[jbellis] add row-level isolation via SnapTree
patch by slebresne; reviewed by jbellis for CASSANDRA-2893

[jbellis] merge from 1.0

------------------------------------------
[...truncated 2261 lines...]
    [junit] 	at java.io.ObjectInputStream.readObject0(ObjectInputStream.java:1328)
    [junit] 	at java.io.ObjectInputStream.defaultReadFields(ObjectInputStream.java:1946)
    [junit] 	at java.io.ObjectInputStream.readSerialData(ObjectInputStream.java:1870)
    [junit] 	at java.io.ObjectInputStream.readOrdinaryObject(ObjectInputStream.java:1752)
    [junit] 	at java.io.ObjectInputStream.readObject0(ObjectInputStream.java:1328)
    [junit] 	at java.io.ObjectInputStream.defaultReadFields(ObjectInputStream.java:1946)
    [junit] 	at java.io.ObjectInputStream.readSerialData(ObjectInputStream.java:1870)
    [junit] 	at java.io.ObjectInputStream.readOrdinaryObject(ObjectInputStream.java:1752)
    [junit] 	at java.io.ObjectInputStream.readObject0(ObjectInputStream.java:1328)
    [junit] 	at java.io.ObjectInputStream.readObject(ObjectInputStream.java:350)
    [junit] 	at org.apache.cassandra.utils.MerkleTree$MerkleTreeSerializer.deserialize(MerkleTree.java:107)
    [junit] 	at org.apache.cassandra.service.AntiEntropyService$TreeResponseVerbHandler.deserialize(AntiEntropyService.java:514)
    [junit] Caused by: java.io.InvalidClassException: org.apache.cassandra.dht.BigIntegerToken;
class invalid for deserialization
    [junit] 	at java.io.ObjectStreamClass.initNonProxy(ObjectStreamClass.java:587)
    [junit] 	at java.io.ObjectInputStream.readNonProxyDesc(ObjectInputStream.java:1582)
    [junit] 	at java.io.ObjectInputStream.readClassDesc(ObjectInputStream.java:1495)
    [junit] 	at java.io.ObjectInputStream.readOrdinaryObject(ObjectInputStream.java:1731)
    [junit] 
    [junit] 
    [junit] Test org.apache.cassandra.service.SerializationsTest FAILED
    [junit] Testsuite: org.apache.cassandra.service.StorageProxyTest
    [junit] Tests run: 4, Failures: 0, Errors: 0, Time elapsed: 0.643 sec
    [junit] 
    [junit] ------------- Standard Error -----------------
    [junit]  WARN 20:27:37,328 Overriding RING_DELAY to 1000ms
    [junit] ------------- ---------------- ---------------
    [junit] Testsuite: org.apache.cassandra.service.StorageServiceClientTest
    [junit] Tests run: 1, Failures: 0, Errors: 1, Time elapsed: 0.47 sec
    [junit] 
    [junit] ------------- Standard Error -----------------
    [junit]  WARN 20:27:38,752 Overriding RING_DELAY to 1000ms
    [junit] ------------- ---------------- ---------------
    [junit] Testcase: testClientOnlyMode(org.apache.cassandra.service.StorageServiceClientTest):
Caused an ERROR
    [junit] /127.0.0.1:7010 is in use by another process.  Change listen_address:storage_port
in cassandra.yaml to values that do not conflict with other services
    [junit] org.apache.cassandra.config.ConfigurationException: /127.0.0.1:7010 is in use
by another process.  Change listen_address:storage_port in cassandra.yaml to values that do
not conflict with other services
    [junit] 	at org.apache.cassandra.net.MessagingService.getServerSocket(MessagingService.java:279)
    [junit] 	at org.apache.cassandra.net.MessagingService.listen(MessagingService.java:249)
    [junit] 	at org.apache.cassandra.service.StorageService.initClient(StorageService.java:384)
    [junit] 	at org.apache.cassandra.service.StorageServiceClientTest.testClientOnlyMode(StorageServiceClientTest.java:39)
    [junit] 
    [junit] 
    [junit] Test org.apache.cassandra.service.StorageServiceClientTest FAILED
    [junit] Testsuite: org.apache.cassandra.service.StorageServiceServerTest
    [junit] Exception in thread "StorageServiceShutdownHook" java.lang.IllegalStateException:
No configured RPC daemon
    [junit] Tests run: 3, Failures: 0, Errors: 1, Time elapsed: 0.819 sec
    [junit] 	at org.apache.cassandra.service.StorageService.stopRPCServer(StorageService.java:335)
    [junit] 
    [junit] 	at org.apache.cassandra.service.StorageService$2.runMayThrow(StorageService.java:451)
    [junit] ------------- Standard Error -----------------
    [junit] 	at org.apache.cassandra.utils.WrappedRunnable.run(WrappedRunnable.java:30)
    [junit]  WARN 20:27:39,923 Overriding RING_DELAY to 1000ms
    [junit] 	at java.lang.Thread.run(Thread.java:662)
    [junit] ------------- ---------------- ---------------
    [junit] Testcase: testRegularMode(org.apache.cassandra.service.StorageServiceServerTest):
Caused an ERROR
    [junit] /127.0.0.1:7010 is in use by another process.  Change listen_address:storage_port
in cassandra.yaml to values that do not conflict with other services
    [junit] org.apache.cassandra.config.ConfigurationException: /127.0.0.1:7010 is in use
by another process.  Change listen_address:storage_port in cassandra.yaml to values that do
not conflict with other services
    [junit] 	at org.apache.cassandra.net.MessagingService.getServerSocket(MessagingService.java:279)
    [junit] 	at org.apache.cassandra.net.MessagingService.listen(MessagingService.java:249)
    [junit] 	at org.apache.cassandra.service.StorageService.joinTokenRing(StorageService.java:513)
    [junit] 	at org.apache.cassandra.service.StorageService.initServer(StorageService.java:490)
    [junit] 	at org.apache.cassandra.service.StorageServiceServerTest.testRegularMode(StorageServiceServerTest.java:45)
    [junit] 
    [junit] 
    [junit] Test org.apache.cassandra.service.StorageServiceServerTest FAILED
    [junit] Testsuite: org.apache.cassandra.streaming.BootstrapTest
    [junit] Tests run: 1, Failures: 0, Errors: 0, Time elapsed: 0.701 sec
    [junit] 
    [junit] ------------- Standard Error -----------------
    [junit]  WARN 20:27:41,445 Overriding RING_DELAY to 1000ms
    [junit] ------------- ---------------- ---------------
    [junit] Testsuite: org.apache.cassandra.streaming.SerializationsTest
    [junit] Tests run: 4, Failures: 0, Errors: 0, Time elapsed: 0.619 sec
    [junit] 
    [junit] ------------- Standard Error -----------------
    [junit]  WARN 20:27:42,948 Overriding RING_DELAY to 1000ms
    [junit] ------------- ---------------- ---------------
    [junit] Testsuite: org.apache.cassandra.streaming.StreamingTransferTest
    [junit] Tests run: 0, Failures: 0, Errors: 1, Time elapsed: 0.51 sec
    [junit] 
    [junit] ------------- Standard Error -----------------
    [junit]  WARN 20:27:44,299 Overriding RING_DELAY to 1000ms
    [junit] ------------- ---------------- ---------------
    [junit] Testcase: org.apache.cassandra.streaming.StreamingTransferTest:	Caused an ERROR
    [junit] /127.0.0.1:7010 is in use by another process.  Change listen_address:storage_port
in cassandra.yaml to values that do not conflict with other services
    [junit] org.apache.cassandra.config.ConfigurationException: /127.0.0.1:7010 is in use
by another process.  Change listen_address:storage_port in cassandra.yaml to values that do
not conflict with other services
    [junit] 	at org.apache.cassandra.net.MessagingService.getServerSocket(MessagingService.java:279)
    [junit] 	at org.apache.cassandra.net.MessagingService.listen(MessagingService.java:249)
    [junit] 	at org.apache.cassandra.service.StorageService.joinTokenRing(StorageService.java:513)
    [junit] 	at org.apache.cassandra.service.StorageService.initServer(StorageService.java:490)
    [junit] 	at org.apache.cassandra.service.StorageService.initServer(StorageService.java:400)
    [junit] 	at org.apache.cassandra.streaming.StreamingTransferTest.setup(StreamingTransferTest.java:65)
    [junit] 
    [junit] 
    [junit] Test org.apache.cassandra.streaming.StreamingTransferTest FAILED
    [junit] Testsuite: org.apache.cassandra.thrift.ThriftValidationTest
    [junit] Tests run: 5, Failures: 0, Errors: 0, Time elapsed: 0.796 sec
    [junit] 
    [junit] ------------- Standard Error -----------------
    [junit]  WARN 20:27:46,036 Overriding RING_DELAY to 1000ms
    [junit] ------------- ---------------- ---------------
    [junit] Testsuite: org.apache.cassandra.tools.SSTableExportTest
    [junit] Tests run: 6, Failures: 0, Errors: 0, Time elapsed: 1.147 sec
    [junit] 
    [junit] ------------- Standard Output ---------------
    [junit] Importing 1 keys...
    [junit] Importing 1 keys...
    [junit] 1 keys imported successfully.
    [junit] ------------- ---------------- ---------------
    [junit] ------------- Standard Error -----------------
    [junit]  WARN 20:27:47,619 Overriding RING_DELAY to 1000ms
    [junit] ------------- ---------------- ---------------
    [junit] Testsuite: org.apache.cassandra.tools.SSTableImportTest
    [junit] Tests run: 5, Failures: 0, Errors: 2, Time elapsed: 0.96 sec
    [junit] 
    [junit] ------------- Standard Output ---------------
    [junit] Importing 2 keys...
    [junit] Importing 2 keys...
    [junit] Importing 2 keys...
    [junit] 2 keys imported successfully.
    [junit] Importing 3 keys...
    [junit] Importing 3 keys...
    [junit] 1 keys imported successfully.
    [junit] ------------- ---------------- ---------------
    [junit] ------------- Standard Error -----------------
    [junit]  WARN 20:27:49,569 Overriding RING_DELAY to 1000ms
    [junit] Line 2: Key 303630 is greater than previous, collection is not sorted properly.
Aborting import. You might need to delete SSTables manually.
    [junit] ------------- ---------------- ---------------
    [junit] Testcase: testImportSimpleCf(org.apache.cassandra.tools.SSTableImportTest):	Caused
an ERROR
    [junit] java.lang.Integer cannot be cast to java.lang.Long
    [junit] java.lang.ClassCastException: java.lang.Integer cannot be cast to java.lang.Long
    [junit] 	at org.apache.cassandra.tools.SSTableImport$JsonColumn.<init>(SSTableImport.java:132)
    [junit] 	at org.apache.cassandra.tools.SSTableImport.addColumnsToCF(SSTableImport.java:191)
    [junit] 	at org.apache.cassandra.tools.SSTableImport.addToStandardCF(SSTableImport.java:174)
    [junit] 	at org.apache.cassandra.tools.SSTableImport.importUnsorted(SSTableImport.java:290)
    [junit] 	at org.apache.cassandra.tools.SSTableImport.importJson(SSTableImport.java:255)
    [junit] 	at org.apache.cassandra.tools.SSTableImportTest.testImportSimpleCf(SSTableImportTest.java:60)
    [junit] 
    [junit] 
    [junit] Testcase: testImportSimpleCfOldFormat(org.apache.cassandra.tools.SSTableImportTest):
Caused an ERROR
    [junit] java.lang.Integer cannot be cast to java.lang.Long
    [junit] java.lang.ClassCastException: java.lang.Integer cannot be cast to java.lang.Long
    [junit] 	at org.apache.cassandra.tools.SSTableImport$JsonColumn.<init>(SSTableImport.java:119)
    [junit] 	at org.apache.cassandra.tools.SSTableImport.addColumnsToCF(SSTableImport.java:191)
    [junit] 	at org.apache.cassandra.tools.SSTableImport.addToStandardCF(SSTableImport.java:174)
    [junit] 	at org.apache.cassandra.tools.SSTableImport.importUnsorted(SSTableImport.java:290)
    [junit] 	at org.apache.cassandra.tools.SSTableImport.importJson(SSTableImport.java:255)
    [junit] 	at org.apache.cassandra.tools.SSTableImportTest.testImportSimpleCfOldFormat(SSTableImportTest.java:89)
    [junit] 
    [junit] 
    [junit] Test org.apache.cassandra.tools.SSTableImportTest FAILED
    [junit] Testsuite: org.apache.cassandra.utils.BloomFilterTest
    [junit] Tests run: 7, Failures: 0, Errors: 0, Time elapsed: 0.586 sec
    [junit] 
    [junit] Testsuite: org.apache.cassandra.utils.BoundedStatsDequeTest
    [junit] Tests run: 1, Failures: 0, Errors: 0, Time elapsed: 0.056 sec
    [junit] 
    [junit] Testsuite: org.apache.cassandra.utils.ByteBufferUtilTest
    [junit] Tests run: 10, Failures: 0, Errors: 0, Time elapsed: 0.079 sec
    [junit] 
    [junit] Testsuite: org.apache.cassandra.utils.BytesReadTrackerTest
    [junit] Tests run: 4, Failures: 0, Errors: 0, Time elapsed: 0.058 sec
    [junit] 
    [junit] Testsuite: org.apache.cassandra.utils.EstimatedHistogramTest
    [junit] Tests run: 4, Failures: 0, Errors: 0, Time elapsed: 0.063 sec
    [junit] 
    [junit] Testsuite: org.apache.cassandra.utils.FBUtilitiesTest
    [junit] Tests run: 3, Failures: 0, Errors: 0, Time elapsed: 0.139 sec
    [junit] 
    [junit] Testsuite: org.apache.cassandra.utils.HexTest
    [junit] Tests run: 2, Failures: 0, Errors: 0, Time elapsed: 0.062 sec
    [junit] 
    [junit] Testsuite: org.apache.cassandra.utils.IntervalTest
    [junit] Tests run: 3, Failures: 0, Errors: 0, Time elapsed: 0.052 sec
    [junit] 
    [junit] Testsuite: org.apache.cassandra.utils.IntervalTreeTest
    [junit] Tests run: 1, Failures: 0, Errors: 0, Time elapsed: 0.147 sec
    [junit] 
    [junit] Testsuite: org.apache.cassandra.utils.LegacyBloomFilterTest
    [junit] Tests run: 6, Failures: 0, Errors: 0, Time elapsed: 0.459 sec
    [junit] 
    [junit] Testsuite: org.apache.cassandra.utils.MergeIteratorTest
    [junit] Tests run: 1, Failures: 0, Errors: 0, Time elapsed: 0.079 sec
    [junit] 
    [junit] Testsuite: org.apache.cassandra.utils.MerkleTreeTest
    [junit] Tests run: 12, Failures: 0, Errors: 1, Time elapsed: 0.415 sec
    [junit] 
    [junit] ------------- Standard Error -----------------
    [junit]  WARN 20:28:00,564 Overriding RING_DELAY to 1000ms
    [junit] ------------- ---------------- ---------------
    [junit] Testcase: testSerialization(org.apache.cassandra.utils.MerkleTreeTest):	Caused
an ERROR
    [junit] org.apache.cassandra.dht.BigIntegerToken
    [junit] java.io.NotSerializableException: org.apache.cassandra.dht.BigIntegerToken
    [junit] 	at java.io.ObjectOutputStream.writeObject0(ObjectOutputStream.java:1164)
    [junit] 	at java.io.ObjectOutputStream.defaultWriteFields(ObjectOutputStream.java:1518)
    [junit] 	at java.io.ObjectOutputStream.writeSerialData(ObjectOutputStream.java:1483)
    [junit] 	at java.io.ObjectOutputStream.writeOrdinaryObject(ObjectOutputStream.java:1400)
    [junit] 	at java.io.ObjectOutputStream.writeObject0(ObjectOutputStream.java:1158)
    [junit] 	at java.io.ObjectOutputStream.defaultWriteFields(ObjectOutputStream.java:1518)
    [junit] 	at java.io.ObjectOutputStream.writeSerialData(ObjectOutputStream.java:1483)
    [junit] 	at java.io.ObjectOutputStream.writeOrdinaryObject(ObjectOutputStream.java:1400)
    [junit] 	at java.io.ObjectOutputStream.writeObject0(ObjectOutputStream.java:1158)
    [junit] 	at java.io.ObjectOutputStream.defaultWriteFields(ObjectOutputStream.java:1518)
    [junit] 	at java.io.ObjectOutputStream.writeSerialData(ObjectOutputStream.java:1483)
    [junit] 	at java.io.ObjectOutputStream.writeOrdinaryObject(ObjectOutputStream.java:1400)
    [junit] 	at java.io.ObjectOutputStream.writeObject0(ObjectOutputStream.java:1158)
    [junit] 	at java.io.ObjectOutputStream.defaultWriteFields(ObjectOutputStream.java:1518)
    [junit] 	at java.io.ObjectOutputStream.writeSerialData(ObjectOutputStream.java:1483)
    [junit] 	at java.io.ObjectOutputStream.writeOrdinaryObject(ObjectOutputStream.java:1400)
    [junit] 	at java.io.ObjectOutputStream.writeObject0(ObjectOutputStream.java:1158)
    [junit] 	at java.io.ObjectOutputStream.defaultWriteFields(ObjectOutputStream.java:1518)
    [junit] 	at java.io.ObjectOutputStream.writeSerialData(ObjectOutputStream.java:1483)
    [junit] 	at java.io.ObjectOutputStream.writeOrdinaryObject(ObjectOutputStream.java:1400)
    [junit] 	at java.io.ObjectOutputStream.writeObject0(ObjectOutputStream.java:1158)
    [junit] 	at java.io.ObjectOutputStream.defaultWriteFields(ObjectOutputStream.java:1518)
    [junit] 	at java.io.ObjectOutputStream.writeSerialData(ObjectOutputStream.java:1483)
    [junit] 	at java.io.ObjectOutputStream.writeOrdinaryObject(ObjectOutputStream.java:1400)
    [junit] 	at java.io.ObjectOutputStream.writeObject0(ObjectOutputStream.java:1158)
    [junit] 	at java.io.ObjectOutputStream.defaultWriteFields(ObjectOutputStream.java:1518)
    [junit] 	at java.io.ObjectOutputStream.writeSerialData(ObjectOutputStream.java:1483)
    [junit] 	at java.io.ObjectOutputStream.writeOrdinaryObject(ObjectOutputStream.java:1400)
    [junit] 	at java.io.ObjectOutputStream.writeObject0(ObjectOutputStream.java:1158)
    [junit] 	at java.io.ObjectOutputStream.defaultWriteFields(ObjectOutputStream.java:1518)
    [junit] 	at java.io.ObjectOutputStream.writeSerialData(ObjectOutputStream.java:1483)
    [junit] 	at java.io.ObjectOutputStream.writeOrdinaryObject(ObjectOutputStream.java:1400)
    [junit] 	at java.io.ObjectOutputStream.writeObject0(ObjectOutputStream.java:1158)
    [junit] 	at java.io.ObjectOutputStream.defaultWriteFields(ObjectOutputStream.java:1518)
    [junit] 	at java.io.ObjectOutputStream.writeSerialData(ObjectOutputStream.java:1483)
    [junit] 	at java.io.ObjectOutputStream.writeOrdinaryObject(ObjectOutputStream.java:1400)
    [junit] 	at java.io.ObjectOutputStream.writeObject0(ObjectOutputStream.java:1158)
    [junit] 	at java.io.ObjectOutputStream.writeObject(ObjectOutputStream.java:330)
    [junit] 	at org.apache.cassandra.utils.MerkleTreeTest.testSerialization(MerkleTreeTest.java:410)
    [junit] 
    [junit] 
    [junit] Test org.apache.cassandra.utils.MerkleTreeTest FAILED
    [junit] Testsuite: org.apache.cassandra.utils.SerializationsTest
    [junit] Tests run: 3, Failures: 0, Errors: 0, Time elapsed: 0.812 sec
    [junit] 
    [junit] ------------- Standard Error -----------------
    [junit]  WARN 20:28:01,908 Overriding RING_DELAY to 1000ms
    [junit] ------------- ---------------- ---------------

BUILD FAILED
<https://builds.apache.org/job/Cassandra-quick/ws/cassandra/build.xml>:1018: The following
error occurred while executing this line:
<https://builds.apache.org/job/Cassandra-quick/ws/cassandra/build.xml>:1004: Some unit
test(s) failed.

Total time: 7 minutes 59 seconds
Build step 'Invoke Ant' marked build as failure
[TASKS] Skipping publisher since build result is FAILURE
Recording test results


Mime
View raw message