incubator-cassandra-dev mailing list archives

Site index · List index
Message view « Date » · « Thread »
Top « Date » · « Thread »
From Apache Jenkins Server <jenk...@builds.apache.org>
Subject Build failed in Jenkins: Cassandra #1198
Date Tue, 08 Nov 2011 19:21:59 GMT
See <https://builds.apache.org/job/Cassandra/1198/changes>

Changes:

[jbellis] merge from 1.0

[jbellis] fix merge of #3437

[jbellis] update CHANGES

[jbellis] merge from 1.0

------------------------------------------
[...truncated 2223 lines...]
    [junit] 
    [junit] Testsuite: org.apache.cassandra.locator.ReplicationStrategyEndpointCacheTest
    [junit] Tests run: 2, Failures: 0, Errors: 0, Time elapsed: 0.514 sec
    [junit] 
    [junit] Testsuite: org.apache.cassandra.locator.SimpleStrategyTest
    [junit] Tests run: 4, Failures: 0, Errors: 0, Time elapsed: 0.703 sec
    [junit] 
    [junit] Testsuite: org.apache.cassandra.locator.TokenMetadataTest
    [junit] Tests run: 3, Failures: 0, Errors: 0, Time elapsed: 0.452 sec
    [junit] 
    [junit] Testsuite: org.apache.cassandra.service.AntiEntropyServiceCounterTest
    [junit] Tests run: 6, Failures: 0, Errors: 1, Time elapsed: 2.451 sec
    [junit] 
    [junit] Testcase: testValidatorPrepare(org.apache.cassandra.service.AntiEntropyServiceCounterTest):
Caused an ERROR
    [junit] /127.0.0.1:7010 is in use by another process.  Change listen_address:storage_port
in cassandra.yaml to values that do not conflict with other services
    [junit] org.apache.cassandra.config.ConfigurationException: /127.0.0.1:7010 is in use
by another process.  Change listen_address:storage_port in cassandra.yaml to values that do
not conflict with other services
    [junit] 	at org.apache.cassandra.net.MessagingService.getServerSocket(MessagingService.java:271)
    [junit] 	at org.apache.cassandra.net.MessagingService.listen(MessagingService.java:241)
    [junit] 	at org.apache.cassandra.service.StorageService.joinTokenRing(StorageService.java:484)
    [junit] 	at org.apache.cassandra.service.StorageService.initServer(StorageService.java:461)
    [junit] 	at org.apache.cassandra.service.AntiEntropyServiceTestAbstract.prepare(AntiEntropyServiceTestAbstract.java:80)
    [junit] 
    [junit] 
    [junit] Test org.apache.cassandra.service.AntiEntropyServiceCounterTest FAILED
    [junit] Testsuite: org.apache.cassandra.service.AntiEntropyServiceStandardTest
    [junit] Tests run: 6, Failures: 0, Errors: 1, Time elapsed: 2.821 sec
    [junit] 
    [junit] Testcase: testValidatorPrepare(org.apache.cassandra.service.AntiEntropyServiceStandardTest):
Caused an ERROR
    [junit] /127.0.0.1:7010 is in use by another process.  Change listen_address:storage_port
in cassandra.yaml to values that do not conflict with other services
    [junit] org.apache.cassandra.config.ConfigurationException: /127.0.0.1:7010 is in use
by another process.  Change listen_address:storage_port in cassandra.yaml to values that do
not conflict with other services
    [junit] 	at org.apache.cassandra.net.MessagingService.getServerSocket(MessagingService.java:271)
    [junit] 	at org.apache.cassandra.net.MessagingService.listen(MessagingService.java:241)
    [junit] 	at org.apache.cassandra.service.StorageService.joinTokenRing(StorageService.java:484)
    [junit] 	at org.apache.cassandra.service.StorageService.initServer(StorageService.java:461)
    [junit] 	at org.apache.cassandra.service.AntiEntropyServiceTestAbstract.prepare(AntiEntropyServiceTestAbstract.java:80)
    [junit] 
    [junit] 
    [junit] Test org.apache.cassandra.service.AntiEntropyServiceStandardTest FAILED
    [junit] Testsuite: org.apache.cassandra.service.CassandraServerTest
    [junit] Tests run: 1, Failures: 0, Errors: 0, Time elapsed: 0.457 sec
    [junit] 
    [junit] Testsuite: org.apache.cassandra.service.ConsistencyLevelTest
    [junit] Tests run: 1, Failures: 0, Errors: 1, Time elapsed: 0.911 sec
    [junit] 
    [junit] Testcase: testReadWriteConsistencyChecks(org.apache.cassandra.service.ConsistencyLevelTest):
Caused an ERROR
    [junit] invalid consistency level: ANY
    [junit] java.lang.UnsupportedOperationException: invalid consistency level: ANY
    [junit] 	at org.apache.cassandra.service.ReadCallback.determineBlockFor(ReadCallback.java:195)
    [junit] 	at org.apache.cassandra.service.ReadCallback.<init>(ReadCallback.java:68)
    [junit] 	at org.apache.cassandra.service.StorageProxy.getReadCallback(StorageProxy.java:798)
    [junit] 	at org.apache.cassandra.service.ConsistencyLevelTest.testReadWriteConsistencyChecks(ConsistencyLevelTest.java:110)
    [junit] 
    [junit] 
    [junit] Test org.apache.cassandra.service.ConsistencyLevelTest FAILED
    [junit] Testsuite: org.apache.cassandra.service.EmbeddedCassandraServiceTest
    [junit] Testsuite: org.apache.cassandra.service.EmbeddedCassandraServiceTest
    [junit] Tests run: 1, Failures: 0, Errors: 1, Time elapsed: 0 sec
    [junit] 
    [junit] Testcase: org.apache.cassandra.service.EmbeddedCassandraServiceTest:BeforeFirstTest:
Caused an ERROR
    [junit] Forked Java VM exited abnormally. Please note the time in the report does not
reflect the time until the VM exit.
    [junit] junit.framework.AssertionFailedError: Forked Java VM exited abnormally. Please
note the time in the report does not reflect the time until the VM exit.
    [junit] 
    [junit] 
    [junit] Test org.apache.cassandra.service.EmbeddedCassandraServiceTest FAILED (crashed)
    [junit] Testsuite: org.apache.cassandra.service.InitClientTest
    [junit] Tests run: 1, Failures: 0, Errors: 1, Time elapsed: 0.458 sec
    [junit] 
    [junit] Testcase: testInitClientStartup(org.apache.cassandra.service.InitClientTest):
Caused an ERROR
    [junit] /127.0.0.1:7010 is in use by another process.  Change listen_address:storage_port
in cassandra.yaml to values that do not conflict with other services
    [junit] org.apache.cassandra.config.ConfigurationException: /127.0.0.1:7010 is in use
by another process.  Change listen_address:storage_port in cassandra.yaml to values that do
not conflict with other services
    [junit] 	at org.apache.cassandra.net.MessagingService.getServerSocket(MessagingService.java:271)
    [junit] 	at org.apache.cassandra.net.MessagingService.listen(MessagingService.java:241)
    [junit] 	at org.apache.cassandra.service.StorageService.initClient(StorageService.java:366)
    [junit] 	at org.apache.cassandra.service.InitClientTest.testInitClientStartup(InitClientTest.java:33)
    [junit] 
    [junit] 
    [junit] Test org.apache.cassandra.service.InitClientTest FAILED
    [junit] Testsuite: org.apache.cassandra.service.LeaveAndBootstrapTest
    [junit] Tests run: 6, Failures: 0, Errors: 0, Time elapsed: 2.77 sec
    [junit] 
    [junit] ------------- Standard Error -----------------
    [junit]  WARN 19:19:41,353 Node /127.0.0.3 'leaving' token mismatch. Long network partition?
    [junit] ------------- ---------------- ---------------
    [junit] Testsuite: org.apache.cassandra.service.MoveTest
    [junit] Tests run: 3, Failures: 0, Errors: 0, Time elapsed: 1.885 sec
    [junit] 
    [junit] Testsuite: org.apache.cassandra.service.RemoveTest
    [junit] Tests run: 3, Failures: 0, Errors: 3, Time elapsed: 1.458 sec
    [junit] 
    [junit] Testcase: testBadToken(org.apache.cassandra.service.RemoveTest):	Caused an ERROR
    [junit] /127.0.0.1:7010 is in use by another process.  Change listen_address:storage_port
in cassandra.yaml to values that do not conflict with other services
    [junit] org.apache.cassandra.config.ConfigurationException: /127.0.0.1:7010 is in use
by another process.  Change listen_address:storage_port in cassandra.yaml to values that do
not conflict with other services
    [junit] 	at org.apache.cassandra.net.MessagingService.getServerSocket(MessagingService.java:271)
    [junit] 	at org.apache.cassandra.net.MessagingService.listen(MessagingService.java:241)
    [junit] 	at org.apache.cassandra.service.RemoveTest.setup(RemoveTest.java:74)
    [junit] 
    [junit] 
    [junit] Testcase: testLocalToken(org.apache.cassandra.service.RemoveTest):	Caused an ERROR
    [junit] /127.0.0.1:7010 is in use by another process.  Change listen_address:storage_port
in cassandra.yaml to values that do not conflict with other services
    [junit] org.apache.cassandra.config.ConfigurationException: /127.0.0.1:7010 is in use
by another process.  Change listen_address:storage_port in cassandra.yaml to values that do
not conflict with other services
    [junit] 	at org.apache.cassandra.net.MessagingService.getServerSocket(MessagingService.java:271)
    [junit] 	at org.apache.cassandra.net.MessagingService.listen(MessagingService.java:241)
    [junit] 	at org.apache.cassandra.service.RemoveTest.setup(RemoveTest.java:74)
    [junit] 
    [junit] 
    [junit] Testcase: testRemoveToken(org.apache.cassandra.service.RemoveTest):	Caused an
ERROR
    [junit] /127.0.0.1:7010 is in use by another process.  Change listen_address:storage_port
in cassandra.yaml to values that do not conflict with other services
    [junit] org.apache.cassandra.config.ConfigurationException: /127.0.0.1:7010 is in use
by another process.  Change listen_address:storage_port in cassandra.yaml to values that do
not conflict with other services
    [junit] 	at org.apache.cassandra.net.MessagingService.getServerSocket(MessagingService.java:271)
    [junit] 	at org.apache.cassandra.net.MessagingService.listen(MessagingService.java:241)
    [junit] 	at org.apache.cassandra.service.RemoveTest.setup(RemoveTest.java:74)
    [junit] 
    [junit] 
    [junit] Test org.apache.cassandra.service.RemoveTest FAILED
    [junit] Testsuite: org.apache.cassandra.service.RowResolverTest
    [junit] Tests run: 8, Failures: 0, Errors: 0, Time elapsed: 0.441 sec
    [junit] 
    [junit] Testsuite: org.apache.cassandra.service.SerializationsTest
    [junit] Tests run: 2, Failures: 0, Errors: 0, Time elapsed: 0.181 sec
    [junit] 
    [junit] Testsuite: org.apache.cassandra.service.StorageProxyTest
    [junit] Tests run: 4, Failures: 0, Errors: 0, Time elapsed: 0.474 sec
    [junit] 
    [junit] Testsuite: org.apache.cassandra.service.StorageServiceClientTest
    [junit] Tests run: 1, Failures: 0, Errors: 1, Time elapsed: 0.462 sec
    [junit] 
    [junit] Testcase: testClientOnlyMode(org.apache.cassandra.service.StorageServiceClientTest):
Caused an ERROR
    [junit] /127.0.0.1:7010 is in use by another process.  Change listen_address:storage_port
in cassandra.yaml to values that do not conflict with other services
    [junit] org.apache.cassandra.config.ConfigurationException: /127.0.0.1:7010 is in use
by another process.  Change listen_address:storage_port in cassandra.yaml to values that do
not conflict with other services
    [junit] 	at org.apache.cassandra.net.MessagingService.getServerSocket(MessagingService.java:271)
    [junit] 	at org.apache.cassandra.net.MessagingService.listen(MessagingService.java:241)
    [junit] 	at org.apache.cassandra.service.StorageService.initClient(StorageService.java:366)
    [junit] 	at org.apache.cassandra.service.StorageServiceClientTest.testClientOnlyMode(StorageServiceClientTest.java:39)
    [junit] 
    [junit] 
    [junit] Test org.apache.cassandra.service.StorageServiceClientTest FAILED
    [junit] Testsuite: org.apache.cassandra.service.StorageServiceServerTest
    [junit] Tests run: 3, Failures: 0, Errors: 1, Time elapsed: 1.122 sec
    [junit] 
    [junit] Testcase: testRegularMode(org.apache.cassandra.service.StorageServiceServerTest):
Caused an ERROR
    [junit] /127.0.0.1:7010 is in use by another process.  Change listen_address:storage_port
in cassandra.yaml to values that do not conflict with other services
    [junit] org.apache.cassandra.config.ConfigurationException: /127.0.0.1:7010 is in use
by another process.  Change listen_address:storage_port in cassandra.yaml to values that do
not conflict with other services
    [junit] 	at org.apache.cassandra.net.MessagingService.getServerSocket(MessagingService.java:271)
    [junit] 	at org.apache.cassandra.net.MessagingService.listen(MessagingService.java:241)
    [junit] 	at org.apache.cassandra.service.StorageService.joinTokenRing(StorageService.java:484)
    [junit] 	at org.apache.cassandra.service.StorageService.initServer(StorageService.java:461)
    [junit] 	at org.apache.cassandra.service.StorageServiceServerTest.testRegularMode(StorageServiceServerTest.java:45)
    [junit] 
    [junit] 
    [junit] Test org.apache.cassandra.service.StorageServiceServerTest FAILED
    [junit] Testsuite: org.apache.cassandra.streaming.BootstrapTest
    [junit] Tests run: 1, Failures: 0, Errors: 0, Time elapsed: 0.631 sec
    [junit] 
    [junit] Testsuite: org.apache.cassandra.streaming.SerializationsTest
    [junit] Tests run: 4, Failures: 0, Errors: 0, Time elapsed: 0.511 sec
    [junit] 
    [junit] Testsuite: org.apache.cassandra.streaming.StreamingTransferTest
    [junit] Tests run: 0, Failures: 0, Errors: 1, Time elapsed: 0.317 sec
    [junit] 
    [junit] Testcase: org.apache.cassandra.streaming.StreamingTransferTest:	Caused an ERROR
    [junit] /127.0.0.1:7010 is in use by another process.  Change listen_address:storage_port
in cassandra.yaml to values that do not conflict with other services
    [junit] org.apache.cassandra.config.ConfigurationException: /127.0.0.1:7010 is in use
by another process.  Change listen_address:storage_port in cassandra.yaml to values that do
not conflict with other services
    [junit] 	at org.apache.cassandra.net.MessagingService.getServerSocket(MessagingService.java:271)
    [junit] 	at org.apache.cassandra.net.MessagingService.listen(MessagingService.java:241)
    [junit] 	at org.apache.cassandra.service.StorageService.joinTokenRing(StorageService.java:484)
    [junit] 	at org.apache.cassandra.service.StorageService.initServer(StorageService.java:461)
    [junit] 	at org.apache.cassandra.service.StorageService.initServer(StorageService.java:382)
    [junit] 	at org.apache.cassandra.streaming.StreamingTransferTest.setup(StreamingTransferTest.java:64)
    [junit] 
    [junit] 
    [junit] Test org.apache.cassandra.streaming.StreamingTransferTest FAILED
    [junit] Testsuite: org.apache.cassandra.thrift.ThriftValidationTest
    [junit] Tests run: 5, Failures: 0, Errors: 0, Time elapsed: 0.746 sec
    [junit] Tests run: 5, Failures: 0, Errors: 0, Time elapsed: 0.746 sec
    [junit] 
    [junit] Testsuite: org.apache.cassandra.tools.SSTableExportTest
    [junit] Tests run: 6, Failures: 0, Errors: 0, Time elapsed: 0.869 sec
    [junit] 
    [junit] ------------- Standard Output ---------------
    [junit] Importing 1 keys...
    [junit] 1 keys imported successfully.
    [junit] ------------- ---------------- ---------------
    [junit] Testsuite: org.apache.cassandra.tools.SSTableImportTest
    [junit] Tests run: 5, Failures: 0, Errors: 0, Time elapsed: 0.789 sec
    [junit] 
    [junit] ------------- Standard Output ---------------
    [junit] Importing 2 keys...
    [junit] 2 keys imported successfully.
    [junit] Importing 2 keys...
    [junit] 2 keys imported successfully.
    [junit] Importing 2 keys...
    [junit] 2 keys imported successfully.
    [junit] Importing 3 keys...
    [junit] Importing 3 keys...
    [junit] 1 keys imported successfully.
    [junit] ------------- ---------------- ---------------
    [junit] ------------- Standard Error -----------------
    [junit] Line 2: Key 303630 is greater than previous, collection is not sorted properly.
Aborting import. You might need to delete SSTables manually.
    [junit] ------------- ---------------- ---------------
    [junit] Testsuite: org.apache.cassandra.utils.BloomFilterTest
    [junit] Tests run: 7, Failures: 0, Errors: 0, Time elapsed: 0.513 sec
    [junit] 
    [junit] Testsuite: org.apache.cassandra.utils.BoundedStatsDequeTest
    [junit] Tests run: 1, Failures: 0, Errors: 0, Time elapsed: 0.057 sec
    [junit] 
    [junit] Testsuite: org.apache.cassandra.utils.ByteBufferUtilTest
    [junit] Tests run: 10, Failures: 0, Errors: 0, Time elapsed: 0.086 sec
    [junit] 
    [junit] Testsuite: org.apache.cassandra.utils.BytesReadTrackerTest
    [junit] Tests run: 4, Failures: 0, Errors: 0, Time elapsed: 0.059 sec
    [junit] 
    [junit] Testsuite: org.apache.cassandra.utils.EstimatedHistogramTest
    [junit] Tests run: 4, Failures: 0, Errors: 0, Time elapsed: 0.059 sec
    [junit] 
    [junit] Testsuite: org.apache.cassandra.utils.FBUtilitiesTest
    [junit] Tests run: 3, Failures: 0, Errors: 0, Time elapsed: 0.148 sec
    [junit] 
    [junit] Testsuite: org.apache.cassandra.utils.HexTest
    [junit] Tests run: 2, Failures: 0, Errors: 0, Time elapsed: 0.066 sec
    [junit] 
    [junit] Testsuite: org.apache.cassandra.utils.IntervalTest
    [junit] Tests run: 3, Failures: 0, Errors: 0, Time elapsed: 0.053 sec
    [junit] 
    [junit] Testsuite: org.apache.cassandra.utils.IntervalTreeTest
    [junit] Tests run: 1, Failures: 0, Errors: 0, Time elapsed: 0.155 sec
    [junit] 
    [junit] Testsuite: org.apache.cassandra.utils.LegacyBloomFilterTest
    [junit] Tests run: 6, Failures: 0, Errors: 0, Time elapsed: 0.456 sec
    [junit] 
    [junit] Testsuite: org.apache.cassandra.utils.MergeIteratorTest
    [junit] Tests run: 1, Failures: 0, Errors: 0, Time elapsed: 0.073 sec
    [junit] 
    [junit] Testsuite: org.apache.cassandra.utils.MerkleTreeTest
    [junit] Tests run: 12, Failures: 0, Errors: 0, Time elapsed: 0.733 sec
    [junit] 
    [junit] Testsuite: org.apache.cassandra.utils.SerializationsTest
    [junit] Tests run: 3, Failures: 0, Errors: 0, Time elapsed: 0.719 sec
    [junit] 

BUILD FAILED
<https://builds.apache.org/job/Cassandra/ws/cassandra/build.xml>:1036: The following
error occurred while executing this line:
<https://builds.apache.org/job/Cassandra/ws/cassandra/build.xml>:1022: Some unit test(s)
failed.

Total time: 18 minutes 32 seconds
Build step 'Invoke Ant' marked build as failure
[TASKS] Skipping publisher since build result is FAILURE
Publishing Javadoc
Archiving artifacts
Recording test results


Mime
View raw message