incubator-cassandra-dev mailing list archives

Site index · List index
Message view « Date » · « Thread »
Top « Date » · « Thread »
From Apache Jenkins Server <jenk...@builds.apache.org>
Subject Build failed in Jenkins: Cassandra #1221
Date Thu, 24 Nov 2011 21:21:55 GMT
See <https://builds.apache.org/job/Cassandra/1221/changes>

Changes:

[jbellis] merge #3440 from 1.0

------------------------------------------
[...truncated 2245 lines...]
    [junit] 
    [junit] 
    [junit] Test org.apache.cassandra.locator.DynamicEndpointSnitchTest FAILED
    [junit] Testsuite: org.apache.cassandra.locator.EC2SnitchTest
    [junit] Tests run: 1, Failures: 0, Errors: 0, Time elapsed: 0.453 sec
    [junit] 
    [junit] Testsuite: org.apache.cassandra.locator.NetworkTopologyStrategyTest
    [junit] Tests run: 2, Failures: 0, Errors: 0, Time elapsed: 0.494 sec
    [junit] 
    [junit] Testsuite: org.apache.cassandra.locator.OldNetworkTopologyStrategyTest
    [junit] Tests run: 3, Failures: 0, Errors: 0, Time elapsed: 0.171 sec
    [junit] 
    [junit] Testsuite: org.apache.cassandra.locator.ReplicationStrategyEndpointCacheTest
    [junit] Tests run: 2, Failures: 0, Errors: 0, Time elapsed: 0.547 sec
    [junit] 
    [junit] Testsuite: org.apache.cassandra.locator.SimpleStrategyTest
    [junit] Tests run: 4, Failures: 0, Errors: 0, Time elapsed: 0.889 sec
    [junit] 
    [junit] Testsuite: org.apache.cassandra.locator.TokenMetadataTest
    [junit] Tests run: 3, Failures: 0, Errors: 0, Time elapsed: 0.464 sec
    [junit] 
    [junit] Testsuite: org.apache.cassandra.service.AntiEntropyServiceCounterTest
    [junit] Tests run: 6, Failures: 0, Errors: 1, Time elapsed: 2.678 sec
    [junit] 
    [junit] Testcase: testValidatorPrepare(org.apache.cassandra.service.AntiEntropyServiceCounterTest):
Caused an ERROR
    [junit] /127.0.0.1:7010 is in use by another process.  Change listen_address:storage_port
in cassandra.yaml to values that do not conflict with other services
    [junit] org.apache.cassandra.config.ConfigurationException: /127.0.0.1:7010 is in use
by another process.  Change listen_address:storage_port in cassandra.yaml to values that do
not conflict with other services
    [junit] 	at org.apache.cassandra.net.MessagingService.getServerSocket(MessagingService.java:261)
    [junit] 	at org.apache.cassandra.net.MessagingService.listen(MessagingService.java:231)
    [junit] 	at org.apache.cassandra.service.StorageService.joinTokenRing(StorageService.java:484)
    [junit] 	at org.apache.cassandra.service.StorageService.initServer(StorageService.java:461)
    [junit] 	at org.apache.cassandra.service.AntiEntropyServiceTestAbstract.prepare(AntiEntropyServiceTestAbstract.java:80)
    [junit] 
    [junit] 
    [junit] Test org.apache.cassandra.service.AntiEntropyServiceCounterTest FAILED
    [junit] Testsuite: org.apache.cassandra.service.AntiEntropyServiceStandardTest
    [junit] Tests run: 6, Failures: 0, Errors: 1, Time elapsed: 3.001 sec
    [junit] 
    [junit] Testcase: testValidatorPrepare(org.apache.cassandra.service.AntiEntropyServiceStandardTest):
Caused an ERROR
    [junit] /127.0.0.1:7010 is in use by another process.  Change listen_address:storage_port
in cassandra.yaml to values that do not conflict with other services
    [junit] org.apache.cassandra.config.ConfigurationException: /127.0.0.1:7010 is in use
by another process.  Change listen_address:storage_port in cassandra.yaml to values that do
not conflict with other services
    [junit] 	at org.apache.cassandra.net.MessagingService.getServerSocket(MessagingService.java:261)
    [junit] 	at org.apache.cassandra.net.MessagingService.listen(MessagingService.java:231)
    [junit] 	at org.apache.cassandra.service.StorageService.joinTokenRing(StorageService.java:484)
    [junit] 	at org.apache.cassandra.service.StorageService.initServer(StorageService.java:461)
    [junit] 	at org.apache.cassandra.service.AntiEntropyServiceTestAbstract.prepare(AntiEntropyServiceTestAbstract.java:80)
    [junit] 
    [junit] 
    [junit] Test org.apache.cassandra.service.AntiEntropyServiceStandardTest FAILED
    [junit] Testsuite: org.apache.cassandra.service.CassandraServerTest
    [junit] Tests run: 1, Failures: 0, Errors: 0, Time elapsed: 0.632 sec
    [junit] 
    [junit] Testsuite: org.apache.cassandra.service.ConsistencyLevelTest
    [junit] Tests run: 1, Failures: 0, Errors: 0, Time elapsed: 0.988 sec
    [junit] 
    [junit] Testsuite: org.apache.cassandra.service.EmbeddedCassandraServiceTest
    [junit] Testsuite: org.apache.cassandra.service.EmbeddedCassandraServiceTest
    [junit] Tests run: 1, Failures: 0, Errors: 1, Time elapsed: 0 sec
    [junit] 
    [junit] Testcase: org.apache.cassandra.service.EmbeddedCassandraServiceTest:BeforeFirstTest:
Caused an ERROR
    [junit] Forked Java VM exited abnormally. Please note the time in the report does not
reflect the time until the VM exit.
    [junit] junit.framework.AssertionFailedError: Forked Java VM exited abnormally. Please
note the time in the report does not reflect the time until the VM exit.
    [junit] 
    [junit] 
    [junit] Test org.apache.cassandra.service.EmbeddedCassandraServiceTest FAILED (crashed)
    [junit] Testsuite: org.apache.cassandra.service.InitClientTest
    [junit] Tests run: 1, Failures: 0, Errors: 1, Time elapsed: 0.48 sec
    [junit] 
    [junit] Testcase: testInitClientStartup(org.apache.cassandra.service.InitClientTest):
Caused an ERROR
    [junit] /127.0.0.1:7010 is in use by another process.  Change listen_address:storage_port
in cassandra.yaml to values that do not conflict with other services
    [junit] org.apache.cassandra.config.ConfigurationException: /127.0.0.1:7010 is in use
by another process.  Change listen_address:storage_port in cassandra.yaml to values that do
not conflict with other services
    [junit] 	at org.apache.cassandra.net.MessagingService.getServerSocket(MessagingService.java:261)
    [junit] 	at org.apache.cassandra.net.MessagingService.listen(MessagingService.java:231)
    [junit] 	at org.apache.cassandra.service.StorageService.initClient(StorageService.java:366)
    [junit] 	at org.apache.cassandra.service.InitClientTest.testInitClientStartup(InitClientTest.java:33)
    [junit] 
    [junit] 
    [junit] Test org.apache.cassandra.service.InitClientTest FAILED
    [junit] Testsuite: org.apache.cassandra.service.LeaveAndBootstrapTest
    [junit] Tests run: 6, Failures: 0, Errors: 0, Time elapsed: 2.163 sec
    [junit] 
    [junit] ------------- Standard Error -----------------
    [junit]  WARN 21:19:44,640 Node /127.0.0.3 'leaving' token mismatch. Long network partition?
    [junit] ------------- ---------------- ---------------
    [junit] Testsuite: org.apache.cassandra.service.MoveTest
    [junit] Tests run: 3, Failures: 0, Errors: 0, Time elapsed: 1.644 sec
    [junit] 
    [junit] Testsuite: org.apache.cassandra.service.RemoveTest
    [junit] Tests run: 3, Failures: 0, Errors: 3, Time elapsed: 1.306 sec
    [junit] 
    [junit] Testcase: testBadToken(org.apache.cassandra.service.RemoveTest):	Caused an ERROR
    [junit] /127.0.0.1:7010 is in use by another process.  Change listen_address:storage_port
in cassandra.yaml to values that do not conflict with other services
    [junit] org.apache.cassandra.config.ConfigurationException: /127.0.0.1:7010 is in use
by another process.  Change listen_address:storage_port in cassandra.yaml to values that do
not conflict with other services
    [junit] 	at org.apache.cassandra.net.MessagingService.getServerSocket(MessagingService.java:261)
    [junit] 	at org.apache.cassandra.net.MessagingService.listen(MessagingService.java:231)
    [junit] 	at org.apache.cassandra.service.RemoveTest.setup(RemoveTest.java:74)
    [junit] 
    [junit] 
    [junit] Testcase: testLocalToken(org.apache.cassandra.service.RemoveTest):	Caused an ERROR
    [junit] /127.0.0.1:7010 is in use by another process.  Change listen_address:storage_port
in cassandra.yaml to values that do not conflict with other services
    [junit] org.apache.cassandra.config.ConfigurationException: /127.0.0.1:7010 is in use
by another process.  Change listen_address:storage_port in cassandra.yaml to values that do
not conflict with other services
    [junit] 	at org.apache.cassandra.net.MessagingService.getServerSocket(MessagingService.java:261)
    [junit] 	at org.apache.cassandra.net.MessagingService.listen(MessagingService.java:231)
    [junit] 	at org.apache.cassandra.service.RemoveTest.setup(RemoveTest.java:74)
    [junit] 
    [junit] 
    [junit] Testcase: testRemoveToken(org.apache.cassandra.service.RemoveTest):	Caused an
ERROR
    [junit] /127.0.0.1:7010 is in use by another process.  Change listen_address:storage_port
in cassandra.yaml to values that do not conflict with other services
    [junit] org.apache.cassandra.config.ConfigurationException: /127.0.0.1:7010 is in use
by another process.  Change listen_address:storage_port in cassandra.yaml to values that do
not conflict with other services
    [junit] 	at org.apache.cassandra.net.MessagingService.getServerSocket(MessagingService.java:261)
    [junit] 	at org.apache.cassandra.net.MessagingService.listen(MessagingService.java:231)
    [junit] 	at org.apache.cassandra.service.RemoveTest.setup(RemoveTest.java:74)
    [junit] 
    [junit] 
    [junit] Test org.apache.cassandra.service.RemoveTest FAILED
    [junit] Testsuite: org.apache.cassandra.service.RowResolverTest
    [junit] Tests run: 8, Failures: 0, Errors: 0, Time elapsed: 0.461 sec
    [junit] 
    [junit] Testsuite: org.apache.cassandra.service.SerializationsTest
    [junit] Tests run: 2, Failures: 0, Errors: 0, Time elapsed: 0.344 sec
    [junit] 
    [junit] Testsuite: org.apache.cassandra.service.StorageProxyTest
    [junit] Tests run: 4, Failures: 0, Errors: 0, Time elapsed: 0.658 sec
    [junit] 
    [junit] Testsuite: org.apache.cassandra.service.StorageServiceClientTest
    [junit] Tests run: 1, Failures: 0, Errors: 1, Time elapsed: 0.492 sec
    [junit] 
    [junit] Testcase: testClientOnlyMode(org.apache.cassandra.service.StorageServiceClientTest):
Caused an ERROR
    [junit] /127.0.0.1:7010 is in use by another process.  Change listen_address:storage_port
in cassandra.yaml to values that do not conflict with other services
    [junit] org.apache.cassandra.config.ConfigurationException: /127.0.0.1:7010 is in use
by another process.  Change listen_address:storage_port in cassandra.yaml to values that do
not conflict with other services
    [junit] 	at org.apache.cassandra.net.MessagingService.getServerSocket(MessagingService.java:261)
    [junit] 	at org.apache.cassandra.net.MessagingService.listen(MessagingService.java:231)
    [junit] 	at org.apache.cassandra.service.StorageService.initClient(StorageService.java:366)
    [junit] 	at org.apache.cassandra.service.StorageServiceClientTest.testClientOnlyMode(StorageServiceClientTest.java:39)
    [junit] 
    [junit] 
    [junit] Test org.apache.cassandra.service.StorageServiceClientTest FAILED
    [junit] Testsuite: org.apache.cassandra.service.StorageServiceServerTest
    [junit] Tests run: 3, Failures: 0, Errors: 1, Time elapsed: 0.775 sec
    [junit] 
    [junit] Testcase: testRegularMode(org.apache.cassandra.service.StorageServiceServerTest):
Caused an ERROR
    [junit] /127.0.0.1:7010 is in use by another process.  Change listen_address:storage_port
in cassandra.yaml to values that do not conflict with other services
    [junit] org.apache.cassandra.config.ConfigurationException: /127.0.0.1:7010 is in use
by another process.  Change listen_address:storage_port in cassandra.yaml to values that do
not conflict with other services
    [junit] 	at org.apache.cassandra.net.MessagingService.getServerSocket(MessagingService.java:261)
    [junit] 	at org.apache.cassandra.net.MessagingService.listen(MessagingService.java:231)
    [junit] 	at org.apache.cassandra.service.StorageService.joinTokenRing(StorageService.java:484)
    [junit] 	at org.apache.cassandra.service.StorageService.initServer(StorageService.java:461)
    [junit] 	at org.apache.cassandra.service.StorageServiceServerTest.testRegularMode(StorageServiceServerTest.java:45)
    [junit] 
    [junit] 
    [junit] Test org.apache.cassandra.service.StorageServiceServerTest FAILED
    [junit] Testsuite: org.apache.cassandra.streaming.BootstrapTest
    [junit] Tests run: 1, Failures: 0, Errors: 0, Time elapsed: 0.646 sec
    [junit] 
    [junit] Testsuite: org.apache.cassandra.streaming.SerializationsTest
    [junit] Tests run: 4, Failures: 0, Errors: 0, Time elapsed: 0.665 sec
    [junit] 
    [junit] Testsuite: org.apache.cassandra.streaming.StreamingTransferTest
    [junit] Tests run: 0, Failures: 0, Errors: 1, Time elapsed: 0.494 sec
    [junit] 
    [junit] Testcase: org.apache.cassandra.streaming.StreamingTransferTest:	Caused an ERROR
    [junit] /127.0.0.1:7010 is in use by another process.  Change listen_address:storage_port
in cassandra.yaml to values that do not conflict with other services
    [junit] org.apache.cassandra.config.ConfigurationException: /127.0.0.1:7010 is in use
by another process.  Change listen_address:storage_port in cassandra.yaml to values that do
not conflict with other services
    [junit] 	at org.apache.cassandra.net.MessagingService.getServerSocket(MessagingService.java:261)
    [junit] 	at org.apache.cassandra.net.MessagingService.listen(MessagingService.java:231)
    [junit] 	at org.apache.cassandra.service.StorageService.joinTokenRing(StorageService.java:484)
    [junit] 	at org.apache.cassandra.service.StorageService.initServer(StorageService.java:461)
    [junit] 	at org.apache.cassandra.service.StorageService.initServer(StorageService.java:382)
    [junit] 	at org.apache.cassandra.streaming.StreamingTransferTest.setup(StreamingTransferTest.java:64)
    [junit] 
    [junit] 
    [junit] Test org.apache.cassandra.streaming.StreamingTransferTest FAILED
    [junit] Testsuite: org.apache.cassandra.thrift.ThriftValidationTest
    [junit] Tests run: 5, Failures: 0, Errors: 0, Time elapsed: 0.895 sec
    [junit] 
    [junit] Testsuite: org.apache.cassandra.tools.SSTableExportTest
    [junit] Tests run: 6, Failures: 0, Errors: 0, Time elapsed: 0.933 sec
    [junit] 
    [junit] ------------- Standard Output ---------------
    [junit] Importing 1 keys...
    [junit] 1 keys imported successfully.
    [junit] ------------- ---------------- ---------------
    [junit] Testsuite: org.apache.cassandra.tools.SSTableImportTest
    [junit] Tests run: 5, Failures: 0, Errors: 0, Time elapsed: 0.81 sec
    [junit] 
    [junit] ------------- Standard Output ---------------
    [junit] Importing 2 keys...
    [junit] 2 keys imported successfully.
    [junit] Importing 2 keys...
    [junit] 2 keys imported successfully.
    [junit] Importing 2 keys...
    [junit] 2 keys imported successfully.
    [junit] Importing 3 keys...
    [junit] Importing 3 keys...
    [junit] 1 keys imported successfully.
    [junit] ------------- ---------------- ---------------
    [junit] ------------- Standard Error -----------------
    [junit] Line 2: Key 303630 is greater than previous, collection is not sorted properly.
Aborting import. You might need to delete SSTables manually.
    [junit] ------------- ---------------- ---------------
    [junit] Testsuite: org.apache.cassandra.utils.BloomFilterTest
    [junit] Tests run: 7, Failures: 0, Errors: 0, Time elapsed: 0.528 sec
    [junit] 
    [junit] Testsuite: org.apache.cassandra.utils.BoundedStatsDequeTest
    [junit] Tests run: 1, Failures: 0, Errors: 0, Time elapsed: 0.056 sec
    [junit] 
    [junit] Testsuite: org.apache.cassandra.utils.ByteBufferUtilTest
    [junit] Tests run: 10, Failures: 0, Errors: 0, Time elapsed: 0.085 sec
    [junit] 
    [junit] Testsuite: org.apache.cassandra.utils.BytesReadTrackerTest
    [junit] Tests run: 4, Failures: 0, Errors: 0, Time elapsed: 0.064 sec
    [junit] 
    [junit] Testsuite: org.apache.cassandra.utils.EstimatedHistogramTest
    [junit] Tests run: 4, Failures: 0, Errors: 0, Time elapsed: 0.065 sec
    [junit] 
    [junit] Testsuite: org.apache.cassandra.utils.FBUtilitiesTest
    [junit] Tests run: 3, Failures: 0, Errors: 0, Time elapsed: 0.141 sec
    [junit] 
    [junit] Testsuite: org.apache.cassandra.utils.HexTest
    [junit] Tests run: 2, Failures: 0, Errors: 0, Time elapsed: 0.062 sec
    [junit] 
    [junit] Testsuite: org.apache.cassandra.utils.IntervalTest
    [junit] Tests run: 3, Failures: 0, Errors: 0, Time elapsed: 0.053 sec
    [junit] 
    [junit] Testsuite: org.apache.cassandra.utils.IntervalTreeTest
    [junit] Tests run: 1, Failures: 0, Errors: 0, Time elapsed: 0.149 sec
    [junit] 
    [junit] Testsuite: org.apache.cassandra.utils.LegacyBloomFilterTest
    [junit] Tests run: 6, Failures: 0, Errors: 0, Time elapsed: 0.456 sec
    [junit] 
    [junit] Testsuite: org.apache.cassandra.utils.MergeIteratorTest
    [junit] Tests run: 1, Failures: 0, Errors: 0, Time elapsed: 0.075 sec
    [junit] 
    [junit] Testsuite: org.apache.cassandra.utils.MerkleTreeTest
    [junit] Tests run: 12, Failures: 0, Errors: 0, Time elapsed: 0.457 sec
    [junit] 
    [junit] Testsuite: org.apache.cassandra.utils.SerializationsTest
    [junit] Tests run: 3, Failures: 0, Errors: 0, Time elapsed: 0.907 sec
    [junit] 

BUILD FAILED
<https://builds.apache.org/job/Cassandra/ws/cassandra/build.xml>:1036: The following
error occurred while executing this line:
<https://builds.apache.org/job/Cassandra/ws/cassandra/build.xml>:1022: Some unit test(s)
failed.

Total time: 19 minutes 5 seconds
Build step 'Invoke Ant' marked build as failure
[TASKS] Skipping publisher since build result is FAILURE
Publishing Javadoc
Archiving artifacts
Recording test results


Mime
View raw message