incubator-cassandra-dev mailing list archives

Site index · List index
Message view « Date » · « Thread »
Top « Date » · « Thread »
From Apache Jenkins Server <jenk...@builds.apache.org>
Subject Build failed in Jenkins: Cassandra-quick #50
Date Wed, 05 Oct 2011 20:46:17 GMT
See <https://builds.apache.org/job/Cassandra-quick/50/changes>

Changes:

[jbellis] merge from 1.0

------------------------------------------
[...truncated 1571 lines...]
    [junit] Testsuite: org.apache.cassandra.service.ConsistencyLevelTest
    [junit] Tests run: 1, Failures: 0, Errors: 0, Time elapsed: 1.211 sec
    [junit] 
    [junit] Testsuite: org.apache.cassandra.service.EmbeddedCassandraServiceTest
    [junit] Tests run: 1, Failures: 0, Errors: 0, Time elapsed: 1.389 sec
    [junit] 
    [junit] ------------- Standard Error -----------------
    [junit]  WARN 20:45:06,432 Unable to lock JVM memory (ENOMEM). This can result in part
of the JVM being swapped out, especially with mmapped I/O enabled. Increase RLIMIT_MEMLOCK
or run Cassandra as root.
    [junit]  WARN 20:45:06,949 Generated random token Token(bytes[95678170008c8f24066c8550c5afce57]).
Random tokens will result in an unbalanced ring; see http://wiki.apache.org/cassandra/Operations
    [junit] ------------- ---------------- ---------------
    [junit] Testsuite: org.apache.cassandra.service.InitClientTest
    [junit] Tests run: 1, Failures: 0, Errors: 0, Time elapsed: 0.564 sec
    [junit] 
    [junit] Testsuite: org.apache.cassandra.service.LeaveAndBootstrapTest
    [junit] Tests run: 6, Failures: 0, Errors: 0, Time elapsed: 3.256 sec
    [junit] 
    [junit] ------------- Standard Error -----------------
    [junit]  WARN 20:45:13,184 Node /127.0.0.3 'leaving' token mismatch. Long network partition?
    [junit] ------------- ---------------- ---------------
    [junit] Testsuite: org.apache.cassandra.service.MoveTest
    [junit] Tests run: 3, Failures: 0, Errors: 0, Time elapsed: 2.364 sec
    [junit] 
    [junit] Testsuite: org.apache.cassandra.service.RemoveTest
    [junit] Tests run: 3, Failures: 0, Errors: 0, Time elapsed: 4.758 sec
    [junit] 
    [junit] Testsuite: org.apache.cassandra.service.RowResolverTest
    [junit] Tests run: 8, Failures: 0, Errors: 0, Time elapsed: 0.542 sec
    [junit] 
    [junit] Testsuite: org.apache.cassandra.service.SerializationsTest
    [junit] Tests run: 2, Failures: 0, Errors: 0, Time elapsed: 0.257 sec
    [junit] 
    [junit] Testsuite: org.apache.cassandra.service.StorageProxyTest
    [junit] Tests run: 4, Failures: 0, Errors: 0, Time elapsed: 0.652 sec
    [junit] 
    [junit] Testsuite: org.apache.cassandra.service.StorageServiceClientTest
    [junit] Tests run: 1, Failures: 0, Errors: 0, Time elapsed: 1.682 sec
    [junit] 
    [junit] Testsuite: org.apache.cassandra.service.StorageServiceServerTest
    [junit] Tests run: 3, Failures: 0, Errors: 0, Time elapsed: 1.941 sec
    [junit] 
    [junit] ------------- Standard Error -----------------
    [junit]  WARN 20:45:32,214 Generated random token Token(bytes[34d7ee5a9611fd04ca81f1ccf425df2c]).
Random tokens will result in an unbalanced ring; see http://wiki.apache.org/cassandra/Operations
    [junit] ------------- ---------------- ---------------
    [junit] Testsuite: org.apache.cassandra.streaming.BootstrapTest
    [junit] Tests run: 1, Failures: 0, Errors: 0, Time elapsed: 0.673 sec
    [junit] 
    [junit] Testsuite: org.apache.cassandra.streaming.SerializationsTest
    [junit] Tests run: 4, Failures: 0, Errors: 0, Time elapsed: 0.559 sec
    [junit] 
    [junit] Testsuite: org.apache.cassandra.streaming.StreamingTransferTest
    [junit] Tests run: 5, Failures: 0, Errors: 0, Time elapsed: 1.175 sec
    [junit] 
    [junit] ------------- Standard Error -----------------
    [junit]  WARN 20:45:38,068 Generated random token Token(bytes[3e4c00d87f4868bdf480edea597b5ba6]).
Random tokens will result in an unbalanced ring; see http://wiki.apache.org/cassandra/Operations
    [junit] ------------- ---------------- ---------------
    [junit] Testsuite: org.apache.cassandra.thrift.ThriftValidationTest
    [junit] Tests run: 5, Failures: 0, Errors: 0, Time elapsed: 0.954 sec
    [junit] 
    [junit] Testsuite: org.apache.cassandra.tools.SSTableExportTest
    [junit] Tests run: 6, Failures: 0, Errors: 0, Time elapsed: 1.216 sec
    [junit] 
    [junit] ------------- Standard Output ---------------
    [junit] Importing 1 keys...
    [junit] 1 keys imported successfully.
    [junit] ------------- ---------------- ---------------
    [junit] Testsuite: org.apache.cassandra.tools.SSTableImportTest
    [junit] Tests run: 5, Failures: 0, Errors: 0, Time elapsed: 0.855 sec
    [junit] 
    [junit] ------------- Standard Output ---------------
    [junit] Importing 2 keys...
    [junit] 2 keys imported successfully.
    [junit] Importing 2 keys...
    [junit] 2 keys imported successfully.
    [junit] Importing 2 keys...
    [junit] 2 keys imported successfully.
    [junit] Importing 3 keys...
    [junit] Importing 3 keys...
    [junit] 1 keys imported successfully.
    [junit] ------------- ---------------- ---------------
    [junit] ------------- Standard Error -----------------
    [junit] Line 2: Key 303630 is greater than previous, collection is not sorted properly.
Aborting import. You might need to delete SSTables manually.
    [junit] ------------- ---------------- ---------------
    [junit] Testsuite: org.apache.cassandra.utils.BloomFilterTest
    [junit] Tests run: 7, Failures: 0, Errors: 0, Time elapsed: 0.725 sec
    [junit] 
    [junit] Testsuite: org.apache.cassandra.utils.BoundedStatsDequeTest
    [junit] Tests run: 1, Failures: 0, Errors: 0, Time elapsed: 0.061 sec
    [junit] 
    [junit] Testsuite: org.apache.cassandra.utils.ByteBufferUtilTest
    [junit] Tests run: 10, Failures: 0, Errors: 0, Time elapsed: 0.174 sec
    [junit] 
    [junit] Testsuite: org.apache.cassandra.utils.BytesReadTrackerTest
    [junit] Tests run: 4, Failures: 0, Errors: 0, Time elapsed: 0.061 sec
    [junit] 
    [junit] Testsuite: org.apache.cassandra.utils.EstimatedHistogramTest
    [junit] Tests run: 4, Failures: 0, Errors: 0, Time elapsed: 0.075 sec
    [junit] 
    [junit] Testsuite: org.apache.cassandra.utils.FBUtilitiesTest
    [junit] Tests run: 5, Failures: 0, Errors: 0, Time elapsed: 0.211 sec
    [junit] 
    [junit] Testsuite: org.apache.cassandra.utils.IntervalTest
    [junit] Tests run: 3, Failures: 0, Errors: 0, Time elapsed: 0.092 sec
    [junit] 
    [junit] Testsuite: org.apache.cassandra.utils.IntervalTreeTest
    [junit] Tests run: 1, Failures: 0, Errors: 0, Time elapsed: 0.084 sec
    [junit] 
    [junit] Testsuite: org.apache.cassandra.utils.LegacyBloomFilterTest
    [junit] Tests run: 6, Failures: 0, Errors: 0, Time elapsed: 0.533 sec
    [junit] 
    [junit] Testsuite: org.apache.cassandra.utils.MergeIteratorTest
    [junit] Tests run: 1, Failures: 0, Errors: 0, Time elapsed: 0.102 sec
    [junit] 
    [junit] Testsuite: org.apache.cassandra.utils.MerkleTreeTest
    [junit] Tests run: 12, Failures: 0, Errors: 0, Time elapsed: 0.519 sec
    [junit] 
    [junit] Testsuite: org.apache.cassandra.utils.SerializationsTest
    [junit] Tests run: 3, Failures: 0, Errors: 0, Time elapsed: 0.777 sec
    [junit] 
     [echo] running driverunit tests
    [junit] WARNING: multiple versions of ant detected in path for junit 
    [junit]          jar:file:/home/hudson/tools/ant/latest/lib/ant.jar!/org/apache/tools/ant/Project.class
    [junit]      and jar:<https://builds.apache.org/job/Cassandra-quick/ws/cassandra/build/lib/jars/ant-1.6.5.jar!/org/apache/tools/ant/Project.class>
    [junit] Testsuite: org.apache.cassandra.cql.JdbcDriverTest
    [junit] Tests run: 0, Failures: 0, Errors: 2, Time elapsed: 1.247 sec
    [junit] 
    [junit] ------------- Standard Error -----------------
    [junit]  WARN 20:46:00,686 Unable to lock JVM memory (ENOMEM). This can result in part
of the JVM being swapped out, especially with mmapped I/O enabled. Increase RLIMIT_MEMLOCK
or run Cassandra as root.
    [junit]  WARN 20:46:01,158 Generated random token Token(bytes[68e3808ff1798034cfb811ef6a4c63a6]).
Random tokens will result in an unbalanced ring; see http://wiki.apache.org/cassandra/Operations
    [junit] ------------- ---------------- ---------------
    [junit] Testcase: org.apache.cassandra.cql.JdbcDriverTest:	Caused an ERROR
    [junit] org.apache.cassandra.cql.jdbc.CassandraPreparedStatement cannot be cast to java.lang.Comparable
    [junit] java.lang.ClassCastException: org.apache.cassandra.cql.jdbc.CassandraPreparedStatement
cannot be cast to java.lang.Comparable
    [junit] 	at java.util.concurrent.ConcurrentSkipListMap.comparable(ConcurrentSkipListMap.java:621)
    [junit] 	at java.util.concurrent.ConcurrentSkipListMap.doPut(ConcurrentSkipListMap.java:862)
    [junit] 	at java.util.concurrent.ConcurrentSkipListMap.putIfAbsent(ConcurrentSkipListMap.java:1893)
    [junit] 	at java.util.concurrent.ConcurrentSkipListSet.add(ConcurrentSkipListSet.java:202)
    [junit] 	at org.apache.cassandra.cql.jdbc.CassandraConnection.prepareStatement(CassandraConnection.java:301)
    [junit] 	at org.apache.cassandra.cql.JdbcDriverTest.executeNoResults(JdbcDriverTest.java:506)
    [junit] 	at org.apache.cassandra.cql.JdbcDriverTest.startServer(JdbcDriverTest.java:80)
    [junit] 
    [junit] 
    [junit] Testcase: org.apache.cassandra.cql.JdbcDriverTest:	Caused an ERROR
    [junit] org.apache.cassandra.cql.jdbc.CassandraPreparedStatement cannot be cast to java.lang.Comparable
    [junit] java.lang.ClassCastException: org.apache.cassandra.cql.jdbc.CassandraPreparedStatement
cannot be cast to java.lang.Comparable
    [junit] 	at java.util.concurrent.ConcurrentSkipListMap.comparable(ConcurrentSkipListMap.java:621)
    [junit] 	at java.util.concurrent.ConcurrentSkipListMap.doPut(ConcurrentSkipListMap.java:862)
    [junit] 	at java.util.concurrent.ConcurrentSkipListMap.putIfAbsent(ConcurrentSkipListMap.java:1893)
    [junit] 	at java.util.concurrent.ConcurrentSkipListSet.add(ConcurrentSkipListSet.java:202)
    [junit] 	at org.apache.cassandra.cql.jdbc.CassandraConnection.prepareStatement(CassandraConnection.java:301)
    [junit] 	at org.apache.cassandra.cql.JdbcDriverTest.executeNoResults(JdbcDriverTest.java:506)
    [junit] 	at org.apache.cassandra.cql.JdbcDriverTest.stopServer(JdbcDriverTest.java:426)
    [junit] 
    [junit] 
    [junit] Test org.apache.cassandra.cql.JdbcDriverTest FAILED
    [junit] Testsuite: org.apache.cassandra.cql.jdbc.DataSourceTest
    [junit] Tests run: 3, Failures: 0, Errors: 0, Time elapsed: 1.179 sec
    [junit] 
    [junit] ------------- Standard Error -----------------
    [junit]  WARN 20:46:03,375 Unable to lock JVM memory (ENOMEM). This can result in part
of the JVM being swapped out, especially with mmapped I/O enabled. Increase RLIMIT_MEMLOCK
or run Cassandra as root.
    [junit]  WARN 20:46:03,792 Generated random token Token(bytes[351cb6c4dfbdf262cebfb44320bb34e0]).
Random tokens will result in an unbalanced ring; see http://wiki.apache.org/cassandra/Operations
    [junit] DriverManager.getConnection("jdbc:cassandra://localhost:9170/Test")
    [junit]     trying driver[className=sun.jdbc.odbc.JdbcOdbcDriver,sun.jdbc.odbc.JdbcOdbcDriver@1c8b24d]
    [junit] *Driver.connect (jdbc:cassandra://localhost:9170/Test)
    [junit]     trying driver[className=org.apache.cassandra.cql.jdbc.CassandraDriver,org.apache.cassandra.cql.jdbc.CassandraDriver@1320a41]
    [junit] getConnection returning driver[className=org.apache.cassandra.cql.jdbc.CassandraDriver,org.apache.cassandra.cql.jdbc.CassandraDriver@1320a41]
    [junit] ------------- ---------------- ---------------
    [junit] Testsuite: org.apache.cassandra.cql.jdbc.PreparedStatementTest
    [junit] Tests run: 6, Failures: 0, Errors: 6, Time elapsed: 1.319 sec
    [junit] 
    [junit] ------------- Standard Error -----------------
    [junit]  WARN 20:46:06,120 Unable to lock JVM memory (ENOMEM). This can result in part
of the JVM being swapped out, especially with mmapped I/O enabled. Increase RLIMIT_MEMLOCK
or run Cassandra as root.
    [junit]  WARN 20:46:06,660 Generated random token Token(bytes[026fd43307bbd8f2626c079fa04d09ad]).
Random tokens will result in an unbalanced ring; see http://wiki.apache.org/cassandra/Operations
    [junit] ------------- ---------------- ---------------
    [junit] Testcase: testBytes(org.apache.cassandra.cql.jdbc.PreparedStatementTest):	Caused
an ERROR
    [junit] org.apache.cassandra.cql.jdbc.CassandraPreparedStatement cannot be cast to java.lang.Comparable
    [junit] java.lang.ClassCastException: org.apache.cassandra.cql.jdbc.CassandraPreparedStatement
cannot be cast to java.lang.Comparable
    [junit] 	at java.util.concurrent.ConcurrentSkipListMap.comparable(ConcurrentSkipListMap.java:621)
    [junit] 	at java.util.concurrent.ConcurrentSkipListMap.doPut(ConcurrentSkipListMap.java:862)
    [junit] 	at java.util.concurrent.ConcurrentSkipListMap.putIfAbsent(ConcurrentSkipListMap.java:1893)
    [junit] 	at java.util.concurrent.ConcurrentSkipListSet.add(ConcurrentSkipListSet.java:202)
    [junit] 	at org.apache.cassandra.cql.jdbc.CassandraConnection.prepareStatement(CassandraConnection.java:301)
    [junit] 	at org.apache.cassandra.cql.jdbc.PreparedStatementTest.testBytes(PreparedStatementTest.java:54)
    [junit] 
    [junit] 
    [junit] Testcase: testUtf8(org.apache.cassandra.cql.jdbc.PreparedStatementTest):	Caused
an ERROR
    [junit] org.apache.cassandra.cql.jdbc.CassandraPreparedStatement cannot be cast to java.lang.Comparable
    [junit] java.lang.ClassCastException: org.apache.cassandra.cql.jdbc.CassandraPreparedStatement
cannot be cast to java.lang.Comparable
    [junit] 	at java.util.concurrent.ConcurrentSkipListMap.comparable(ConcurrentSkipListMap.java:621)
    [junit] 	at java.util.concurrent.ConcurrentSkipListMap.doPut(ConcurrentSkipListMap.java:862)
    [junit] 	at java.util.concurrent.ConcurrentSkipListMap.putIfAbsent(ConcurrentSkipListMap.java:1893)
    [junit] 	at java.util.concurrent.ConcurrentSkipListSet.add(ConcurrentSkipListSet.java:202)
    [junit] 	at org.apache.cassandra.cql.jdbc.CassandraConnection.prepareStatement(CassandraConnection.java:301)
    [junit] 	at org.apache.cassandra.cql.jdbc.PreparedStatementTest.testUtf8(PreparedStatementTest.java:114)
    [junit] 
    [junit] 
    [junit] Testcase: testAscii(org.apache.cassandra.cql.jdbc.PreparedStatementTest):	Caused
an ERROR
    [junit] org.apache.cassandra.cql.jdbc.CassandraPreparedStatement cannot be cast to java.lang.Comparable
    [junit] java.lang.ClassCastException: org.apache.cassandra.cql.jdbc.CassandraPreparedStatement
cannot be cast to java.lang.Comparable
    [junit] 	at java.util.concurrent.ConcurrentSkipListMap.comparable(ConcurrentSkipListMap.java:621)
    [junit] 	at java.util.concurrent.ConcurrentSkipListMap.doPut(ConcurrentSkipListMap.java:862)
    [junit] 	at java.util.concurrent.ConcurrentSkipListMap.putIfAbsent(ConcurrentSkipListMap.java:1893)
    [junit] 	at java.util.concurrent.ConcurrentSkipListSet.add(ConcurrentSkipListSet.java:202)
    [junit] 	at org.apache.cassandra.cql.jdbc.CassandraConnection.prepareStatement(CassandraConnection.java:301)
    [junit] 	at org.apache.cassandra.cql.jdbc.PreparedStatementTest.testAscii(PreparedStatementTest.java:174)
    [junit] 
    [junit] 
    [junit] Testcase: testLong(org.apache.cassandra.cql.jdbc.PreparedStatementTest):	Caused
an ERROR
    [junit] org.apache.cassandra.cql.jdbc.CassandraPreparedStatement cannot be cast to java.lang.Comparable
    [junit] java.lang.ClassCastException: org.apache.cassandra.cql.jdbc.CassandraPreparedStatement
cannot be cast to java.lang.Comparable
    [junit] 	at java.util.concurrent.ConcurrentSkipListMap.comparable(ConcurrentSkipListMap.java:621)
    [junit] 	at java.util.concurrent.ConcurrentSkipListMap.doPut(ConcurrentSkipListMap.java:862)
    [junit] 	at java.util.concurrent.ConcurrentSkipListMap.putIfAbsent(ConcurrentSkipListMap.java:1893)
    [junit] 	at java.util.concurrent.ConcurrentSkipListSet.add(ConcurrentSkipListSet.java:202)
    [junit] 	at org.apache.cassandra.cql.jdbc.CassandraConnection.prepareStatement(CassandraConnection.java:301)
    [junit] 	at org.apache.cassandra.cql.jdbc.PreparedStatementTest.testLong(PreparedStatementTest.java:233)
    [junit] 
    [junit] 
    [junit] Testcase: testInteger(org.apache.cassandra.cql.jdbc.PreparedStatementTest):	Caused
an ERROR
    [junit] org.apache.cassandra.cql.jdbc.CassandraPreparedStatement cannot be cast to java.lang.Comparable
    [junit] java.lang.ClassCastException: org.apache.cassandra.cql.jdbc.CassandraPreparedStatement
cannot be cast to java.lang.Comparable
    [junit] 	at java.util.concurrent.ConcurrentSkipListMap.comparable(ConcurrentSkipListMap.java:621)
    [junit] 	at java.util.concurrent.ConcurrentSkipListMap.doPut(ConcurrentSkipListMap.java:862)
    [junit] 	at java.util.concurrent.ConcurrentSkipListMap.putIfAbsent(ConcurrentSkipListMap.java:1893)
    [junit] 	at java.util.concurrent.ConcurrentSkipListSet.add(ConcurrentSkipListSet.java:202)
    [junit] 	at org.apache.cassandra.cql.jdbc.CassandraConnection.prepareStatement(CassandraConnection.java:301)
    [junit] 	at org.apache.cassandra.cql.jdbc.PreparedStatementTest.testInteger(PreparedStatementTest.java:294)
    [junit] 
    [junit] 
    [junit] Testcase: testParamSubstitution(org.apache.cassandra.cql.jdbc.PreparedStatementTest):
Caused an ERROR
    [junit] org.apache.cassandra.cql.jdbc.CassandraPreparedStatement cannot be cast to java.lang.Comparable
    [junit] java.lang.ClassCastException: org.apache.cassandra.cql.jdbc.CassandraPreparedStatement
cannot be cast to java.lang.Comparable
    [junit] 	at java.util.concurrent.ConcurrentSkipListMap.comparable(ConcurrentSkipListMap.java:621)
    [junit] 	at java.util.concurrent.ConcurrentSkipListMap.doPut(ConcurrentSkipListMap.java:862)
    [junit] 	at java.util.concurrent.ConcurrentSkipListMap.putIfAbsent(ConcurrentSkipListMap.java:1893)
    [junit] 	at java.util.concurrent.ConcurrentSkipListSet.add(ConcurrentSkipListSet.java:202)
    [junit] 	at org.apache.cassandra.cql.jdbc.CassandraConnection.prepareStatement(CassandraConnection.java:301)
    [junit] 	at org.apache.cassandra.cql.jdbc.PreparedStatementTest.testParamSubstitution(PreparedStatementTest.java:357)
    [junit] 
    [junit] 
    [junit] Test org.apache.cassandra.cql.jdbc.PreparedStatementTest FAILED

BUILD FAILED
<https://builds.apache.org/job/Cassandra-quick/ws/cassandra/build.xml>:1086: The following
error occurred while executing this line:
<https://builds.apache.org/job/Cassandra-quick/ws/cassandra/build.xml>:1068: Some driverunit
test(s) failed.

Total time: 4 minutes 48 seconds
Build step 'Invoke Ant' marked build as failure
[TASKS] Skipping publisher since build result is FAILURE
Recording test results


Mime
View raw message