incubator-cassandra-dev mailing list archives

Site index · List index
Message view « Date » · « Thread »
Top « Date » · « Thread »
From Apache Jenkins Server <jenk...@builds.apache.org>
Subject Build failed in Jenkins: Cassandra-quick #49
Date Wed, 05 Oct 2011 20:15:27 GMT
See <https://builds.apache.org/job/Cassandra-quick/49/changes>

Changes:

[jbellis] remove statements from connection's list, when closed manually
patch by Rick Shaw; reviewed by Patricio Echague and jbellis for CASSANDRA-3244

------------------------------------------
[...truncated 1570 lines...]
    [junit] Testsuite: org.apache.cassandra.service.ConsistencyLevelTest
    [junit] Tests run: 1, Failures: 0, Errors: 0, Time elapsed: 3.044 sec
    [junit] 
    [junit] Testsuite: org.apache.cassandra.service.EmbeddedCassandraServiceTest
    [junit] Tests run: 1, Failures: 0, Errors: 0, Time elapsed: 2.04 sec
    [junit] 
    [junit] ------------- Standard Error -----------------
    [junit]  WARN 20:13:40,238 Unable to lock JVM memory (ENOMEM). This can result in part
of the JVM being swapped out, especially with mmapped I/O enabled. Increase RLIMIT_MEMLOCK
or run Cassandra as root.
    [junit]  WARN 20:13:41,438 Generated random token Token(bytes[482f194cebb7b885107ad2e225de7943]).
Random tokens will result in an unbalanced ring; see http://wiki.apache.org/cassandra/Operations
    [junit] ------------- ---------------- ---------------
    [junit] Testsuite: org.apache.cassandra.service.InitClientTest
    [junit] Tests run: 1, Failures: 0, Errors: 0, Time elapsed: 0.712 sec
    [junit] 
    [junit] Testsuite: org.apache.cassandra.service.LeaveAndBootstrapTest
    [junit] Tests run: 6, Failures: 0, Errors: 0, Time elapsed: 18.103 sec
    [junit] 
    [junit] ------------- Standard Error -----------------
    [junit]  WARN 20:13:59,283 Node /127.0.0.3 'leaving' token mismatch. Long network partition?
    [junit] ------------- ---------------- ---------------
    [junit] Testsuite: org.apache.cassandra.service.MoveTest
    [junit] Tests run: 3, Failures: 0, Errors: 0, Time elapsed: 8.981 sec
    [junit] 
    [junit] Testsuite: org.apache.cassandra.service.RemoveTest
    [junit] Tests run: 3, Failures: 0, Errors: 0, Time elapsed: 9.626 sec
    [junit] 
    [junit] Testsuite: org.apache.cassandra.service.RowResolverTest
    [junit] Tests run: 8, Failures: 0, Errors: 0, Time elapsed: 0.453 sec
    [junit] 
    [junit] Testsuite: org.apache.cassandra.service.SerializationsTest
    [junit] Tests run: 2, Failures: 0, Errors: 0, Time elapsed: 0.174 sec
    [junit] 
    [junit] Testsuite: org.apache.cassandra.service.StorageProxyTest
    [junit] Tests run: 4, Failures: 0, Errors: 0, Time elapsed: 0.462 sec
    [junit] 
    [junit] Testsuite: org.apache.cassandra.service.StorageServiceClientTest
    [junit] Tests run: 1, Failures: 0, Errors: 0, Time elapsed: 1.5 sec
    [junit] 
    [junit] Testsuite: org.apache.cassandra.service.StorageServiceServerTest
    [junit] Tests run: 3, Failures: 0, Errors: 0, Time elapsed: 2.66 sec
    [junit] 
    [junit] ------------- Standard Error -----------------
    [junit]  WARN 20:14:32,114 Generated random token Token(bytes[58c1b72d0921f04c542ccf2c671a66c7]).
Random tokens will result in an unbalanced ring; see http://wiki.apache.org/cassandra/Operations
    [junit] ------------- ---------------- ---------------
    [junit] Testsuite: org.apache.cassandra.streaming.BootstrapTest
    [junit] Tests run: 1, Failures: 0, Errors: 0, Time elapsed: 0.638 sec
    [junit] 
    [junit] Testsuite: org.apache.cassandra.streaming.SerializationsTest
    [junit] Tests run: 4, Failures: 0, Errors: 0, Time elapsed: 0.473 sec
    [junit] 
    [junit] Testsuite: org.apache.cassandra.streaming.StreamingTransferTest
    [junit] Tests run: 5, Failures: 0, Errors: 0, Time elapsed: 7.924 sec
    [junit] 
    [junit] ------------- Standard Error -----------------
    [junit]  WARN 20:14:38,351 Generated random token Token(bytes[ac50160f79d7d8f13f7648d49b8ae206]).
Random tokens will result in an unbalanced ring; see http://wiki.apache.org/cassandra/Operations
    [junit] ------------- ---------------- ---------------
    [junit] Testsuite: org.apache.cassandra.thrift.ThriftValidationTest
    [junit] Tests run: 5, Failures: 0, Errors: 0, Time elapsed: 0.923 sec
    [junit] 
    [junit] Testsuite: org.apache.cassandra.tools.SSTableExportTest
    [junit] Tests run: 6, Failures: 0, Errors: 0, Time elapsed: 2.87 sec
    [junit] 
    [junit] ------------- Standard Output ---------------
    [junit] Importing 1 keys...
    [junit] 1 keys imported successfully.
    [junit] ------------- ---------------- ---------------
    [junit] Testsuite: org.apache.cassandra.tools.SSTableImportTest
    [junit] Tests run: 5, Failures: 0, Errors: 0, Time elapsed: 2.205 sec
    [junit] 
    [junit] ------------- Standard Output ---------------
    [junit] Importing 2 keys...
    [junit] 2 keys imported successfully.
    [junit] Importing 2 keys...
    [junit] 2 keys imported successfully.
    [junit] Importing 2 keys...
    [junit] 2 keys imported successfully.
    [junit] Importing 3 keys...
    [junit] Importing 3 keys...
    [junit] 1 keys imported successfully.
    [junit] ------------- ---------------- ---------------
    [junit] ------------- Standard Error -----------------
    [junit] Line 2: Key 303630 is greater than previous, collection is not sorted properly.
Aborting import. You might need to delete SSTables manually.
    [junit] ------------- ---------------- ---------------
    [junit] Testsuite: org.apache.cassandra.utils.BloomFilterTest
    [junit] Tests run: 7, Failures: 0, Errors: 0, Time elapsed: 0.792 sec
    [junit] 
    [junit] Testsuite: org.apache.cassandra.utils.BoundedStatsDequeTest
    [junit] Tests run: 1, Failures: 0, Errors: 0, Time elapsed: 0.062 sec
    [junit] 
    [junit] Testsuite: org.apache.cassandra.utils.ByteBufferUtilTest
    [junit] Tests run: 10, Failures: 0, Errors: 0, Time elapsed: 0.166 sec
    [junit] 
    [junit] Testsuite: org.apache.cassandra.utils.BytesReadTrackerTest
    [junit] Tests run: 4, Failures: 0, Errors: 0, Time elapsed: 0.06 sec
    [junit] 
    [junit] Testsuite: org.apache.cassandra.utils.EstimatedHistogramTest
    [junit] Tests run: 4, Failures: 0, Errors: 0, Time elapsed: 0.067 sec
    [junit] 
    [junit] Testsuite: org.apache.cassandra.utils.FBUtilitiesTest
    [junit] Tests run: 5, Failures: 0, Errors: 0, Time elapsed: 0.149 sec
    [junit] 
    [junit] Testsuite: org.apache.cassandra.utils.IntervalTest
    [junit] Tests run: 3, Failures: 0, Errors: 0, Time elapsed: 0.065 sec
    [junit] 
    [junit] Testsuite: org.apache.cassandra.utils.IntervalTreeTest
    [junit] Tests run: 1, Failures: 0, Errors: 0, Time elapsed: 0.072 sec
    [junit] 
    [junit] Testsuite: org.apache.cassandra.utils.LegacyBloomFilterTest
    [junit] Tests run: 6, Failures: 0, Errors: 0, Time elapsed: 0.718 sec
    [junit] 
    [junit] Testsuite: org.apache.cassandra.utils.MergeIteratorTest
    [junit] Tests run: 1, Failures: 0, Errors: 0, Time elapsed: 0.075 sec
    [junit] 
    [junit] Testsuite: org.apache.cassandra.utils.MerkleTreeTest
    [junit] Tests run: 12, Failures: 0, Errors: 0, Time elapsed: 0.45 sec
    [junit] 
    [junit] Testsuite: org.apache.cassandra.utils.SerializationsTest
    [junit] Tests run: 3, Failures: 0, Errors: 0, Time elapsed: 0.838 sec
    [junit] 
     [echo] running driverunit tests
    [junit] WARNING: multiple versions of ant detected in path for junit 
    [junit]          jar:file:/home/hudson/tools/ant/latest/lib/ant.jar!/org/apache/tools/ant/Project.class
    [junit]      and jar:<https://builds.apache.org/job/Cassandra-quick/ws/cassandra/build/lib/jars/ant-1.6.5.jar!/org/apache/tools/ant/Project.class>
    [junit] Testsuite: org.apache.cassandra.cql.JdbcDriverTest
    [junit] Tests run: 0, Failures: 0, Errors: 2, Time elapsed: 1.898 sec
    [junit] 
    [junit] ------------- Standard Error -----------------
    [junit]  WARN 20:15:08,615 Unable to lock JVM memory (ENOMEM). This can result in part
of the JVM being swapped out, especially with mmapped I/O enabled. Increase RLIMIT_MEMLOCK
or run Cassandra as root.
    [junit]  WARN 20:15:09,443 Generated random token Token(bytes[829c831cc2782713f80d0b2f7b8ae8ee]).
Random tokens will result in an unbalanced ring; see http://wiki.apache.org/cassandra/Operations
    [junit] ------------- ---------------- ---------------
    [junit] Testcase: org.apache.cassandra.cql.JdbcDriverTest:	Caused an ERROR
    [junit] org.apache.cassandra.cql.jdbc.CassandraPreparedStatement cannot be cast to java.lang.Comparable
    [junit] java.lang.ClassCastException: org.apache.cassandra.cql.jdbc.CassandraPreparedStatement
cannot be cast to java.lang.Comparable
    [junit] 	at java.util.concurrent.ConcurrentSkipListMap.comparable(ConcurrentSkipListMap.java:621)
    [junit] 	at java.util.concurrent.ConcurrentSkipListMap.doPut(ConcurrentSkipListMap.java:862)
    [junit] 	at java.util.concurrent.ConcurrentSkipListMap.putIfAbsent(ConcurrentSkipListMap.java:1893)
    [junit] 	at java.util.concurrent.ConcurrentSkipListSet.add(ConcurrentSkipListSet.java:202)
    [junit] 	at org.apache.cassandra.cql.jdbc.CassandraConnection.prepareStatement(CassandraConnection.java:301)
    [junit] 	at org.apache.cassandra.cql.JdbcDriverTest.executeNoResults(JdbcDriverTest.java:506)
    [junit] 	at org.apache.cassandra.cql.JdbcDriverTest.startServer(JdbcDriverTest.java:80)
    [junit] 
    [junit] 
    [junit] Testcase: org.apache.cassandra.cql.JdbcDriverTest:	Caused an ERROR
    [junit] org.apache.cassandra.cql.jdbc.CassandraPreparedStatement cannot be cast to java.lang.Comparable
    [junit] java.lang.ClassCastException: org.apache.cassandra.cql.jdbc.CassandraPreparedStatement
cannot be cast to java.lang.Comparable
    [junit] 	at java.util.concurrent.ConcurrentSkipListMap.comparable(ConcurrentSkipListMap.java:621)
    [junit] 	at java.util.concurrent.ConcurrentSkipListMap.doPut(ConcurrentSkipListMap.java:862)
    [junit] 	at java.util.concurrent.ConcurrentSkipListMap.putIfAbsent(ConcurrentSkipListMap.java:1893)
    [junit] 	at java.util.concurrent.ConcurrentSkipListSet.add(ConcurrentSkipListSet.java:202)
    [junit] 	at org.apache.cassandra.cql.jdbc.CassandraConnection.prepareStatement(CassandraConnection.java:301)
    [junit] 	at org.apache.cassandra.cql.JdbcDriverTest.executeNoResults(JdbcDriverTest.java:506)
    [junit] 	at org.apache.cassandra.cql.JdbcDriverTest.stopServer(JdbcDriverTest.java:426)
    [junit] 
    [junit] 
    [junit] Test org.apache.cassandra.cql.JdbcDriverTest FAILED
    [junit] Testsuite: org.apache.cassandra.cql.jdbc.DataSourceTest
    [junit] Tests run: 3, Failures: 0, Errors: 0, Time elapsed: 2.055 sec
    [junit] 
    [junit] ------------- Standard Error -----------------
    [junit]  WARN 20:15:11,822 Unable to lock JVM memory (ENOMEM). This can result in part
of the JVM being swapped out, especially with mmapped I/O enabled. Increase RLIMIT_MEMLOCK
or run Cassandra as root.
    [junit]  WARN 20:15:12,923 Generated random token Token(bytes[7cb6b1fa0a50afb34fc679b056ef8ab3]).
Random tokens will result in an unbalanced ring; see http://wiki.apache.org/cassandra/Operations
    [junit] DriverManager.getConnection("jdbc:cassandra://localhost:9170/Test")
    [junit]     trying driver[className=sun.jdbc.odbc.JdbcOdbcDriver,sun.jdbc.odbc.JdbcOdbcDriver@51ef4e]
    [junit] *Driver.connect (jdbc:cassandra://localhost:9170/Test)
    [junit]     trying driver[className=org.apache.cassandra.cql.jdbc.CassandraDriver,org.apache.cassandra.cql.jdbc.CassandraDriver@135f44e]
    [junit] getConnection returning driver[className=org.apache.cassandra.cql.jdbc.CassandraDriver,org.apache.cassandra.cql.jdbc.CassandraDriver@135f44e]
    [junit] ------------- ---------------- ---------------
    [junit] Testsuite: org.apache.cassandra.cql.jdbc.PreparedStatementTest
    [junit] Tests run: 6, Failures: 0, Errors: 6, Time elapsed: 2.164 sec
    [junit] 
    [junit] ------------- Standard Error -----------------
    [junit]  WARN 20:15:15,137 Unable to lock JVM memory (ENOMEM). This can result in part
of the JVM being swapped out, especially with mmapped I/O enabled. Increase RLIMIT_MEMLOCK
or run Cassandra as root.
    [junit]  WARN 20:15:16,471 Generated random token Token(bytes[ff185dc019b1823287772c5847e3d541]).
Random tokens will result in an unbalanced ring; see http://wiki.apache.org/cassandra/Operations
    [junit] ------------- ---------------- ---------------
    [junit] Testcase: testBytes(org.apache.cassandra.cql.jdbc.PreparedStatementTest):	Caused
an ERROR
    [junit] org.apache.cassandra.cql.jdbc.CassandraPreparedStatement cannot be cast to java.lang.Comparable
    [junit] java.lang.ClassCastException: org.apache.cassandra.cql.jdbc.CassandraPreparedStatement
cannot be cast to java.lang.Comparable
    [junit] 	at java.util.concurrent.ConcurrentSkipListMap.comparable(ConcurrentSkipListMap.java:621)
    [junit] 	at java.util.concurrent.ConcurrentSkipListMap.doPut(ConcurrentSkipListMap.java:862)
    [junit] 	at java.util.concurrent.ConcurrentSkipListMap.putIfAbsent(ConcurrentSkipListMap.java:1893)
    [junit] 	at java.util.concurrent.ConcurrentSkipListSet.add(ConcurrentSkipListSet.java:202)
    [junit] 	at org.apache.cassandra.cql.jdbc.CassandraConnection.prepareStatement(CassandraConnection.java:301)
    [junit] 	at org.apache.cassandra.cql.jdbc.PreparedStatementTest.testBytes(PreparedStatementTest.java:54)
    [junit] 
    [junit] 
    [junit] Testcase: testUtf8(org.apache.cassandra.cql.jdbc.PreparedStatementTest):	Caused
an ERROR
    [junit] org.apache.cassandra.cql.jdbc.CassandraPreparedStatement cannot be cast to java.lang.Comparable
    [junit] java.lang.ClassCastException: org.apache.cassandra.cql.jdbc.CassandraPreparedStatement
cannot be cast to java.lang.Comparable
    [junit] 	at java.util.concurrent.ConcurrentSkipListMap.comparable(ConcurrentSkipListMap.java:621)
    [junit] 	at java.util.concurrent.ConcurrentSkipListMap.doPut(ConcurrentSkipListMap.java:862)
    [junit] 	at java.util.concurrent.ConcurrentSkipListMap.putIfAbsent(ConcurrentSkipListMap.java:1893)
    [junit] 	at java.util.concurrent.ConcurrentSkipListSet.add(ConcurrentSkipListSet.java:202)
    [junit] 	at org.apache.cassandra.cql.jdbc.CassandraConnection.prepareStatement(CassandraConnection.java:301)
    [junit] 	at org.apache.cassandra.cql.jdbc.PreparedStatementTest.testUtf8(PreparedStatementTest.java:114)
    [junit] 
    [junit] 
    [junit] Testcase: testAscii(org.apache.cassandra.cql.jdbc.PreparedStatementTest):	Caused
an ERROR
    [junit] org.apache.cassandra.cql.jdbc.CassandraPreparedStatement cannot be cast to java.lang.Comparable
    [junit] java.lang.ClassCastException: org.apache.cassandra.cql.jdbc.CassandraPreparedStatement
cannot be cast to java.lang.Comparable
    [junit] 	at java.util.concurrent.ConcurrentSkipListMap.comparable(ConcurrentSkipListMap.java:621)
    [junit] 	at java.util.concurrent.ConcurrentSkipListMap.doPut(ConcurrentSkipListMap.java:862)
    [junit] 	at java.util.concurrent.ConcurrentSkipListMap.putIfAbsent(ConcurrentSkipListMap.java:1893)
    [junit] 	at java.util.concurrent.ConcurrentSkipListSet.add(ConcurrentSkipListSet.java:202)
    [junit] 	at org.apache.cassandra.cql.jdbc.CassandraConnection.prepareStatement(CassandraConnection.java:301)
    [junit] 	at org.apache.cassandra.cql.jdbc.PreparedStatementTest.testAscii(PreparedStatementTest.java:174)
    [junit] 
    [junit] 
    [junit] Testcase: testLong(org.apache.cassandra.cql.jdbc.PreparedStatementTest):	Caused
an ERROR
    [junit] org.apache.cassandra.cql.jdbc.CassandraPreparedStatement cannot be cast to java.lang.Comparable
    [junit] java.lang.ClassCastException: org.apache.cassandra.cql.jdbc.CassandraPreparedStatement
cannot be cast to java.lang.Comparable
    [junit] 	at java.util.concurrent.ConcurrentSkipListMap.comparable(ConcurrentSkipListMap.java:621)
    [junit] 	at java.util.concurrent.ConcurrentSkipListMap.doPut(ConcurrentSkipListMap.java:862)
    [junit] 	at java.util.concurrent.ConcurrentSkipListMap.putIfAbsent(ConcurrentSkipListMap.java:1893)
    [junit] 	at java.util.concurrent.ConcurrentSkipListSet.add(ConcurrentSkipListSet.java:202)
    [junit] 	at org.apache.cassandra.cql.jdbc.CassandraConnection.prepareStatement(CassandraConnection.java:301)
    [junit] 	at org.apache.cassandra.cql.jdbc.PreparedStatementTest.testLong(PreparedStatementTest.java:233)
    [junit] 
    [junit] 
    [junit] Testcase: testInteger(org.apache.cassandra.cql.jdbc.PreparedStatementTest):	Caused
an ERROR
    [junit] org.apache.cassandra.cql.jdbc.CassandraPreparedStatement cannot be cast to java.lang.Comparable
    [junit] java.lang.ClassCastException: org.apache.cassandra.cql.jdbc.CassandraPreparedStatement
cannot be cast to java.lang.Comparable
    [junit] 	at java.util.concurrent.ConcurrentSkipListMap.comparable(ConcurrentSkipListMap.java:621)
    [junit] 	at java.util.concurrent.ConcurrentSkipListMap.doPut(ConcurrentSkipListMap.java:862)
    [junit] 	at java.util.concurrent.ConcurrentSkipListMap.putIfAbsent(ConcurrentSkipListMap.java:1893)
    [junit] 	at java.util.concurrent.ConcurrentSkipListSet.add(ConcurrentSkipListSet.java:202)
    [junit] 	at org.apache.cassandra.cql.jdbc.CassandraConnection.prepareStatement(CassandraConnection.java:301)
    [junit] 	at org.apache.cassandra.cql.jdbc.PreparedStatementTest.testInteger(PreparedStatementTest.java:294)
    [junit] 
    [junit] 
    [junit] Testcase: testParamSubstitution(org.apache.cassandra.cql.jdbc.PreparedStatementTest):
Caused an ERROR
    [junit] org.apache.cassandra.cql.jdbc.CassandraPreparedStatement cannot be cast to java.lang.Comparable
    [junit] java.lang.ClassCastException: org.apache.cassandra.cql.jdbc.CassandraPreparedStatement
cannot be cast to java.lang.Comparable
    [junit] 	at java.util.concurrent.ConcurrentSkipListMap.comparable(ConcurrentSkipListMap.java:621)
    [junit] 	at java.util.concurrent.ConcurrentSkipListMap.doPut(ConcurrentSkipListMap.java:862)
    [junit] 	at java.util.concurrent.ConcurrentSkipListMap.putIfAbsent(ConcurrentSkipListMap.java:1893)
    [junit] 	at java.util.concurrent.ConcurrentSkipListSet.add(ConcurrentSkipListSet.java:202)
    [junit] 	at org.apache.cassandra.cql.jdbc.CassandraConnection.prepareStatement(CassandraConnection.java:301)
    [junit] 	at org.apache.cassandra.cql.jdbc.PreparedStatementTest.testParamSubstitution(PreparedStatementTest.java:357)
    [junit] 
    [junit] 
    [junit] Test org.apache.cassandra.cql.jdbc.PreparedStatementTest FAILED

BUILD FAILED
<https://builds.apache.org/job/Cassandra-quick/ws/cassandra/build.xml>:1086: The following
error occurred while executing this line:
<https://builds.apache.org/job/Cassandra-quick/ws/cassandra/build.xml>:1068: Some driverunit
test(s) failed.

Total time: 8 minutes 18 seconds
Build step 'Invoke Ant' marked build as failure
[TASKS] Skipping publisher since build result is FAILURE
Recording test results


Mime
View raw message