incubator-cassandra-dev mailing list archives

Site index · List index
Message view « Date » · « Thread »
Top « Date » · « Thread »
From Apache Jenkins Server <jenk...@builds.apache.org>
Subject Build failed in Jenkins: Cassandra #1136
Date Mon, 03 Oct 2011 09:27:50 GMT
See <https://builds.apache.org/job/Cassandra/1136/changes>

Changes:

[slebresne] merge from 1.0

------------------------------------------
[...truncated 2100 lines...]
    [junit] 
    [junit] Testsuite: org.apache.cassandra.db.migration.SerializationsTest
    [junit] Tests run: 1, Failures: 0, Errors: 0, Time elapsed: 0.683 sec
    [junit] 
    [junit] Testsuite: org.apache.cassandra.dht.AbstractBoundsTest
    [junit] Tests run: 5, Failures: 0, Errors: 0, Time elapsed: 0.433 sec
    [junit] 
    [junit] Testsuite: org.apache.cassandra.dht.BootStrapperTest
    [junit] Tests run: 4, Failures: 0, Errors: 1, Time elapsed: 3.742 sec
    [junit] 
    [junit] Testcase: testTokenRoundtrip(org.apache.cassandra.dht.BootStrapperTest):	Caused
an ERROR
    [junit] /127.0.0.1:7010 is in use by another process.  Change listen_address:storage_port
in cassandra.yaml to values that do not conflict with other services
    [junit] org.apache.cassandra.config.ConfigurationException: /127.0.0.1:7010 is in use
by another process.  Change listen_address:storage_port in cassandra.yaml to values that do
not conflict with other services
    [junit] 	at org.apache.cassandra.net.MessagingService.getServerSocket(MessagingService.java:266)
    [junit] 	at org.apache.cassandra.net.MessagingService.listen(MessagingService.java:239)
    [junit] 	at org.apache.cassandra.service.StorageService.joinTokenRing(StorageService.java:483)
    [junit] 	at org.apache.cassandra.service.StorageService.initServer(StorageService.java:460)
    [junit] 	at org.apache.cassandra.dht.BootStrapperTest.testTokenRoundtrip(BootStrapperTest.java:49)
    [junit] 
    [junit] 
    [junit] Test org.apache.cassandra.dht.BootStrapperTest FAILED
    [junit] Testsuite: org.apache.cassandra.dht.ByteOrderedPartitionerTest
    [junit] Tests run: 5, Failures: 0, Errors: 0, Time elapsed: 1.177 sec
    [junit] 
    [junit] Testsuite: org.apache.cassandra.dht.CollatingOrderPreservingPartitionerTest
    [junit] Tests run: 7, Failures: 0, Errors: 0, Time elapsed: 1.49 sec
    [junit] 
    [junit] Testsuite: org.apache.cassandra.dht.OrderPreservingPartitionerTest
    [junit] Tests run: 6, Failures: 0, Errors: 0, Time elapsed: 1.192 sec
    [junit] 
    [junit] Testsuite: org.apache.cassandra.dht.RandomPartitionerTest
    [junit] Tests run: 5, Failures: 0, Errors: 0, Time elapsed: 0.814 sec
    [junit] 
    [junit] Testsuite: org.apache.cassandra.dht.RangeTest
    [junit] Tests run: 17, Failures: 0, Errors: 0, Time elapsed: 0.435 sec
    [junit] 
    [junit] Testsuite: org.apache.cassandra.gms.ArrivalWindowTest
    [junit] Tests run: 1, Failures: 0, Errors: 0, Time elapsed: 0.128 sec
    [junit] 
    [junit] Testsuite: org.apache.cassandra.gms.GossipDigestTest
    [junit] Tests run: 1, Failures: 0, Errors: 0, Time elapsed: 0.058 sec
    [junit] 
    [junit] Testsuite: org.apache.cassandra.gms.SerializationsTest
    [junit] Tests run: 2, Failures: 0, Errors: 0, Time elapsed: 0.438 sec
    [junit] 
    [junit] Testsuite: org.apache.cassandra.hadoop.ColumnFamilyInputFormatTest
    [junit] Tests run: 1, Failures: 0, Errors: 0, Time elapsed: 0.213 sec
    [junit] 
    [junit] Testsuite: org.apache.cassandra.io.BloomFilterTrackerTest
    [junit] Tests run: 3, Failures: 0, Errors: 0, Time elapsed: 0.428 sec
    [junit] 
    [junit] Testsuite: org.apache.cassandra.io.CompactSerializerTest
    [junit] Tests run: 2, Failures: 0, Errors: 0, Time elapsed: 1.899 sec
    [junit] 
    [junit] Testsuite: org.apache.cassandra.io.LazilyCompactedRowTest
    [junit] Tests run: 7, Failures: 0, Errors: 0, Time elapsed: 25.185 sec
    [junit] 
    [junit] Testsuite: org.apache.cassandra.io.compress.CompressedRandomAccessReaderTest
    [junit] Tests run: 3, Failures: 0, Errors: 0, Time elapsed: 1.025 sec
    [junit] 
    [junit] Testsuite: org.apache.cassandra.io.sstable.DescriptorTest
    [junit] Tests run: 2, Failures: 0, Errors: 0, Time elapsed: 0.061 sec
    [junit] 
    [junit] Testsuite: org.apache.cassandra.io.sstable.IndexHelperTest
    [junit] Tests run: 1, Failures: 0, Errors: 0, Time elapsed: 0.066 sec
    [junit] 
    [junit] Testsuite: org.apache.cassandra.io.sstable.LegacySSTableTest
    [junit] Tests run: 1, Failures: 0, Errors: 0, Time elapsed: 1.451 sec
    [junit] 
    [junit] Testsuite: org.apache.cassandra.io.sstable.SSTableMetadataSerializerTest
    [junit] Tests run: 1, Failures: 0, Errors: 0, Time elapsed: 0.129 sec
    [junit] 
    [junit] Testsuite: org.apache.cassandra.io.sstable.SSTableReaderTest
    [junit] Tests run: 4, Failures: 0, Errors: 0, Time elapsed: 6.92 sec
    [junit] 
    [junit] Testsuite: org.apache.cassandra.io.sstable.SSTableSimpleWriterTest
    [junit] Tests run: 1, Failures: 0, Errors: 0, Time elapsed: 0.875 sec
    [junit] 
    [junit] Testsuite: org.apache.cassandra.io.sstable.SSTableTest
    [junit] Tests run: 2, Failures: 0, Errors: 0, Time elapsed: 1.657 sec
    [junit] 
    [junit] Testsuite: org.apache.cassandra.io.util.BufferedRandomAccessFileTest
    [junit] Tests run: 18, Failures: 0, Errors: 0, Time elapsed: 2.279 sec
    [junit] 
    [junit] Testsuite: org.apache.cassandra.locator.DynamicEndpointSnitchTest
    [junit] Tests run: 1, Failures: 0, Errors: 0, Time elapsed: 1.192 sec
    [junit] 
    [junit] Testsuite: org.apache.cassandra.locator.EC2SnitchTest
    [junit] Tests run: 1, Failures: 0, Errors: 0, Time elapsed: 0.427 sec
    [junit] 
    [junit] Testsuite: org.apache.cassandra.locator.NetworkTopologyStrategyTest
    [junit] Tests run: 2, Failures: 0, Errors: 0, Time elapsed: 0.451 sec
    [junit] 
    [junit] Testsuite: org.apache.cassandra.locator.OldNetworkTopologyStrategyTest
    [junit] Tests run: 3, Failures: 0, Errors: 0, Time elapsed: 0.163 sec
    [junit] 
    [junit] Testsuite: org.apache.cassandra.locator.ReplicationStrategyEndpointCacheTest
    [junit] Tests run: 2, Failures: 0, Errors: 0, Time elapsed: 0.497 sec
    [junit] 
    [junit] Testsuite: org.apache.cassandra.locator.SimpleStrategyTest
    [junit] Tests run: 4, Failures: 0, Errors: 0, Time elapsed: 0.792 sec
    [junit] 
    [junit] Testsuite: org.apache.cassandra.locator.TokenMetadataTest
    [junit] Tests run: 3, Failures: 0, Errors: 0, Time elapsed: 0.435 sec
    [junit] 
    [junit] Testsuite: org.apache.cassandra.service.AntiEntropyServiceCounterTest
    [junit] Tests run: 6, Failures: 0, Errors: 0, Time elapsed: 3.507 sec
    [junit] 
    [junit] ------------- Standard Error -----------------
    [junit]  WARN 09:25:12,362 Generated random token Token(bytes[99dec83404a762d50898b4093d827c34]).
Random tokens will result in an unbalanced ring; see http://wiki.apache.org/cassandra/Operations
    [junit] ------------- ---------------- ---------------
    [junit] Testsuite: org.apache.cassandra.service.AntiEntropyServiceStandardTest
    [junit] Tests run: 6, Failures: 0, Errors: 0, Time elapsed: 3.348 sec
    [junit] 
    [junit] ------------- Standard Error -----------------
    [junit]  WARN 09:25:16,864 Generated random token Token(bytes[47d221ce32a66b1a29f0d0e76fcde434]).
Random tokens will result in an unbalanced ring; see http://wiki.apache.org/cassandra/Operations
    [junit] ------------- ---------------- ---------------
    [junit] Testsuite: org.apache.cassandra.service.CassandraServerTest
    [junit] Tests run: 1, Failures: 0, Errors: 0, Time elapsed: 0.438 sec
    [junit] 
    [junit] Testsuite: org.apache.cassandra.service.ConsistencyLevelTest
    [junit] Tests run: 1, Failures: 0, Errors: 0, Time elapsed: 1.162 sec
    [junit] 
    [junit] Testsuite: org.apache.cassandra.service.EmbeddedCassandraServiceTest
    [junit] Tests run: 1, Failures: 0, Errors: 0, Time elapsed: 1.693 sec
    [junit] 
    [junit] ------------- Standard Error -----------------
    [junit]  WARN 09:25:23,874 Unable to lock JVM memory (ENOMEM). This can result in part
of the JVM being swapped out, especially with mmapped I/O enabled. Increase RLIMIT_MEMLOCK
or run Cassandra as root.
    [junit]  WARN 09:25:24,783 Generated random token Token(bytes[9d46c2bcc9e1d8e9a6d0f8350a14743e]).
Random tokens will result in an unbalanced ring; see http://wiki.apache.org/cassandra/Operations
    [junit] ------------- ---------------- ---------------
    [junit] Testsuite: org.apache.cassandra.service.InitClientTest
    [junit] Tests run: 1, Failures: 0, Errors: 0, Time elapsed: 0.439 sec
    [junit] 
    [junit] Testsuite: org.apache.cassandra.service.LeaveAndBootstrapTest
    [junit] Tests run: 6, Failures: 0, Errors: 0, Time elapsed: 4.416 sec
    [junit] 
    [junit] ------------- Standard Error -----------------
    [junit]  WARN 09:25:31,544 Node /127.0.0.3 'leaving' token mismatch. Long network partition?
    [junit] ------------- ---------------- ---------------
    [junit] Testsuite: org.apache.cassandra.service.MoveTest
    [junit] Tests run: 3, Failures: 0, Errors: 0, Time elapsed: 2.427 sec
    [junit] 
    [junit] Testsuite: org.apache.cassandra.service.RemoveTest
    [junit] Tests run: 3, Failures: 0, Errors: 0, Time elapsed: 5.022 sec
    [junit] 
    [junit] Testsuite: org.apache.cassandra.service.RowResolverTest
    [junit] Tests run: 8, Failures: 0, Errors: 0, Time elapsed: 0.414 sec
    [junit] 
    [junit] Testsuite: org.apache.cassandra.service.SerializationsTest
    [junit] Tests run: 2, Failures: 0, Errors: 0, Time elapsed: 0.156 sec
    [junit] 
    [junit] Testsuite: org.apache.cassandra.service.StorageProxyTest
    [junit] Tests run: 4, Failures: 0, Errors: 0, Time elapsed: 0.451 sec
    [junit] 
    [junit] Testsuite: org.apache.cassandra.service.StorageServiceClientTest
    [junit] Tests run: 1, Failures: 0, Errors: 0, Time elapsed: 1.479 sec
    [junit] 
    [junit] Testsuite: org.apache.cassandra.service.StorageServiceServerTest
    [junit] Tests run: 3, Failures: 0, Errors: 0, Time elapsed: 2.233 sec
    [junit] 
    [junit] ------------- Standard Error -----------------
    [junit]  WARN 09:25:49,508 Generated random token Token(bytes[b26734d20fb81d69d4c845f4705df908]).
Random tokens will result in an unbalanced ring; see http://wiki.apache.org/cassandra/Operations
    [junit] ------------- ---------------- ---------------
    [junit] Testsuite: org.apache.cassandra.streaming.BootstrapTest
    [junit] Tests run: 1, Failures: 0, Errors: 0, Time elapsed: 0.577 sec
    [junit] 
    [junit] Testsuite: org.apache.cassandra.streaming.SerializationsTest
    [junit] Tests run: 4, Failures: 0, Errors: 0, Time elapsed: 0.468 sec
    [junit] 
    [junit] Testsuite: org.apache.cassandra.streaming.StreamingTransferTest
    [junit] Tests run: 5, Failures: 0, Errors: 0, Time elapsed: 4.713 sec
    [junit] 
    [junit] ------------- Standard Error -----------------
    [junit]  WARN 09:25:55,275 Generated random token Token(bytes[58c82f60694769a30ca442e748f2ca77]).
Random tokens will result in an unbalanced ring; see http://wiki.apache.org/cassandra/Operations
    [junit] ------------- ---------------- ---------------
    [junit] Testsuite: org.apache.cassandra.thrift.ThriftValidationTest
    [junit] Tests run: 5, Failures: 0, Errors: 0, Time elapsed: 0.868 sec
    [junit] 
    [junit] Testsuite: org.apache.cassandra.tools.SSTableExportTest
    [junit] Tests run: 6, Failures: 0, Errors: 0, Time elapsed: 1.835 sec
    [junit] 
    [junit] ------------- Standard Output ---------------
    [junit] Importing 1 keys...
    [junit] 1 keys imported successfully.
    [junit] ------------- ---------------- ---------------
    [junit] Testsuite: org.apache.cassandra.tools.SSTableImportTest
    [junit] Tests run: 5, Failures: 0, Errors: 0, Time elapsed: 1.182 sec
    [junit] 
    [junit] ------------- Standard Output ---------------
    [junit] Importing 2 keys...
    [junit] 2 keys imported successfully.
    [junit] Importing 2 keys...
    [junit] 2 keys imported successfully.
    [junit] Importing 2 keys...
    [junit] 2 keys imported successfully.
    [junit] Importing 3 keys...
    [junit] Importing 3 keys...
    [junit] 1 keys imported successfully.
    [junit] ------------- ---------------- ---------------
    [junit] ------------- Standard Error -----------------
    [junit] Line 2: Key 303630 is greater than previous, collection is not sorted properly.
Aborting import. You might need to delete SSTables manually.
    [junit] ------------- ---------------- ---------------
    [junit] Testsuite: org.apache.cassandra.utils.BloomFilterTest
    [junit] Tests run: 7, Failures: 0, Errors: 0, Time elapsed: 0.76 sec
    [junit] 
    [junit] Testsuite: org.apache.cassandra.utils.BoundedStatsDequeTest
    [junit] Tests run: 1, Failures: 0, Errors: 0, Time elapsed: 0.058 sec
    [junit] 
    [junit] Testsuite: org.apache.cassandra.utils.ByteBufferUtilTest
    [junit] Tests run: 10, Failures: 0, Errors: 0, Time elapsed: 0.156 sec
    [junit] 
    [junit] Testsuite: org.apache.cassandra.utils.BytesReadTrackerTest
    [junit] Tests run: 4, Failures: 0, Errors: 0, Time elapsed: 0.06 sec
    [junit] 
    [junit] Testsuite: org.apache.cassandra.utils.EstimatedHistogramTest
    [junit] Tests run: 4, Failures: 0, Errors: 0, Time elapsed: 0.06 sec
    [junit] 
    [junit] Testsuite: org.apache.cassandra.utils.FBUtilitiesTest
    [junit] Tests run: 5, Failures: 0, Errors: 0, Time elapsed: 0.147 sec
    [junit] 
    [junit] Testsuite: org.apache.cassandra.utils.IntervalTest
    [junit] Tests run: 3, Failures: 0, Errors: 0, Time elapsed: 0.062 sec
    [junit] 
    [junit] Testsuite: org.apache.cassandra.utils.IntervalTreeTest
    [junit] Tests run: 1, Failures: 0, Errors: 0, Time elapsed: 0.071 sec
    [junit] 
    [junit] Testsuite: org.apache.cassandra.utils.LegacyBloomFilterTest
    [junit] Tests run: 6, Failures: 0, Errors: 0, Time elapsed: 0.685 sec
    [junit] 
    [junit] Testsuite: org.apache.cassandra.utils.MergeIteratorTest
    [junit] Tests run: 1, Failures: 0, Errors: 0, Time elapsed: 0.075 sec
    [junit] 
    [junit] Testsuite: org.apache.cassandra.utils.MerkleTreeTest
    [junit] Tests run: 12, Failures: 0, Errors: 0, Time elapsed: 0.447 sec
    [junit] 
    [junit] Testsuite: org.apache.cassandra.utils.SerializationsTest
    [junit] Tests run: 3, Failures: 0, Errors: 0, Time elapsed: 0.672 sec
    [junit] 

BUILD FAILED
<https://builds.apache.org/job/Cassandra/ws/cassandra/build.xml>:1082: The following
error occurred while executing this line:
<https://builds.apache.org/job/Cassandra/ws/cassandra/build.xml>:1068: Some unit test(s)
failed.

Total time: 21 minutes 50 seconds
Build step 'Invoke Ant' marked build as failure
[TASKS] Skipping publisher since build result is FAILURE
Publishing Javadoc
Archiving artifacts
Recording test results


Mime
View raw message