incubator-cassandra-dev mailing list archives

Site index · List index
Message view « Date » · « Thread »
Top « Date » · « Thread »
From Apache Jenkins Server <jenk...@builds.apache.org>
Subject Build failed in Jenkins: Cassandra-quick #51
Date Wed, 05 Oct 2011 23:18:44 GMT
See <https://builds.apache.org/job/Cassandra-quick/51/changes>

Changes:

[xedin] off-heap cache to use sun.misc.Unsafe instead of JNA
patch by Pavel Yaskevich; reviewed by Jonathan Ellis for CASSANDRA-3271

------------------------------------------
[...truncated 1585 lines...]
    [junit] Testsuite: org.apache.cassandra.service.ConsistencyLevelTest
    [junit] Tests run: 1, Failures: 0, Errors: 0, Time elapsed: 0.785 sec
    [junit] 
    [junit] Testsuite: org.apache.cassandra.service.EmbeddedCassandraServiceTest
    [junit] Tests run: 1, Failures: 0, Errors: 0, Time elapsed: 0.887 sec
    [junit] 
    [junit] ------------- Standard Error -----------------
    [junit]  WARN 23:17:45,399 Unable to lock JVM memory (ENOMEM). This can result in part
of the JVM being swapped out, especially with mmapped I/O enabled. Increase RLIMIT_MEMLOCK
or run Cassandra as root.
    [junit]  WARN 23:17:45,705 Generated random token Token(bytes[132d1edf76256a714073110ecd81382a]).
Random tokens will result in an unbalanced ring; see http://wiki.apache.org/cassandra/Operations
    [junit] ------------- ---------------- ---------------
    [junit] Testsuite: org.apache.cassandra.service.InitClientTest
    [junit] Tests run: 1, Failures: 0, Errors: 0, Time elapsed: 0.438 sec
    [junit] 
    [junit] Testsuite: org.apache.cassandra.service.LeaveAndBootstrapTest
    [junit] Tests run: 6, Failures: 0, Errors: 0, Time elapsed: 1.903 sec
    [junit] 
    [junit] ------------- Standard Error -----------------
    [junit]  WARN 23:17:50,239 Node /127.0.0.3 'leaving' token mismatch. Long network partition?
    [junit] ------------- ---------------- ---------------
    [junit] Testsuite: org.apache.cassandra.service.MoveTest
    [junit] Tests run: 3, Failures: 0, Errors: 0, Time elapsed: 1.438 sec
    [junit] 
    [junit] Testsuite: org.apache.cassandra.service.RemoveTest
    [junit] Tests run: 3, Failures: 0, Errors: 0, Time elapsed: 4.14 sec
    [junit] 
    [junit] Testsuite: org.apache.cassandra.service.RowResolverTest
    [junit] Tests run: 8, Failures: 0, Errors: 0, Time elapsed: 0.437 sec
    [junit] 
    [junit] Testsuite: org.apache.cassandra.service.SerializationsTest
    [junit] Tests run: 2, Failures: 0, Errors: 0, Time elapsed: 0.179 sec
    [junit] 
    [junit] Testsuite: org.apache.cassandra.service.StorageProxyTest
    [junit] Tests run: 4, Failures: 0, Errors: 0, Time elapsed: 0.472 sec
    [junit] 
    [junit] Testsuite: org.apache.cassandra.service.StorageServiceClientTest
    [junit] Tests run: 1, Failures: 0, Errors: 0, Time elapsed: 1.481 sec
    [junit] 
    [junit] Testsuite: org.apache.cassandra.service.StorageServiceServerTest
    [junit] Tests run: 3, Failures: 0, Errors: 0, Time elapsed: 1.722 sec
    [junit] 
    [junit] ------------- Standard Error -----------------
    [junit]  WARN 23:18:05,763 Generated random token Token(bytes[1c36d69bc9d159167663b0c5dc1eccc9]).
Random tokens will result in an unbalanced ring; see http://wiki.apache.org/cassandra/Operations
    [junit] ------------- ---------------- ---------------
    [junit] Testsuite: org.apache.cassandra.streaming.BootstrapTest
    [junit] Tests run: 1, Failures: 0, Errors: 0, Time elapsed: 0.598 sec
    [junit] 
    [junit] Testsuite: org.apache.cassandra.streaming.SerializationsTest
    [junit] Tests run: 4, Failures: 0, Errors: 0, Time elapsed: 0.498 sec
    [junit] 
    [junit] Testsuite: org.apache.cassandra.streaming.StreamingTransferTest
    [junit] Tests run: 5, Failures: 0, Errors: 0, Time elapsed: 0.73 sec
    [junit] 
    [junit] ------------- Standard Error -----------------
    [junit]  WARN 23:18:11,119 Generated random token Token(bytes[0dc4ab59addb251b49605baf2e2f665b]).
Random tokens will result in an unbalanced ring; see http://wiki.apache.org/cassandra/Operations
    [junit] ------------- ---------------- ---------------
    [junit] Testsuite: org.apache.cassandra.thrift.ThriftValidationTest
    [junit] Tests run: 5, Failures: 0, Errors: 0, Time elapsed: 0.733 sec
    [junit] 
    [junit] Testsuite: org.apache.cassandra.tools.SSTableExportTest
    [junit] Tests run: 6, Failures: 0, Errors: 0, Time elapsed: 0.847 sec
    [junit] 
    [junit] ------------- Standard Output ---------------
    [junit] Importing 1 keys...
    [junit] 1 keys imported successfully.
    [junit] ------------- ---------------- ---------------
    [junit] Testsuite: org.apache.cassandra.tools.SSTableImportTest
    [junit] Tests run: 5, Failures: 0, Errors: 0, Time elapsed: 0.696 sec
    [junit] 
    [junit] ------------- Standard Output ---------------
    [junit] Importing 2 keys...
    [junit] 2 keys imported successfully.
    [junit] Importing 2 keys...
    [junit] 2 keys imported successfully.
    [junit] Importing 2 keys...
    [junit] 2 keys imported successfully.
    [junit] Importing 3 keys...
    [junit] Importing 3 keys...
    [junit] 1 keys imported successfully.
    [junit] ------------- ---------------- ---------------
    [junit] ------------- Standard Error -----------------
    [junit] Line 2: Key 303630 is greater than previous, collection is not sorted properly.
Aborting import. You might need to delete SSTables manually.
    [junit] ------------- ---------------- ---------------
    [junit] Testsuite: org.apache.cassandra.utils.BloomFilterTest
    [junit] Tests run: 7, Failures: 0, Errors: 0, Time elapsed: 0.534 sec
    [junit] 
    [junit] Testsuite: org.apache.cassandra.utils.BoundedStatsDequeTest
    [junit] Tests run: 1, Failures: 0, Errors: 0, Time elapsed: 0.057 sec
    [junit] 
    [junit] Testsuite: org.apache.cassandra.utils.ByteBufferUtilTest
    [junit] Tests run: 10, Failures: 0, Errors: 0, Time elapsed: 0.155 sec
    [junit] 
    [junit] Testsuite: org.apache.cassandra.utils.BytesReadTrackerTest
    [junit] Tests run: 4, Failures: 0, Errors: 0, Time elapsed: 0.059 sec
    [junit] 
    [junit] Testsuite: org.apache.cassandra.utils.EstimatedHistogramTest
    [junit] Tests run: 4, Failures: 0, Errors: 0, Time elapsed: 0.062 sec
    [junit] 
    [junit] Testsuite: org.apache.cassandra.utils.FBUtilitiesTest
    [junit] Tests run: 5, Failures: 0, Errors: 0, Time elapsed: 0.147 sec
    [junit] 
    [junit] Testsuite: org.apache.cassandra.utils.IntervalTest
    [junit] Tests run: 3, Failures: 0, Errors: 0, Time elapsed: 0.092 sec
    [junit] 
    [junit] Testsuite: org.apache.cassandra.utils.IntervalTreeTest
    [junit] Tests run: 1, Failures: 0, Errors: 0, Time elapsed: 0.073 sec
    [junit] 
    [junit] Testsuite: org.apache.cassandra.utils.LegacyBloomFilterTest
    [junit] Tests run: 6, Failures: 0, Errors: 0, Time elapsed: 0.471 sec
    [junit] 
    [junit] Testsuite: org.apache.cassandra.utils.MergeIteratorTest
    [junit] Tests run: 1, Failures: 0, Errors: 0, Time elapsed: 0.079 sec
    [junit] 
    [junit] Testsuite: org.apache.cassandra.utils.MerkleTreeTest
    [junit] Tests run: 12, Failures: 0, Errors: 0, Time elapsed: 0.448 sec
    [junit] 
    [junit] Testsuite: org.apache.cassandra.utils.SerializationsTest
    [junit] Tests run: 3, Failures: 0, Errors: 0, Time elapsed: 0.742 sec
    [junit] 
     [echo] running driverunit tests
    [junit] WARNING: multiple versions of ant detected in path for junit 
    [junit]          jar:file:/home/hudson/tools/ant/latest/lib/ant.jar!/org/apache/tools/ant/Project.class
    [junit]      and jar:<https://builds.apache.org/job/Cassandra-quick/ws/cassandra/build/lib/jars/ant-1.6.5.jar!/org/apache/tools/ant/Project.class>
    [junit] Testsuite: org.apache.cassandra.cql.JdbcDriverTest
    [junit] Tests run: 0, Failures: 0, Errors: 2, Time elapsed: 0.963 sec
    [junit] 
    [junit] ------------- Standard Error -----------------
    [junit]  WARN 23:18:30,239 Unable to lock JVM memory (ENOMEM). This can result in part
of the JVM being swapped out, especially with mmapped I/O enabled. Increase RLIMIT_MEMLOCK
or run Cassandra as root.
    [junit]  WARN 23:18:30,583 Generated random token Token(bytes[d5931d9bf6d814ca5885f756d36f2e3f]).
Random tokens will result in an unbalanced ring; see http://wiki.apache.org/cassandra/Operations
    [junit] ------------- ---------------- ---------------
    [junit] Testcase: org.apache.cassandra.cql.JdbcDriverTest:	Caused an ERROR
    [junit] org.apache.cassandra.cql.jdbc.CassandraPreparedStatement cannot be cast to java.lang.Comparable
    [junit] java.lang.ClassCastException: org.apache.cassandra.cql.jdbc.CassandraPreparedStatement
cannot be cast to java.lang.Comparable
    [junit] 	at java.util.concurrent.ConcurrentSkipListMap.comparable(ConcurrentSkipListMap.java:621)
    [junit] 	at java.util.concurrent.ConcurrentSkipListMap.doPut(ConcurrentSkipListMap.java:862)
    [junit] 	at java.util.concurrent.ConcurrentSkipListMap.putIfAbsent(ConcurrentSkipListMap.java:1893)
    [junit] 	at java.util.concurrent.ConcurrentSkipListSet.add(ConcurrentSkipListSet.java:202)
    [junit] 	at org.apache.cassandra.cql.jdbc.CassandraConnection.prepareStatement(CassandraConnection.java:301)
    [junit] 	at org.apache.cassandra.cql.JdbcDriverTest.executeNoResults(JdbcDriverTest.java:506)
    [junit] 	at org.apache.cassandra.cql.JdbcDriverTest.startServer(JdbcDriverTest.java:80)
    [junit] 
    [junit] 
    [junit] Testcase: org.apache.cassandra.cql.JdbcDriverTest:	Caused an ERROR
    [junit] org.apache.cassandra.cql.jdbc.CassandraPreparedStatement cannot be cast to java.lang.Comparable
    [junit] java.lang.ClassCastException: org.apache.cassandra.cql.jdbc.CassandraPreparedStatement
cannot be cast to java.lang.Comparable
    [junit] 	at java.util.concurrent.ConcurrentSkipListMap.comparable(ConcurrentSkipListMap.java:621)
    [junit] 	at java.util.concurrent.ConcurrentSkipListMap.doPut(ConcurrentSkipListMap.java:862)
    [junit] 	at java.util.concurrent.ConcurrentSkipListMap.putIfAbsent(ConcurrentSkipListMap.java:1893)
    [junit] 	at java.util.concurrent.ConcurrentSkipListSet.add(ConcurrentSkipListSet.java:202)
    [junit] 	at org.apache.cassandra.cql.jdbc.CassandraConnection.prepareStatement(CassandraConnection.java:301)
    [junit] 	at org.apache.cassandra.cql.JdbcDriverTest.executeNoResults(JdbcDriverTest.java:506)
    [junit] 	at org.apache.cassandra.cql.JdbcDriverTest.stopServer(JdbcDriverTest.java:426)
    [junit] 
    [junit] 
    [junit] Test org.apache.cassandra.cql.JdbcDriverTest FAILED
    [junit] Testsuite: org.apache.cassandra.cql.jdbc.DataSourceTest
    [junit] Tests run: 3, Failures: 0, Errors: 0, Time elapsed: 1.029 sec
    [junit] 
    [junit] ------------- Standard Error -----------------
    [junit]  WARN 23:18:32,528 Unable to lock JVM memory (ENOMEM). This can result in part
of the JVM being swapped out, especially with mmapped I/O enabled. Increase RLIMIT_MEMLOCK
or run Cassandra as root.
    [junit]  WARN 23:18:32,894 Generated random token Token(bytes[c58d6ac64e84804eec81b777af105f42]).
Random tokens will result in an unbalanced ring; see http://wiki.apache.org/cassandra/Operations
    [junit] DriverManager.getConnection("jdbc:cassandra://localhost:9170/Test")
    [junit]     trying driver[className=sun.jdbc.odbc.JdbcOdbcDriver,sun.jdbc.odbc.JdbcOdbcDriver@17cd15d]
    [junit] *Driver.connect (jdbc:cassandra://localhost:9170/Test)
    [junit]     trying driver[className=org.apache.cassandra.cql.jdbc.CassandraDriver,org.apache.cassandra.cql.jdbc.CassandraDriver@1955970]
    [junit] getConnection returning driver[className=org.apache.cassandra.cql.jdbc.CassandraDriver,org.apache.cassandra.cql.jdbc.CassandraDriver@1955970]
    [junit] ------------- ---------------- ---------------
    [junit] Testsuite: org.apache.cassandra.cql.jdbc.PreparedStatementTest
    [junit] Tests run: 6, Failures: 0, Errors: 6, Time elapsed: 0.927 sec
    [junit] 
    [junit] ------------- Standard Error -----------------
    [junit]  WARN 23:18:34,781 Unable to lock JVM memory (ENOMEM). This can result in part
of the JVM being swapped out, especially with mmapped I/O enabled. Increase RLIMIT_MEMLOCK
or run Cassandra as root.
    [junit]  WARN 23:18:35,087 Generated random token Token(bytes[90710b203af92f3b8598a60c05326e6d]).
Random tokens will result in an unbalanced ring; see http://wiki.apache.org/cassandra/Operations
    [junit] ------------- ---------------- ---------------
    [junit] Testcase: testBytes(org.apache.cassandra.cql.jdbc.PreparedStatementTest):	Caused
an ERROR
    [junit] org.apache.cassandra.cql.jdbc.CassandraPreparedStatement cannot be cast to java.lang.Comparable
    [junit] java.lang.ClassCastException: org.apache.cassandra.cql.jdbc.CassandraPreparedStatement
cannot be cast to java.lang.Comparable
    [junit] 	at java.util.concurrent.ConcurrentSkipListMap.comparable(ConcurrentSkipListMap.java:621)
    [junit] 	at java.util.concurrent.ConcurrentSkipListMap.doPut(ConcurrentSkipListMap.java:862)
    [junit] 	at java.util.concurrent.ConcurrentSkipListMap.putIfAbsent(ConcurrentSkipListMap.java:1893)
    [junit] 	at java.util.concurrent.ConcurrentSkipListSet.add(ConcurrentSkipListSet.java:202)
    [junit] 	at org.apache.cassandra.cql.jdbc.CassandraConnection.prepareStatement(CassandraConnection.java:301)
    [junit] 	at org.apache.cassandra.cql.jdbc.PreparedStatementTest.testBytes(PreparedStatementTest.java:54)
    [junit] 
    [junit] 
    [junit] Testcase: testUtf8(org.apache.cassandra.cql.jdbc.PreparedStatementTest):	Caused
an ERROR
    [junit] org.apache.cassandra.cql.jdbc.CassandraPreparedStatement cannot be cast to java.lang.Comparable
    [junit] java.lang.ClassCastException: org.apache.cassandra.cql.jdbc.CassandraPreparedStatement
cannot be cast to java.lang.Comparable
    [junit] 	at java.util.concurrent.ConcurrentSkipListMap.comparable(ConcurrentSkipListMap.java:621)
    [junit] 	at java.util.concurrent.ConcurrentSkipListMap.doPut(ConcurrentSkipListMap.java:862)
    [junit] 	at java.util.concurrent.ConcurrentSkipListMap.putIfAbsent(ConcurrentSkipListMap.java:1893)
    [junit] 	at java.util.concurrent.ConcurrentSkipListSet.add(ConcurrentSkipListSet.java:202)
    [junit] 	at org.apache.cassandra.cql.jdbc.CassandraConnection.prepareStatement(CassandraConnection.java:301)
    [junit] 	at org.apache.cassandra.cql.jdbc.PreparedStatementTest.testUtf8(PreparedStatementTest.java:114)
    [junit] 
    [junit] 
    [junit] Testcase: testAscii(org.apache.cassandra.cql.jdbc.PreparedStatementTest):	Caused
an ERROR
    [junit] org.apache.cassandra.cql.jdbc.CassandraPreparedStatement cannot be cast to java.lang.Comparable
    [junit] java.lang.ClassCastException: org.apache.cassandra.cql.jdbc.CassandraPreparedStatement
cannot be cast to java.lang.Comparable
    [junit] 	at java.util.concurrent.ConcurrentSkipListMap.comparable(ConcurrentSkipListMap.java:621)
    [junit] 	at java.util.concurrent.ConcurrentSkipListMap.doPut(ConcurrentSkipListMap.java:862)
    [junit] 	at java.util.concurrent.ConcurrentSkipListMap.putIfAbsent(ConcurrentSkipListMap.java:1893)
    [junit] 	at java.util.concurrent.ConcurrentSkipListSet.add(ConcurrentSkipListSet.java:202)
    [junit] 	at org.apache.cassandra.cql.jdbc.CassandraConnection.prepareStatement(CassandraConnection.java:301)
    [junit] 	at org.apache.cassandra.cql.jdbc.PreparedStatementTest.testAscii(PreparedStatementTest.java:174)
    [junit] 
    [junit] 
    [junit] Testcase: testLong(org.apache.cassandra.cql.jdbc.PreparedStatementTest):	Caused
an ERROR
    [junit] org.apache.cassandra.cql.jdbc.CassandraPreparedStatement cannot be cast to java.lang.Comparable
    [junit] java.lang.ClassCastException: org.apache.cassandra.cql.jdbc.CassandraPreparedStatement
cannot be cast to java.lang.Comparable
    [junit] 	at java.util.concurrent.ConcurrentSkipListMap.comparable(ConcurrentSkipListMap.java:621)
    [junit] 	at java.util.concurrent.ConcurrentSkipListMap.doPut(ConcurrentSkipListMap.java:862)
    [junit] 	at java.util.concurrent.ConcurrentSkipListMap.putIfAbsent(ConcurrentSkipListMap.java:1893)
    [junit] 	at java.util.concurrent.ConcurrentSkipListSet.add(ConcurrentSkipListSet.java:202)
    [junit] 	at org.apache.cassandra.cql.jdbc.CassandraConnection.prepareStatement(CassandraConnection.java:301)
    [junit] 	at org.apache.cassandra.cql.jdbc.PreparedStatementTest.testLong(PreparedStatementTest.java:233)
    [junit] 
    [junit] 
    [junit] Testcase: testInteger(org.apache.cassandra.cql.jdbc.PreparedStatementTest):	Caused
an ERROR
    [junit] org.apache.cassandra.cql.jdbc.CassandraPreparedStatement cannot be cast to java.lang.Comparable
    [junit] java.lang.ClassCastException: org.apache.cassandra.cql.jdbc.CassandraPreparedStatement
cannot be cast to java.lang.Comparable
    [junit] 	at java.util.concurrent.ConcurrentSkipListMap.comparable(ConcurrentSkipListMap.java:621)
    [junit] 	at java.util.concurrent.ConcurrentSkipListMap.doPut(ConcurrentSkipListMap.java:862)
    [junit] 	at java.util.concurrent.ConcurrentSkipListMap.putIfAbsent(ConcurrentSkipListMap.java:1893)
    [junit] 	at java.util.concurrent.ConcurrentSkipListSet.add(ConcurrentSkipListSet.java:202)
    [junit] 	at org.apache.cassandra.cql.jdbc.CassandraConnection.prepareStatement(CassandraConnection.java:301)
    [junit] 	at org.apache.cassandra.cql.jdbc.PreparedStatementTest.testInteger(PreparedStatementTest.java:294)
    [junit] 
    [junit] 
    [junit] Testcase: testParamSubstitution(org.apache.cassandra.cql.jdbc.PreparedStatementTest):
Caused an ERROR
    [junit] org.apache.cassandra.cql.jdbc.CassandraPreparedStatement cannot be cast to java.lang.Comparable
    [junit] java.lang.ClassCastException: org.apache.cassandra.cql.jdbc.CassandraPreparedStatement
cannot be cast to java.lang.Comparable
    [junit] 	at java.util.concurrent.ConcurrentSkipListMap.comparable(ConcurrentSkipListMap.java:621)
    [junit] 	at java.util.concurrent.ConcurrentSkipListMap.doPut(ConcurrentSkipListMap.java:862)
    [junit] 	at java.util.concurrent.ConcurrentSkipListMap.putIfAbsent(ConcurrentSkipListMap.java:1893)
    [junit] 	at java.util.concurrent.ConcurrentSkipListSet.add(ConcurrentSkipListSet.java:202)
    [junit] 	at org.apache.cassandra.cql.jdbc.CassandraConnection.prepareStatement(CassandraConnection.java:301)
    [junit] 	at org.apache.cassandra.cql.jdbc.PreparedStatementTest.testParamSubstitution(PreparedStatementTest.java:357)
    [junit] 
    [junit] 
    [junit] Test org.apache.cassandra.cql.jdbc.PreparedStatementTest FAILED

BUILD FAILED
<https://builds.apache.org/job/Cassandra-quick/ws/cassandra/build.xml>:1086: The following
error occurred while executing this line:
<https://builds.apache.org/job/Cassandra-quick/ws/cassandra/build.xml>:1068: Some driverunit
test(s) failed.

Total time: 3 minutes 49 seconds
Build step 'Invoke Ant' marked build as failure
[TASKS] Skipping publisher since build result is FAILURE
Recording test results


Mime
View raw message