incubator-cassandra-dev mailing list archives

Site index · List index
Message view « Date » · « Thread »
Top « Date » · « Thread »
From Apache Jenkins Server <jenk...@builds.apache.org>
Subject Build failed in Jenkins: Cassandra #1144
Date Wed, 05 Oct 2011 23:30:09 GMT
See <https://builds.apache.org/job/Cassandra/1144/changes>

Changes:

[xedin] off-heap cache to use sun.misc.Unsafe instead of JNA
patch by Pavel Yaskevich; reviewed by Jonathan Ellis for CASSANDRA-3271

------------------------------------------
[...truncated 2256 lines...]
    [junit] Testsuite: org.apache.cassandra.service.EmbeddedCassandraServiceTest
    [junit] Tests run: 1, Failures: 0, Errors: 0, Time elapsed: 0.752 sec
    [junit] 
    [junit] ------------- Standard Error -----------------
    [junit]  WARN 23:29:01,864 Unable to lock JVM memory (ENOMEM). This can result in part
of the JVM being swapped out, especially with mmapped I/O enabled. Increase RLIMIT_MEMLOCK
or run Cassandra as root.
    [junit]  WARN 23:29:02,134 Generated random token Token(bytes[5bd40eddab572a03d3e744d5542f8ba9]).
Random tokens will result in an unbalanced ring; see http://wiki.apache.org/cassandra/Operations
    [junit] ------------- ---------------- ---------------
    [junit] Testsuite: org.apache.cassandra.service.InitClientTest
    [junit] Tests run: 1, Failures: 0, Errors: 0, Time elapsed: 0.326 sec
    [junit] 
    [junit] Testsuite: org.apache.cassandra.service.LeaveAndBootstrapTest
    [junit] Tests run: 6, Failures: 0, Errors: 0, Time elapsed: 1.805 sec
    [junit] 
    [junit] ------------- Standard Error -----------------
    [junit]  WARN 23:29:06,491 Node /127.0.0.3 'leaving' token mismatch. Long network partition?
    [junit] ------------- ---------------- ---------------
    [junit] Testsuite: org.apache.cassandra.service.MoveTest
    [junit] Tests run: 3, Failures: 0, Errors: 0, Time elapsed: 1.22 sec
    [junit] 
    [junit] Testsuite: org.apache.cassandra.service.RemoveTest
    [junit] Tests run: 3, Failures: 0, Errors: 0, Time elapsed: 3.906 sec
    [junit] 
    [junit] Testsuite: org.apache.cassandra.service.RowResolverTest
    [junit] Tests run: 8, Failures: 0, Errors: 0, Time elapsed: 0.311 sec
    [junit] 
    [junit] Testsuite: org.apache.cassandra.service.SerializationsTest
    [junit] Tests run: 2, Failures: 0, Errors: 0, Time elapsed: 0.132 sec
    [junit] 
    [junit] Testsuite: org.apache.cassandra.service.StorageProxyTest
    [junit] Tests run: 4, Failures: 0, Errors: 0, Time elapsed: 0.338 sec
    [junit] 
    [junit] Testsuite: org.apache.cassandra.service.StorageServiceClientTest
    [junit] Tests run: 1, Failures: 0, Errors: 0, Time elapsed: 1.372 sec
    [junit] 
    [junit] Testsuite: org.apache.cassandra.service.StorageServiceServerTest
    [junit] Tests run: 3, Failures: 0, Errors: 0, Time elapsed: 1.573 sec
    [junit] 
    [junit] ------------- Standard Error -----------------
    [junit]  WARN 23:29:20,652 Generated random token Token(bytes[215e9dc29251a5d3e3fcb6984ab5025b]).
Random tokens will result in an unbalanced ring; see http://wiki.apache.org/cassandra/Operations
    [junit] ------------- ---------------- ---------------
    [junit] Testsuite: org.apache.cassandra.streaming.BootstrapTest
    [junit] Tests run: 1, Failures: 0, Errors: 0, Time elapsed: 0.471 sec
    [junit] 
    [junit] Testsuite: org.apache.cassandra.streaming.SerializationsTest
    [junit] Tests run: 4, Failures: 0, Errors: 0, Time elapsed: 0.348 sec
    [junit] 
    [junit] Testsuite: org.apache.cassandra.streaming.StreamingTransferTest
    [junit] Tests run: 5, Failures: 0, Errors: 0, Time elapsed: 0.792 sec
    [junit] 
    [junit] ------------- Standard Error -----------------
    [junit]  WARN 23:29:25,475 Generated random token Token(bytes[2a6ad5be0b76f13e0d3b40b1dceaaa1c]).
Random tokens will result in an unbalanced ring; see http://wiki.apache.org/cassandra/Operations
    [junit] ------------- ---------------- ---------------
    [junit] Testsuite: org.apache.cassandra.thrift.ThriftValidationTest
    [junit] Tests run: 5, Failures: 0, Errors: 0, Time elapsed: 0.605 sec
    [junit] 
    [junit] Testsuite: org.apache.cassandra.tools.SSTableExportTest
    [junit] Tests run: 6, Failures: 0, Errors: 0, Time elapsed: 0.635 sec
    [junit] 
    [junit] ------------- Standard Output ---------------
    [junit] Importing 1 keys...
    [junit] 1 keys imported successfully.
    [junit] ------------- ---------------- ---------------
    [junit] Testsuite: org.apache.cassandra.tools.SSTableImportTest
    [junit] Tests run: 5, Failures: 0, Errors: 0, Time elapsed: 0.546 sec
    [junit] 
    [junit] ------------- Standard Output ---------------
    [junit] Importing 2 keys...
    [junit] 2 keys imported successfully.
    [junit] Importing 2 keys...
    [junit] 2 keys imported successfully.
    [junit] Importing 2 keys...
    [junit] 2 keys imported successfully.
    [junit] Importing 3 keys...
    [junit] Importing 3 keys...
    [junit] 1 keys imported successfully.
    [junit] ------------- ---------------- ---------------
    [junit] ------------- Standard Error -----------------
    [junit] Line 2: Key 303630 is greater than previous, collection is not sorted properly.
Aborting import. You might need to delete SSTables manually.
    [junit] ------------- ---------------- ---------------
    [junit] Testsuite: org.apache.cassandra.utils.BloomFilterTest
    [junit] Tests run: 7, Failures: 0, Errors: 0, Time elapsed: 0.428 sec
    [junit] 
    [junit] Testsuite: org.apache.cassandra.utils.BoundedStatsDequeTest
    [junit] Tests run: 1, Failures: 0, Errors: 0, Time elapsed: 0.042 sec
    [junit] 
    [junit] Testsuite: org.apache.cassandra.utils.ByteBufferUtilTest
    [junit] Tests run: 10, Failures: 0, Errors: 0, Time elapsed: 0.116 sec
    [junit] 
    [junit] Testsuite: org.apache.cassandra.utils.BytesReadTrackerTest
    [junit] Tests run: 4, Failures: 0, Errors: 0, Time elapsed: 0.043 sec
    [junit] 
    [junit] Testsuite: org.apache.cassandra.utils.EstimatedHistogramTest
    [junit] Tests run: 4, Failures: 0, Errors: 0, Time elapsed: 0.044 sec
    [junit] 
    [junit] Testsuite: org.apache.cassandra.utils.FBUtilitiesTest
    [junit] Tests run: 5, Failures: 0, Errors: 0, Time elapsed: 0.11 sec
    [junit] 
    [junit] Testsuite: org.apache.cassandra.utils.IntervalTest
    [junit] Tests run: 3, Failures: 0, Errors: 0, Time elapsed: 0.044 sec
    [junit] 
    [junit] Testsuite: org.apache.cassandra.utils.IntervalTreeTest
    [junit] Tests run: 1, Failures: 0, Errors: 0, Time elapsed: 0.057 sec
    [junit] 
    [junit] Testsuite: org.apache.cassandra.utils.LegacyBloomFilterTest
    [junit] Tests run: 6, Failures: 0, Errors: 0, Time elapsed: 0.341 sec
    [junit] 
    [junit] Testsuite: org.apache.cassandra.utils.MergeIteratorTest
    [junit] Tests run: 1, Failures: 0, Errors: 0, Time elapsed: 0.055 sec
    [junit] 
    [junit] Testsuite: org.apache.cassandra.utils.MerkleTreeTest
    [junit] Tests run: 12, Failures: 0, Errors: 0, Time elapsed: 0.353 sec
    [junit] 
    [junit] Testsuite: org.apache.cassandra.utils.SerializationsTest
    [junit] Tests run: 3, Failures: 0, Errors: 0, Time elapsed: 0.481 sec
    [junit] 
     [echo] running driverunit tests
    [junit] WARNING: multiple versions of ant detected in path for junit 
    [junit]          jar:file:/home/hudson/tools/ant/latest/lib/ant.jar!/org/apache/tools/ant/Project.class
    [junit]      and jar:file:/x1/jenkins/jenkins-slave/workspace/Cassandra/cassandra/build/lib/jars/ant-1.6.5.jar!/org/apache/tools/ant/Project.class
    [junit] Testsuite: org.apache.cassandra.cql.JdbcDriverTest
    [junit] Tests run: 0, Failures: 0, Errors: 2, Time elapsed: 0.72 sec
    [junit] 
    [junit] ------------- Standard Error -----------------
    [junit]  WARN 23:29:42,642 Unable to lock JVM memory (ENOMEM). This can result in part
of the JVM being swapped out, especially with mmapped I/O enabled. Increase RLIMIT_MEMLOCK
or run Cassandra as root.
    [junit]  WARN 23:29:42,876 Generated random token Token(bytes[da8cccb9dd3962bb6e01824723c41795]).
Random tokens will result in an unbalanced ring; see http://wiki.apache.org/cassandra/Operations
    [junit] ------------- ---------------- ---------------
    [junit] Testcase: org.apache.cassandra.cql.JdbcDriverTest:	Caused an ERROR
    [junit] org.apache.cassandra.cql.jdbc.CassandraPreparedStatement cannot be cast to java.lang.Comparable
    [junit] java.lang.ClassCastException: org.apache.cassandra.cql.jdbc.CassandraPreparedStatement
cannot be cast to java.lang.Comparable
    [junit] 	at java.util.concurrent.ConcurrentSkipListMap.comparable(ConcurrentSkipListMap.java:621)
    [junit] 	at java.util.concurrent.ConcurrentSkipListMap.doPut(ConcurrentSkipListMap.java:862)
    [junit] 	at java.util.concurrent.ConcurrentSkipListMap.putIfAbsent(ConcurrentSkipListMap.java:1893)
    [junit] 	at java.util.concurrent.ConcurrentSkipListSet.add(ConcurrentSkipListSet.java:202)
    [junit] 	at org.apache.cassandra.cql.jdbc.CassandraConnection.prepareStatement(CassandraConnection.java:301)
    [junit] 	at org.apache.cassandra.cql.JdbcDriverTest.executeNoResults(JdbcDriverTest.java:506)
    [junit] 	at org.apache.cassandra.cql.JdbcDriverTest.startServer(JdbcDriverTest.java:80)
    [junit] 
    [junit] 
    [junit] Testcase: org.apache.cassandra.cql.JdbcDriverTest:	Caused an ERROR
    [junit] org.apache.cassandra.cql.jdbc.CassandraPreparedStatement cannot be cast to java.lang.Comparable
    [junit] java.lang.ClassCastException: org.apache.cassandra.cql.jdbc.CassandraPreparedStatement
cannot be cast to java.lang.Comparable
    [junit] 	at java.util.concurrent.ConcurrentSkipListMap.comparable(ConcurrentSkipListMap.java:621)
    [junit] 	at java.util.concurrent.ConcurrentSkipListMap.doPut(ConcurrentSkipListMap.java:862)
    [junit] 	at java.util.concurrent.ConcurrentSkipListMap.putIfAbsent(ConcurrentSkipListMap.java:1893)
    [junit] 	at java.util.concurrent.ConcurrentSkipListSet.add(ConcurrentSkipListSet.java:202)
    [junit] 	at org.apache.cassandra.cql.jdbc.CassandraConnection.prepareStatement(CassandraConnection.java:301)
    [junit] 	at org.apache.cassandra.cql.JdbcDriverTest.executeNoResults(JdbcDriverTest.java:506)
    [junit] 	at org.apache.cassandra.cql.JdbcDriverTest.stopServer(JdbcDriverTest.java:426)
    [junit] 
    [junit] 
    [junit] Test org.apache.cassandra.cql.JdbcDriverTest FAILED
    [junit] Testsuite: org.apache.cassandra.cql.jdbc.DataSourceTest
    [junit] Tests run: 3, Failures: 0, Errors: 0, Time elapsed: 0.744 sec
    [junit] 
    [junit] ------------- Standard Error -----------------
    [junit]  WARN 23:29:44,608 Unable to lock JVM memory (ENOMEM). This can result in part
of the JVM being swapped out, especially with mmapped I/O enabled. Increase RLIMIT_MEMLOCK
or run Cassandra as root.
    [junit]  WARN 23:29:44,844 Generated random token Token(bytes[196247ecfd4c826f1ebf14ed8e0d3def]).
Random tokens will result in an unbalanced ring; see http://wiki.apache.org/cassandra/Operations
    [junit] DriverManager.getConnection("jdbc:cassandra://localhost:9170/Test")
    [junit]     trying driver[className=sun.jdbc.odbc.JdbcOdbcDriver,sun.jdbc.odbc.JdbcOdbcDriver@14c28db]
    [junit] *Driver.connect (jdbc:cassandra://localhost:9170/Test)
    [junit]     trying driver[className=org.apache.cassandra.cql.jdbc.CassandraDriver,org.apache.cassandra.cql.jdbc.CassandraDriver@10e687b]
    [junit] getConnection returning driver[className=org.apache.cassandra.cql.jdbc.CassandraDriver,org.apache.cassandra.cql.jdbc.CassandraDriver@10e687b]
    [junit] ------------- ---------------- ---------------
    [junit] Testsuite: org.apache.cassandra.cql.jdbc.PreparedStatementTest
    [junit] Tests run: 6, Failures: 0, Errors: 6, Time elapsed: 0.733 sec
    [junit] 
    [junit] ------------- Standard Error -----------------
    [junit]  WARN 23:29:46,601 Unable to lock JVM memory (ENOMEM). This can result in part
of the JVM being swapped out, especially with mmapped I/O enabled. Increase RLIMIT_MEMLOCK
or run Cassandra as root.
    [junit]  WARN 23:29:46,837 Generated random token Token(bytes[f3acdac3c017b2b7d4ac7535f36006bd]).
Random tokens will result in an unbalanced ring; see http://wiki.apache.org/cassandra/Operations
    [junit] ------------- ---------------- ---------------
    [junit] Testcase: testBytes(org.apache.cassandra.cql.jdbc.PreparedStatementTest):	Caused
an ERROR
    [junit] org.apache.cassandra.cql.jdbc.CassandraPreparedStatement cannot be cast to java.lang.Comparable
    [junit] java.lang.ClassCastException: org.apache.cassandra.cql.jdbc.CassandraPreparedStatement
cannot be cast to java.lang.Comparable
    [junit] 	at java.util.concurrent.ConcurrentSkipListMap.comparable(ConcurrentSkipListMap.java:621)
    [junit] 	at java.util.concurrent.ConcurrentSkipListMap.doPut(ConcurrentSkipListMap.java:862)
    [junit] 	at java.util.concurrent.ConcurrentSkipListMap.putIfAbsent(ConcurrentSkipListMap.java:1893)
    [junit] 	at java.util.concurrent.ConcurrentSkipListSet.add(ConcurrentSkipListSet.java:202)
    [junit] 	at org.apache.cassandra.cql.jdbc.CassandraConnection.prepareStatement(CassandraConnection.java:301)
    [junit] 	at org.apache.cassandra.cql.jdbc.PreparedStatementTest.testBytes(PreparedStatementTest.java:54)
    [junit] 
    [junit] 
    [junit] Testcase: testUtf8(org.apache.cassandra.cql.jdbc.PreparedStatementTest):	Caused
an ERROR
    [junit] org.apache.cassandra.cql.jdbc.CassandraPreparedStatement cannot be cast to java.lang.Comparable
    [junit] java.lang.ClassCastException: org.apache.cassandra.cql.jdbc.CassandraPreparedStatement
cannot be cast to java.lang.Comparable
    [junit] 	at java.util.concurrent.ConcurrentSkipListMap.comparable(ConcurrentSkipListMap.java:621)
    [junit] 	at java.util.concurrent.ConcurrentSkipListMap.doPut(ConcurrentSkipListMap.java:862)
    [junit] 	at java.util.concurrent.ConcurrentSkipListMap.putIfAbsent(ConcurrentSkipListMap.java:1893)
    [junit] 	at java.util.concurrent.ConcurrentSkipListSet.add(ConcurrentSkipListSet.java:202)
    [junit] 	at org.apache.cassandra.cql.jdbc.CassandraConnection.prepareStatement(CassandraConnection.java:301)
    [junit] 	at org.apache.cassandra.cql.jdbc.PreparedStatementTest.testUtf8(PreparedStatementTest.java:114)
    [junit] 
    [junit] 
    [junit] Testcase: testAscii(org.apache.cassandra.cql.jdbc.PreparedStatementTest):	Caused
an ERROR
    [junit] org.apache.cassandra.cql.jdbc.CassandraPreparedStatement cannot be cast to java.lang.Comparable
    [junit] java.lang.ClassCastException: org.apache.cassandra.cql.jdbc.CassandraPreparedStatement
cannot be cast to java.lang.Comparable
    [junit] 	at java.util.concurrent.ConcurrentSkipListMap.comparable(ConcurrentSkipListMap.java:621)
    [junit] 	at java.util.concurrent.ConcurrentSkipListMap.doPut(ConcurrentSkipListMap.java:862)
    [junit] 	at java.util.concurrent.ConcurrentSkipListMap.putIfAbsent(ConcurrentSkipListMap.java:1893)
    [junit] 	at java.util.concurrent.ConcurrentSkipListSet.add(ConcurrentSkipListSet.java:202)
    [junit] 	at org.apache.cassandra.cql.jdbc.CassandraConnection.prepareStatement(CassandraConnection.java:301)
    [junit] 	at org.apache.cassandra.cql.jdbc.PreparedStatementTest.testAscii(PreparedStatementTest.java:174)
    [junit] 
    [junit] 
    [junit] Testcase: testLong(org.apache.cassandra.cql.jdbc.PreparedStatementTest):	Caused
an ERROR
    [junit] org.apache.cassandra.cql.jdbc.CassandraPreparedStatement cannot be cast to java.lang.Comparable
    [junit] java.lang.ClassCastException: org.apache.cassandra.cql.jdbc.CassandraPreparedStatement
cannot be cast to java.lang.Comparable
    [junit] 	at java.util.concurrent.ConcurrentSkipListMap.comparable(ConcurrentSkipListMap.java:621)
    [junit] 	at java.util.concurrent.ConcurrentSkipListMap.doPut(ConcurrentSkipListMap.java:862)
    [junit] 	at java.util.concurrent.ConcurrentSkipListMap.putIfAbsent(ConcurrentSkipListMap.java:1893)
    [junit] 	at java.util.concurrent.ConcurrentSkipListSet.add(ConcurrentSkipListSet.java:202)
    [junit] 	at org.apache.cassandra.cql.jdbc.CassandraConnection.prepareStatement(CassandraConnection.java:301)
    [junit] 	at org.apache.cassandra.cql.jdbc.PreparedStatementTest.testLong(PreparedStatementTest.java:233)
    [junit] 
    [junit] 
    [junit] Testcase: testInteger(org.apache.cassandra.cql.jdbc.PreparedStatementTest):	Caused
an ERROR
    [junit] org.apache.cassandra.cql.jdbc.CassandraPreparedStatement cannot be cast to java.lang.Comparable
    [junit] java.lang.ClassCastException: org.apache.cassandra.cql.jdbc.CassandraPreparedStatement
cannot be cast to java.lang.Comparable
    [junit] 	at java.util.concurrent.ConcurrentSkipListMap.comparable(ConcurrentSkipListMap.java:621)
    [junit] 	at java.util.concurrent.ConcurrentSkipListMap.doPut(ConcurrentSkipListMap.java:862)
    [junit] 	at java.util.concurrent.ConcurrentSkipListMap.putIfAbsent(ConcurrentSkipListMap.java:1893)
    [junit] 	at java.util.concurrent.ConcurrentSkipListSet.add(ConcurrentSkipListSet.java:202)
    [junit] 	at org.apache.cassandra.cql.jdbc.CassandraConnection.prepareStatement(CassandraConnection.java:301)
    [junit] 	at org.apache.cassandra.cql.jdbc.PreparedStatementTest.testInteger(PreparedStatementTest.java:294)
    [junit] 
    [junit] 
    [junit] Testcase: testParamSubstitution(org.apache.cassandra.cql.jdbc.PreparedStatementTest):
Caused an ERROR
    [junit] org.apache.cassandra.cql.jdbc.CassandraPreparedStatement cannot be cast to java.lang.Comparable
    [junit] java.lang.ClassCastException: org.apache.cassandra.cql.jdbc.CassandraPreparedStatement
cannot be cast to java.lang.Comparable
    [junit] 	at java.util.concurrent.ConcurrentSkipListMap.comparable(ConcurrentSkipListMap.java:621)
    [junit] 	at java.util.concurrent.ConcurrentSkipListMap.doPut(ConcurrentSkipListMap.java:862)
    [junit] 	at java.util.concurrent.ConcurrentSkipListMap.putIfAbsent(ConcurrentSkipListMap.java:1893)
    [junit] 	at java.util.concurrent.ConcurrentSkipListSet.add(ConcurrentSkipListSet.java:202)
    [junit] 	at org.apache.cassandra.cql.jdbc.CassandraConnection.prepareStatement(CassandraConnection.java:301)
    [junit] 	at org.apache.cassandra.cql.jdbc.PreparedStatementTest.testParamSubstitution(PreparedStatementTest.java:357)
    [junit] 
    [junit] 
    [junit] Test org.apache.cassandra.cql.jdbc.PreparedStatementTest FAILED

BUILD FAILED
/x1/jenkins/jenkins-slave/workspace/Cassandra/cassandra/build.xml:1086: The following error
occurred while executing this line:
/x1/jenkins/jenkins-slave/workspace/Cassandra/cassandra/build.xml:1068: Some driverunit test(s)
failed.

Total time: 14 minutes 1 second
Build step 'Invoke Ant' marked build as failure
[TASKS] Skipping publisher since build result is FAILURE
Publishing Javadoc
Archiving artifacts
Recording test results
Updating CASSANDRA-3271


Mime
View raw message