incubator-cassandra-dev mailing list archives

Site index · List index
Message view « Date » · « Thread »
Top « Date » · « Thread »
From Apache Jenkins Server <jenk...@builds.apache.org>
Subject Build failed in Jenkins: Cassandra-quick #13
Date Thu, 15 Sep 2011 03:47:58 GMT
See <https://builds.apache.org/job/Cassandra-quick/13/changes>

Changes:

[jbellis] merge from 1.0

------------------------------------------
[...truncated 2457 lines...]
    [junit] Error occurred during initialization of VM
    [junit] agent library failed to init: instrument
    [junit] Error opening zip file or JAR manifest missing : <https://builds.apache.org/job/Cassandra-quick/ws/cassandra/lib/jamm-0.2.5.jar>
    [junit] Testsuite: org.apache.cassandra.service.StorageServiceClientTest
    [junit] Tests run: 1, Failures: 0, Errors: 1, Time elapsed: 0 sec
    [junit] 
    [junit] Testcase: org.apache.cassandra.service.StorageServiceClientTest:null:	Caused an
ERROR
    [junit] Forked Java VM exited abnormally. Please note the time in the report does not
reflect the time until the VM exit.
    [junit] junit.framework.AssertionFailedError: Forked Java VM exited abnormally. Please
note the time in the report does not reflect the time until the VM exit.
    [junit] 
    [junit] 
    [junit] Test org.apache.cassandra.service.StorageServiceClientTest FAILED (crashed)
    [junit] Error occurred during initialization of VM
    [junit] Error opening zip file or JAR manifest missing : <https://builds.apache.org/job/Cassandra-quick/ws/cassandra/lib/jamm-0.2.5.jar>
    [junit] agent library failed to init: instrument
    [junit] Testsuite: org.apache.cassandra.service.StorageServiceServerTest
    [junit] Tests run: 1, Failures: 0, Errors: 1, Time elapsed: 0 sec
    [junit] 
    [junit] Testcase: org.apache.cassandra.service.StorageServiceServerTest:null:	Caused an
ERROR
    [junit] Forked Java VM exited abnormally. Please note the time in the report does not
reflect the time until the VM exit.
    [junit] junit.framework.AssertionFailedError: Forked Java VM exited abnormally. Please
note the time in the report does not reflect the time until the VM exit.
    [junit] 
    [junit] 
    [junit] Test org.apache.cassandra.service.StorageServiceServerTest FAILED (crashed)
    [junit] Error occurred during initialization of VM
    [junit] Error opening zip file or JAR manifest missing : <https://builds.apache.org/job/Cassandra-quick/ws/cassandra/lib/jamm-0.2.5.jar>
    [junit] agent library failed to init: instrument
    [junit] Testsuite: org.apache.cassandra.streaming.BootstrapTest
    [junit] Tests run: 1, Failures: 0, Errors: 1, Time elapsed: 0 sec
    [junit] 
    [junit] Testcase: org.apache.cassandra.streaming.BootstrapTest:null:	Caused an ERROR
    [junit] Forked Java VM exited abnormally. Please note the time in the report does not
reflect the time until the VM exit.
    [junit] junit.framework.AssertionFailedError: Forked Java VM exited abnormally. Please
note the time in the report does not reflect the time until the VM exit.
    [junit] 
    [junit] 
    [junit] Test org.apache.cassandra.streaming.BootstrapTest FAILED (crashed)
    [junit] Error occurred during initialization of VM
    [junit] agent library failed to init: instrument
    [junit] Error opening zip file or JAR manifest missing : <https://builds.apache.org/job/Cassandra-quick/ws/cassandra/lib/jamm-0.2.5.jar>
    [junit] Testsuite: org.apache.cassandra.streaming.SerializationsTest
    [junit] Tests run: 1, Failures: 0, Errors: 1, Time elapsed: 0 sec
    [junit] 
    [junit] Testcase: org.apache.cassandra.streaming.SerializationsTest:null:	Caused an ERROR
    [junit] Forked Java VM exited abnormally. Please note the time in the report does not
reflect the time until the VM exit.
    [junit] junit.framework.AssertionFailedError: Forked Java VM exited abnormally. Please
note the time in the report does not reflect the time until the VM exit.
    [junit] 
    [junit] 
    [junit] Test org.apache.cassandra.streaming.SerializationsTest FAILED (crashed)
    [junit] Error occurred during initialization of VM
    [junit] Error opening zip file or JAR manifest missing : <https://builds.apache.org/job/Cassandra-quick/ws/cassandra/lib/jamm-0.2.5.jar>
    [junit] agent library failed to init: instrument
    [junit] Testsuite: org.apache.cassandra.streaming.StreamingTransferTest
    [junit] Tests run: 1, Failures: 0, Errors: 1, Time elapsed: 0 sec
    [junit] 
    [junit] Testcase: org.apache.cassandra.streaming.StreamingTransferTest:null:	Caused an
ERROR
    [junit] Forked Java VM exited abnormally. Please note the time in the report does not
reflect the time until the VM exit.
    [junit] junit.framework.AssertionFailedError: Forked Java VM exited abnormally. Please
note the time in the report does not reflect the time until the VM exit.
    [junit] 
    [junit] 
    [junit] Test org.apache.cassandra.streaming.StreamingTransferTest FAILED (crashed)
    [junit] Error occurred during initialization of VM
    [junit] agent library failed to init: instrument
    [junit] Error opening zip file or JAR manifest missing : <https://builds.apache.org/job/Cassandra-quick/ws/cassandra/lib/jamm-0.2.5.jar>
    [junit] Testsuite: org.apache.cassandra.thrift.ThriftValidationTest
    [junit] Tests run: 1, Failures: 0, Errors: 1, Time elapsed: 0 sec
    [junit] 
    [junit] Testcase: org.apache.cassandra.thrift.ThriftValidationTest:null:	Caused an ERROR
    [junit] Forked Java VM exited abnormally. Please note the time in the report does not
reflect the time until the VM exit.
    [junit] junit.framework.AssertionFailedError: Forked Java VM exited abnormally. Please
note the time in the report does not reflect the time until the VM exit.
    [junit] 
    [junit] 
    [junit] Test org.apache.cassandra.thrift.ThriftValidationTest FAILED (crashed)
    [junit] Error occurred during initialization of VM
    [junit] agent library failed to init: instrument
    [junit] Error opening zip file or JAR manifest missing : <https://builds.apache.org/job/Cassandra-quick/ws/cassandra/lib/jamm-0.2.5.jar>
    [junit] Testsuite: org.apache.cassandra.tools.SSTableExportTest
    [junit] Tests run: 1, Failures: 0, Errors: 1, Time elapsed: 0 sec
    [junit] 
    [junit] Testcase: org.apache.cassandra.tools.SSTableExportTest:null:	Caused an ERROR
    [junit] Forked Java VM exited abnormally. Please note the time in the report does not
reflect the time until the VM exit.
    [junit] junit.framework.AssertionFailedError: Forked Java VM exited abnormally. Please
note the time in the report does not reflect the time until the VM exit.
    [junit] 
    [junit] 
    [junit] Test org.apache.cassandra.tools.SSTableExportTest FAILED (crashed)
    [junit] Error occurred during initialization of VM
    [junit] agent library failed to init: instrument
    [junit] Error opening zip file or JAR manifest missing : <https://builds.apache.org/job/Cassandra-quick/ws/cassandra/lib/jamm-0.2.5.jar>
    [junit] Testsuite: org.apache.cassandra.tools.SSTableImportTest
    [junit] Tests run: 1, Failures: 0, Errors: 1, Time elapsed: 0 sec
    [junit] 
    [junit] Testcase: org.apache.cassandra.tools.SSTableImportTest:null:	Caused an ERROR
    [junit] Forked Java VM exited abnormally. Please note the time in the report does not
reflect the time until the VM exit.
    [junit] junit.framework.AssertionFailedError: Forked Java VM exited abnormally. Please
note the time in the report does not reflect the time until the VM exit.
    [junit] 
    [junit] 
    [junit] Test org.apache.cassandra.tools.SSTableImportTest FAILED (crashed)
    [junit] Error occurred during initialization of VM
    [junit] Error opening zip file or JAR manifest missing : <https://builds.apache.org/job/Cassandra-quick/ws/cassandra/lib/jamm-0.2.5.jar>
    [junit] agent library failed to init: instrument
    [junit] Testsuite: org.apache.cassandra.utils.BloomFilterTest
    [junit] Tests run: 1, Failures: 0, Errors: 1, Time elapsed: 0 sec
    [junit] 
    [junit] Testcase: org.apache.cassandra.utils.BloomFilterTest:null:	Caused an ERROR
    [junit] Forked Java VM exited abnormally. Please note the time in the report does not
reflect the time until the VM exit.
    [junit] junit.framework.AssertionFailedError: Forked Java VM exited abnormally. Please
note the time in the report does not reflect the time until the VM exit.
    [junit] 
    [junit] 
    [junit] Test org.apache.cassandra.utils.BloomFilterTest FAILED (crashed)
    [junit] Error occurred during initialization of VM
    [junit] Error opening zip file or JAR manifest missing : <https://builds.apache.org/job/Cassandra-quick/ws/cassandra/lib/jamm-0.2.5.jar>
    [junit] agent library failed to init: instrument
    [junit] Testsuite: org.apache.cassandra.utils.BoundedStatsDequeTest
    [junit] Tests run: 1, Failures: 0, Errors: 1, Time elapsed: 0 sec
    [junit] 
    [junit] Testcase: org.apache.cassandra.utils.BoundedStatsDequeTest:null:	Caused an ERROR
    [junit] Forked Java VM exited abnormally. Please note the time in the report does not
reflect the time until the VM exit.
    [junit] junit.framework.AssertionFailedError: Forked Java VM exited abnormally. Please
note the time in the report does not reflect the time until the VM exit.
    [junit] 
    [junit] 
    [junit] Test org.apache.cassandra.utils.BoundedStatsDequeTest FAILED (crashed)
    [junit] Error occurred during initialization of VM
    [junit] Error opening zip file or JAR manifest missing : <https://builds.apache.org/job/Cassandra-quick/ws/cassandra/lib/jamm-0.2.5.jar>
    [junit] agent library failed to init: instrument
    [junit] Testsuite: org.apache.cassandra.utils.ByteBufferUtilTest
    [junit] Tests run: 1, Failures: 0, Errors: 1, Time elapsed: 0 sec
    [junit] 
    [junit] Testcase: org.apache.cassandra.utils.ByteBufferUtilTest:null:	Caused an ERROR
    [junit] Forked Java VM exited abnormally. Please note the time in the report does not
reflect the time until the VM exit.
    [junit] junit.framework.AssertionFailedError: Forked Java VM exited abnormally. Please
note the time in the report does not reflect the time until the VM exit.
    [junit] 
    [junit] 
    [junit] Test org.apache.cassandra.utils.ByteBufferUtilTest FAILED (crashed)
    [junit] Error occurred during initialization of VM
    [junit] Error opening zip file or JAR manifest missing : <https://builds.apache.org/job/Cassandra-quick/ws/cassandra/lib/jamm-0.2.5.jar>
    [junit] agent library failed to init: instrument
    [junit] Testsuite: org.apache.cassandra.utils.BytesReadTrackerTest
    [junit] Tests run: 1, Failures: 0, Errors: 1, Time elapsed: 0 sec
    [junit] 
    [junit] Testcase: org.apache.cassandra.utils.BytesReadTrackerTest:null:	Caused an ERROR
    [junit] Forked Java VM exited abnormally. Please note the time in the report does not
reflect the time until the VM exit.
    [junit] junit.framework.AssertionFailedError: Forked Java VM exited abnormally. Please
note the time in the report does not reflect the time until the VM exit.
    [junit] 
    [junit] 
    [junit] Test org.apache.cassandra.utils.BytesReadTrackerTest FAILED (crashed)
    [junit] Error opening zip file or JAR manifest missing : <https://builds.apache.org/job/Cassandra-quick/ws/cassandra/lib/jamm-0.2.5.jar>
    [junit] Error occurred during initialization of VM
    [junit] agent library failed to init: instrument
    [junit] Testsuite: org.apache.cassandra.utils.EstimatedHistogramTest
    [junit] Tests run: 1, Failures: 0, Errors: 1, Time elapsed: 0 sec
    [junit] 
    [junit] Testcase: org.apache.cassandra.utils.EstimatedHistogramTest:null:	Caused an ERROR
    [junit] Forked Java VM exited abnormally. Please note the time in the report does not
reflect the time until the VM exit.
    [junit] junit.framework.AssertionFailedError: Forked Java VM exited abnormally. Please
note the time in the report does not reflect the time until the VM exit.
    [junit] 
    [junit] 
    [junit] Test org.apache.cassandra.utils.EstimatedHistogramTest FAILED (crashed)
    [junit] Error occurred during initialization of VM
    [junit] Error opening zip file or JAR manifest missing : <https://builds.apache.org/job/Cassandra-quick/ws/cassandra/lib/jamm-0.2.5.jar>
    [junit] agent library failed to init: instrument
    [junit] Testsuite: org.apache.cassandra.utils.FBUtilitiesTest
    [junit] Tests run: 1, Failures: 0, Errors: 1, Time elapsed: 0 sec
    [junit] 
    [junit] Testcase: org.apache.cassandra.utils.FBUtilitiesTest:null:	Caused an ERROR
    [junit] Forked Java VM exited abnormally. Please note the time in the report does not
reflect the time until the VM exit.
    [junit] junit.framework.AssertionFailedError: Forked Java VM exited abnormally. Please
note the time in the report does not reflect the time until the VM exit.
    [junit] 
    [junit] 
    [junit] Test org.apache.cassandra.utils.FBUtilitiesTest FAILED (crashed)
    [junit] Error occurred during initialization of VM
    [junit] Error opening zip file or JAR manifest missing : <https://builds.apache.org/job/Cassandra-quick/ws/cassandra/lib/jamm-0.2.5.jar>
    [junit] agent library failed to init: instrument
    [junit] Testsuite: org.apache.cassandra.utils.IntervalTest
    [junit] Tests run: 1, Failures: 0, Errors: 1, Time elapsed: 0 sec
    [junit] 
    [junit] Testcase: org.apache.cassandra.utils.IntervalTest:null:	Caused an ERROR
    [junit] Forked Java VM exited abnormally. Please note the time in the report does not
reflect the time until the VM exit.
    [junit] junit.framework.AssertionFailedError: Forked Java VM exited abnormally. Please
note the time in the report does not reflect the time until the VM exit.
    [junit] 
    [junit] 
    [junit] Test org.apache.cassandra.utils.IntervalTest FAILED (crashed)
    [junit] Error occurred during initialization of VM
    [junit] agent library failed to init: instrument
    [junit] Error opening zip file or JAR manifest missing : <https://builds.apache.org/job/Cassandra-quick/ws/cassandra/lib/jamm-0.2.5.jar>
    [junit] Testsuite: org.apache.cassandra.utils.IntervalTreeTest
    [junit] Tests run: 1, Failures: 0, Errors: 1, Time elapsed: 0 sec
    [junit] 
    [junit] Testcase: org.apache.cassandra.utils.IntervalTreeTest:null:	Caused an ERROR
    [junit] Forked Java VM exited abnormally. Please note the time in the report does not
reflect the time until the VM exit.
    [junit] junit.framework.AssertionFailedError: Forked Java VM exited abnormally. Please
note the time in the report does not reflect the time until the VM exit.
    [junit] 
    [junit] 
    [junit] Test org.apache.cassandra.utils.IntervalTreeTest FAILED (crashed)
    [junit] Error occurred during initialization of VM
    [junit] Error opening zip file or JAR manifest missing : <https://builds.apache.org/job/Cassandra-quick/ws/cassandra/lib/jamm-0.2.5.jar>
    [junit] agent library failed to init: instrument
    [junit] Testsuite: org.apache.cassandra.utils.LegacyBloomFilterTest
    [junit] Tests run: 1, Failures: 0, Errors: 1, Time elapsed: 0 sec
    [junit] 
    [junit] Testcase: org.apache.cassandra.utils.LegacyBloomFilterTest:null:	Caused an ERROR
    [junit] Forked Java VM exited abnormally. Please note the time in the report does not
reflect the time until the VM exit.
    [junit] junit.framework.AssertionFailedError: Forked Java VM exited abnormally. Please
note the time in the report does not reflect the time until the VM exit.
    [junit] 
    [junit] 
    [junit] Test org.apache.cassandra.utils.LegacyBloomFilterTest FAILED (crashed)
    [junit] Error occurred during initialization of VM
    [junit] Error opening zip file or JAR manifest missing : <https://builds.apache.org/job/Cassandra-quick/ws/cassandra/lib/jamm-0.2.5.jar>
    [junit] agent library failed to init: instrument
    [junit] Testsuite: org.apache.cassandra.utils.MergeIteratorTest
    [junit] Tests run: 1, Failures: 0, Errors: 1, Time elapsed: 0 sec
    [junit] 
    [junit] Testcase: org.apache.cassandra.utils.MergeIteratorTest:null:	Caused an ERROR
    [junit] Forked Java VM exited abnormally. Please note the time in the report does not
reflect the time until the VM exit.
    [junit] junit.framework.AssertionFailedError: Forked Java VM exited abnormally. Please
note the time in the report does not reflect the time until the VM exit.
    [junit] 
    [junit] 
    [junit] Test org.apache.cassandra.utils.MergeIteratorTest FAILED (crashed)
    [junit] Error occurred during initialization of VM
    [junit] Error opening zip file or JAR manifest missing : <https://builds.apache.org/job/Cassandra-quick/ws/cassandra/lib/jamm-0.2.5.jar>
    [junit] agent library failed to init: instrument
    [junit] Testsuite: org.apache.cassandra.utils.MerkleTreeTest
    [junit] Tests run: 1, Failures: 0, Errors: 1, Time elapsed: 0 sec
    [junit] 
    [junit] Testcase: org.apache.cassandra.utils.MerkleTreeTest:null:	Caused an ERROR
    [junit] Forked Java VM exited abnormally. Please note the time in the report does not
reflect the time until the VM exit.
    [junit] junit.framework.AssertionFailedError: Forked Java VM exited abnormally. Please
note the time in the report does not reflect the time until the VM exit.
    [junit] 
    [junit] 
    [junit] Test org.apache.cassandra.utils.MerkleTreeTest FAILED (crashed)
    [junit] Error occurred during initialization of VM
    [junit] agent library failed to init: instrument
    [junit] Error opening zip file or JAR manifest missing : <https://builds.apache.org/job/Cassandra-quick/ws/cassandra/lib/jamm-0.2.5.jar>
    [junit] Testsuite: org.apache.cassandra.utils.SerializationsTest
    [junit] Tests run: 1, Failures: 0, Errors: 1, Time elapsed: 0 sec
    [junit] 
    [junit] Testcase: org.apache.cassandra.utils.SerializationsTest:null:	Caused an ERROR
    [junit] Forked Java VM exited abnormally. Please note the time in the report does not
reflect the time until the VM exit.
    [junit] junit.framework.AssertionFailedError: Forked Java VM exited abnormally. Please
note the time in the report does not reflect the time until the VM exit.
    [junit] 
    [junit] 
    [junit] Test org.apache.cassandra.utils.SerializationsTest FAILED (crashed)

BUILD FAILED
<https://builds.apache.org/job/Cassandra-quick/ws/cassandra/build.xml>:1081: The following
error occurred while executing this line:
<https://builds.apache.org/job/Cassandra-quick/ws/cassandra/build.xml>:1067: Some unit
test(s) failed.

Total time: 1 minute 20 seconds
Build step 'Invoke Ant' marked build as failure
[TASKS] Skipping publisher since build result is FAILURE
Recording test results


Mime
View raw message