incubator-cassandra-dev mailing list archives

Site index · List index
Message view « Date » · « Thread »
Top « Date » · « Thread »
From Apache Jenkins Server <jenk...@builds.apache.org>
Subject Build failed in Jenkins: Cassandra #1109
Date Tue, 13 Sep 2011 18:21:56 GMT
See <https://builds.apache.org/job/Cassandra/1109/changes>

Changes:

[slebresne] merge from 1.0

[slebresne] merge from 1.0

------------------------------------------
[...truncated 2261 lines...]
    [junit] 
    [junit] Testsuite: org.apache.cassandra.locator.NetworkTopologyStrategyTest
    [junit] Tests run: 2, Failures: 0, Errors: 0, Time elapsed: 0.454 sec
    [junit] 
    [junit] Testsuite: org.apache.cassandra.locator.OldNetworkTopologyStrategyTest
    [junit] Tests run: 3, Failures: 0, Errors: 0, Time elapsed: 0.161 sec
    [junit] 
    [junit] Testsuite: org.apache.cassandra.locator.ReplicationStrategyEndpointCacheTest
    [junit] Tests run: 2, Failures: 0, Errors: 0, Time elapsed: 0.519 sec
    [junit] 
    [junit] Testsuite: org.apache.cassandra.locator.SimpleStrategyTest
    [junit] Tests run: 4, Failures: 0, Errors: 0, Time elapsed: 0.664 sec
    [junit] 
    [junit] Testsuite: org.apache.cassandra.locator.TokenMetadataTest
    [junit] Tests run: 3, Failures: 0, Errors: 0, Time elapsed: 0.428 sec
    [junit] 
    [junit] Testsuite: org.apache.cassandra.service.AntiEntropyServiceCounterTest
    [junit] Tests run: 6, Failures: 1, Errors: 0, Time elapsed: 1.344 sec
    [junit] 
    [junit] ------------- Standard Error -----------------
    [junit]  WARN 18:19:22,366 Generated random token Token(bytes[6701681d7d6dd1d07f984c792b0dec92]).
Random tokens will result in an unbalanced ring; see http://wiki.apache.org/cassandra/Operations
    [junit] ------------- ---------------- ---------------
    [junit] Testcase: testDifferencer(org.apache.cassandra.service.AntiEntropyServiceCounterTest):
FAILED
    [junit] null
    [junit] junit.framework.AssertionFailedError
    [junit] 	at org.apache.cassandra.service.AntiEntropyService$Validator.prepare(AntiEntropyService.java:279)
    [junit] 	at org.apache.cassandra.service.AntiEntropyServiceTestAbstract.testDifferencer(AntiEntropyServiceTestAbstract.java:209)
    [junit] 
    [junit] 
    [junit] Test org.apache.cassandra.service.AntiEntropyServiceCounterTest FAILED
    [junit] Testsuite: org.apache.cassandra.service.AntiEntropyServiceStandardTest
    [junit] Tests run: 6, Failures: 0, Errors: 0, Time elapsed: 1.224 sec
    [junit] 
    [junit] ------------- Standard Error -----------------
    [junit]  WARN 18:19:24,633 Generated random token Token(bytes[740cc3c39ba02769ac6b8ed1dfca5373]).
Random tokens will result in an unbalanced ring; see http://wiki.apache.org/cassandra/Operations
    [junit] ------------- ---------------- ---------------
    [junit] Testsuite: org.apache.cassandra.service.CassandraServerTest
    [junit] Tests run: 1, Failures: 0, Errors: 0, Time elapsed: 0.437 sec
    [junit] 
    [junit] Testsuite: org.apache.cassandra.service.ConsistencyLevelTest
    [junit] Tests run: 1, Failures: 0, Errors: 0, Time elapsed: 0.721 sec
    [junit] 
    [junit] Testsuite: org.apache.cassandra.service.EmbeddedCassandraServiceTest
    [junit] Tests run: 1, Failures: 0, Errors: 0, Time elapsed: 0.922 sec
    [junit] 
    [junit] ------------- Standard Error -----------------
    [junit]  WARN 18:19:29,398 Unable to lock JVM memory (ENOMEM). This can result in part
of the JVM being swapped out, especially with mmapped I/O enabled. Increase RLIMIT_MEMLOCK
or run Cassandra as root.
    [junit]  WARN 18:19:29,732 Generated random token Token(bytes[5e0c0911dac07f449fedc4b08e6fae0a]).
Random tokens will result in an unbalanced ring; see http://wiki.apache.org/cassandra/Operations
    [junit] ------------- ---------------- ---------------
    [junit] Testsuite: org.apache.cassandra.service.InitClientTest
    [junit] Tests run: 1, Failures: 0, Errors: 0, Time elapsed: 0.437 sec
    [junit] 
    [junit] Testsuite: org.apache.cassandra.service.LeaveAndBootstrapTest
    [junit] Tests run: 6, Failures: 0, Errors: 0, Time elapsed: 1.591 sec
    [junit] 
    [junit] ------------- Standard Error -----------------
    [junit]  WARN 18:19:34,011 Node /127.0.0.3 'leaving' token mismatch. Long network partition?
    [junit] ------------- ---------------- ---------------
    [junit] Testsuite: org.apache.cassandra.service.MoveTest
    [junit] Tests run: 3, Failures: 0, Errors: 0, Time elapsed: 1.115 sec
    [junit] 
    [junit] Testsuite: org.apache.cassandra.service.RemoveTest
    [junit] Tests run: 3, Failures: 0, Errors: 0, Time elapsed: 3.932 sec
    [junit] 
    [junit] Testsuite: org.apache.cassandra.service.RowResolverTest
    [junit] Tests run: 8, Failures: 0, Errors: 0, Time elapsed: 0.418 sec
    [junit] 
    [junit] Testsuite: org.apache.cassandra.service.SerializationsTest
    [junit] Tests run: 2, Failures: 0, Errors: 0, Time elapsed: 0.156 sec
    [junit] 
    [junit] Testsuite: org.apache.cassandra.service.StorageProxyTest
    [junit] Tests run: 4, Failures: 0, Errors: 0, Time elapsed: 0.456 sec
    [junit] 
    [junit] Testsuite: org.apache.cassandra.service.StorageServiceClientTest
    [junit] Tests run: 1, Failures: 0, Errors: 0, Time elapsed: 1.479 sec
    [junit] 
    [junit] ------------- Standard Error -----------------
    [junit] Exception in thread "GossipTasks:1" java.util.concurrent.CancellationException
    [junit] 	at java.util.concurrent.FutureTask$Sync.innerGet(FutureTask.java:220)
    [junit] 	at java.util.concurrent.FutureTask.get(FutureTask.java:83)
    [junit] 	at org.apache.cassandra.concurrent.DebuggableThreadPoolExecutor.logExceptionsAfterExecute(DebuggableThreadPoolExecutor.java:123)
    [junit] 	at org.apache.cassandra.concurrent.DebuggableScheduledThreadPoolExecutor.afterExecute(DebuggableScheduledThreadPoolExecutor.java:47)
    [junit] 	at java.util.concurrent.ThreadPoolExecutor$Worker.runTask(ThreadPoolExecutor.java:888)
    [junit] 	at java.util.concurrent.ThreadPoolExecutor$Worker.run(ThreadPoolExecutor.java:908)
    [junit] 	at java.lang.Thread.run(Thread.java:619)
    [junit] ------------- ---------------- ---------------
    [junit] Testsuite: org.apache.cassandra.service.StorageServiceServerTest
    [junit] Tests run: 3, Failures: 0, Errors: 0, Time elapsed: 1.726 sec
    [junit] 
    [junit] ------------- Standard Error -----------------
    [junit]  WARN 18:19:48,867 Generated random token Token(bytes[9bebc274f50b5ddfdd439616715ad951]).
Random tokens will result in an unbalanced ring; see http://wiki.apache.org/cassandra/Operations
    [junit] Exception in thread "GossipTasks:1" java.util.concurrent.CancellationException
    [junit] 	at java.util.concurrent.FutureTask$Sync.innerGet(FutureTask.java:220)
    [junit] 	at java.util.concurrent.FutureTask.get(FutureTask.java:83)
    [junit] 	at org.apache.cassandra.concurrent.DebuggableThreadPoolExecutor.logExceptionsAfterExecute(DebuggableThreadPoolExecutor.java:123)
    [junit] 	at org.apache.cassandra.concurrent.DebuggableScheduledThreadPoolExecutor.afterExecute(DebuggableScheduledThreadPoolExecutor.java:47)
    [junit] 	at java.util.concurrent.ThreadPoolExecutor$Worker.runTask(ThreadPoolExecutor.java:888)
    [junit] 	at java.util.concurrent.ThreadPoolExecutor$Worker.run(ThreadPoolExecutor.java:908)
    [junit] 	at java.lang.Thread.run(Thread.java:619)
    [junit] ------------- ---------------- ---------------
    [junit] Testsuite: org.apache.cassandra.streaming.BootstrapTest
    [junit] Tests run: 1, Failures: 0, Errors: 0, Time elapsed: 0.564 sec
    [junit] 
    [junit] Testsuite: org.apache.cassandra.streaming.SerializationsTest
    [junit] Tests run: 4, Failures: 0, Errors: 0, Time elapsed: 0.473 sec
    [junit] 
    [junit] Testsuite: org.apache.cassandra.streaming.StreamingTransferTest
    [junit] Tests run: 5, Failures: 0, Errors: 0, Time elapsed: 1.056 sec
    [junit] 
    [junit] ------------- Standard Error -----------------
    [junit]  WARN 18:19:54,132 Generated random token Token(bytes[3330dd4ae149b0b82884e9a7f7bd26e7]).
Random tokens will result in an unbalanced ring; see http://wiki.apache.org/cassandra/Operations
    [junit] ERROR 18:19:54,469 Fatal exception in thread Thread[Thread-3,5,main]
    [junit] java.lang.NullPointerException
    [junit] 	at org.cliffc.high_scale_lib.NonBlockingHashMap.hash(NonBlockingHashMap.java:113)
    [junit] 	at org.cliffc.high_scale_lib.NonBlockingHashMap.putIfMatch(NonBlockingHashMap.java:553)
    [junit] 	at org.cliffc.high_scale_lib.NonBlockingHashMap.putIfMatch(NonBlockingHashMap.java:348)
    [junit] 	at org.cliffc.high_scale_lib.NonBlockingHashMap.remove(NonBlockingHashMap.java:327)
    [junit] 	at org.apache.cassandra.gms.Gossiper.resetVersion(Gossiper.java:223)
    [junit] 	at org.apache.cassandra.net.IncomingTcpConnection.close(IncomingTcpConnection.java:163)
    [junit] 	at org.apache.cassandra.net.IncomingTcpConnection.run(IncomingTcpConnection.java:125)
    [junit] ERROR 18:19:54,560 Fatal exception in thread Thread[Thread-4,5,main]
    [junit] java.lang.NullPointerException
    [junit] 	at org.cliffc.high_scale_lib.NonBlockingHashMap.hash(NonBlockingHashMap.java:113)
    [junit] 	at org.cliffc.high_scale_lib.NonBlockingHashMap.putIfMatch(NonBlockingHashMap.java:553)
    [junit] 	at org.cliffc.high_scale_lib.NonBlockingHashMap.putIfMatch(NonBlockingHashMap.java:348)
    [junit] 	at org.cliffc.high_scale_lib.NonBlockingHashMap.remove(NonBlockingHashMap.java:327)
    [junit] 	at org.apache.cassandra.gms.Gossiper.resetVersion(Gossiper.java:223)
    [junit] 	at org.apache.cassandra.net.IncomingTcpConnection.close(IncomingTcpConnection.java:163)
    [junit] 	at org.apache.cassandra.net.IncomingTcpConnection.run(IncomingTcpConnection.java:125)
    [junit] ERROR 18:19:54,648 Fatal exception in thread Thread[Thread-5,5,main]
    [junit] java.lang.NullPointerException
    [junit] 	at org.cliffc.high_scale_lib.NonBlockingHashMap.hash(NonBlockingHashMap.java:113)
    [junit] 	at org.cliffc.high_scale_lib.NonBlockingHashMap.putIfMatch(NonBlockingHashMap.java:553)
    [junit] 	at org.cliffc.high_scale_lib.NonBlockingHashMap.putIfMatch(NonBlockingHashMap.java:348)
    [junit] 	at org.cliffc.high_scale_lib.NonBlockingHashMap.remove(NonBlockingHashMap.java:327)
    [junit] 	at org.apache.cassandra.gms.Gossiper.resetVersion(Gossiper.java:223)
    [junit] 	at org.apache.cassandra.net.IncomingTcpConnection.close(IncomingTcpConnection.java:163)
    [junit] 	at org.apache.cassandra.net.IncomingTcpConnection.run(IncomingTcpConnection.java:125)
    [junit] ERROR 18:19:54,706 Fatal exception in thread Thread[Thread-6,5,main]
    [junit] java.lang.NullPointerException
    [junit] 	at org.cliffc.high_scale_lib.NonBlockingHashMap.hash(NonBlockingHashMap.java:113)
    [junit] 	at org.cliffc.high_scale_lib.NonBlockingHashMap.putIfMatch(NonBlockingHashMap.java:553)
    [junit] 	at org.cliffc.high_scale_lib.NonBlockingHashMap.putIfMatch(NonBlockingHashMap.java:348)
    [junit] 	at org.cliffc.high_scale_lib.NonBlockingHashMap.remove(NonBlockingHashMap.java:327)
    [junit] 	at org.apache.cassandra.gms.Gossiper.resetVersion(Gossiper.java:223)
    [junit] 	at org.apache.cassandra.net.IncomingTcpConnection.close(IncomingTcpConnection.java:163)
    [junit] 	at org.apache.cassandra.net.IncomingTcpConnection.run(IncomingTcpConnection.java:125)
    [junit] ERROR 18:19:54,757 Fatal exception in thread Thread[Thread-7,5,main]
    [junit] java.lang.NullPointerException
    [junit] 	at org.cliffc.high_scale_lib.NonBlockingHashMap.hash(NonBlockingHashMap.java:113)
    [junit] 	at org.cliffc.high_scale_lib.NonBlockingHashMap.putIfMatch(NonBlockingHashMap.java:553)
    [junit] 	at org.cliffc.high_scale_lib.NonBlockingHashMap.putIfMatch(NonBlockingHashMap.java:348)
    [junit] 	at org.cliffc.high_scale_lib.NonBlockingHashMap.remove(NonBlockingHashMap.java:327)
    [junit] 	at org.apache.cassandra.gms.Gossiper.resetVersion(Gossiper.java:223)
    [junit] 	at org.apache.cassandra.net.IncomingTcpConnection.close(IncomingTcpConnection.java:163)
    [junit] 	at org.apache.cassandra.net.IncomingTcpConnection.run(IncomingTcpConnection.java:125)
    [junit] ERROR 18:19:54,829 Fatal exception in thread Thread[Thread-8,5,main]
    [junit] java.lang.NullPointerException
    [junit] 	at org.cliffc.high_scale_lib.NonBlockingHashMap.hash(NonBlockingHashMap.java:113)
    [junit] 	at org.cliffc.high_scale_lib.NonBlockingHashMap.putIfMatch(NonBlockingHashMap.java:553)
    [junit] 	at org.cliffc.high_scale_lib.NonBlockingHashMap.putIfMatch(NonBlockingHashMap.java:348)
    [junit] 	at org.cliffc.high_scale_lib.NonBlockingHashMap.remove(NonBlockingHashMap.java:327)
    [junit] 	at org.apache.cassandra.gms.Gossiper.resetVersion(Gossiper.java:223)
    [junit] 	at org.apache.cassandra.net.IncomingTcpConnection.close(IncomingTcpConnection.java:163)
    [junit] 	at org.apache.cassandra.net.IncomingTcpConnection.run(IncomingTcpConnection.java:125)
    [junit] ERROR 18:19:54,867 Fatal exception in thread Thread[Thread-9,5,main]
    [junit] java.lang.NullPointerException
    [junit] 	at org.cliffc.high_scale_lib.NonBlockingHashMap.hash(NonBlockingHashMap.java:113)
    [junit] 	at org.cliffc.high_scale_lib.NonBlockingHashMap.putIfMatch(NonBlockingHashMap.java:553)
    [junit] 	at org.cliffc.high_scale_lib.NonBlockingHashMap.putIfMatch(NonBlockingHashMap.java:348)
    [junit] 	at org.cliffc.high_scale_lib.NonBlockingHashMap.remove(NonBlockingHashMap.java:327)
    [junit] 	at org.apache.cassandra.gms.Gossiper.resetVersion(Gossiper.java:223)
    [junit] 	at org.apache.cassandra.net.IncomingTcpConnection.close(IncomingTcpConnection.java:163)
    [junit] 	at org.apache.cassandra.net.IncomingTcpConnection.run(IncomingTcpConnection.java:125)
    [junit] ------------- ---------------- ---------------
    [junit] Testsuite: org.apache.cassandra.thrift.ThriftValidationTest
    [junit] Tests run: 5, Failures: 0, Errors: 0, Time elapsed: 0.693 sec
    [junit] 
    [junit] Testsuite: org.apache.cassandra.tools.SSTableExportTest
    [junit] Tests run: 6, Failures: 0, Errors: 0, Time elapsed: 0.88 sec
    [junit] 
    [junit] ------------- Standard Output ---------------
    [junit] Importing 1 keys...
    [junit] 1 keys imported successfully.
    [junit] ------------- ---------------- ---------------
    [junit] Testsuite: org.apache.cassandra.tools.SSTableImportTest
    [junit] Tests run: 5, Failures: 0, Errors: 0, Time elapsed: 0.724 sec
    [junit] 
    [junit] ------------- Standard Output ---------------
    [junit] Importing 2 keys...
    [junit] 2 keys imported successfully.
    [junit] Importing 2 keys...
    [junit] 2 keys imported successfully.
    [junit] Importing 2 keys...
    [junit] 2 keys imported successfully.
    [junit] Importing 3 keys...
    [junit] Importing 3 keys...
    [junit] 1 keys imported successfully.
    [junit] ------------- ---------------- ---------------
    [junit] ------------- Standard Error -----------------
    [junit] Line 2: Key 303630 is greater than previous, collection is not sorted properly.
Aborting import. You might need to delete SSTables manually.
    [junit] ------------- ---------------- ---------------
    [junit] Testsuite: org.apache.cassandra.utils.BloomFilterTest
    [junit] Tests run: 7, Failures: 0, Errors: 0, Time elapsed: 0.493 sec
    [junit] 
    [junit] Testsuite: org.apache.cassandra.utils.BoundedStatsDequeTest
    [junit] Tests run: 1, Failures: 0, Errors: 0, Time elapsed: 0.056 sec
    [junit] 
    [junit] Testsuite: org.apache.cassandra.utils.ByteBufferUtilTest
    [junit] Tests run: 10, Failures: 0, Errors: 0, Time elapsed: 0.153 sec
    [junit] 
    [junit] Testsuite: org.apache.cassandra.utils.BytesReadTrackerTest
    [junit] Tests run: 4, Failures: 0, Errors: 0, Time elapsed: 0.058 sec
    [junit] 
    [junit] Testsuite: org.apache.cassandra.utils.EstimatedHistogramTest
    [junit] Tests run: 4, Failures: 0, Errors: 0, Time elapsed: 0.059 sec
    [junit] 
    [junit] Testsuite: org.apache.cassandra.utils.FBUtilitiesTest
    [junit] Tests run: 5, Failures: 0, Errors: 0, Time elapsed: 0.146 sec
    [junit] 
    [junit] Testsuite: org.apache.cassandra.utils.IntervalTest
    [junit] Tests run: 3, Failures: 0, Errors: 0, Time elapsed: 0.06 sec
    [junit] 
    [junit] Testsuite: org.apache.cassandra.utils.IntervalTreeTest
    [junit] Tests run: 1, Failures: 0, Errors: 0, Time elapsed: 0.07 sec
    [junit] 
    [junit] Testsuite: org.apache.cassandra.utils.LegacyBloomFilterTest
    [junit] Tests run: 6, Failures: 0, Errors: 0, Time elapsed: 0.439 sec
    [junit] 
    [junit] Testsuite: org.apache.cassandra.utils.MergeIteratorTest
    [junit] Tests run: 2, Failures: 0, Errors: 0, Time elapsed: 0.074 sec
    [junit] 
    [junit] Testsuite: org.apache.cassandra.utils.MerkleTreeTest
    [junit] Tests run: 12, Failures: 0, Errors: 0, Time elapsed: 0.434 sec
    [junit] 
    [junit] Testsuite: org.apache.cassandra.utils.SerializationsTest
    [junit] Tests run: 3, Failures: 0, Errors: 0, Time elapsed: 0.667 sec
    [junit] 

BUILD FAILED
<https://builds.apache.org/job/Cassandra/ws/cassandra/build.xml>:1081: The following
error occurred while executing this line:
<https://builds.apache.org/job/Cassandra/ws/cassandra/build.xml>:1067: Some unit test(s)
failed.

Total time: 18 minutes 30 seconds
Build step 'Invoke Ant' marked build as failure
[TASKS] Skipping publisher since build result is FAILURE
Publishing Javadoc
Archiving artifacts
Recording test results


Mime
View raw message