incubator-cassandra-dev mailing list archives

Site index · List index
Message view « Date » · « Thread »
Top « Date » · « Thread »
From Jesse Melton <jzmel...@gmail.com>
Subject Re: Build failed in Jenkins: Cassandra-0.8 #80
Date Sun, 08 May 2011 02:26:23 GMT
Unsubscribe me. The automated unsubscribe is broken & has been for weeks.

On May 7, 2011 10:24 PM, "Apache Jenkins Server" <hudson@hudson.apache.org>
wrote:

See <https://builds.apache.org/hudson/job/Cassandra-0.8/80/changes>

Changes:

[jbellis] add note about drain to News

[jbellis] fix potential double-application of counter updates on commitlog
replay
patch by slebresne and jbellis for CASSANDRA-2419

------------------------------------------
[...truncated 1986 lines...]
   [junit] ------------- Standard Error -----------------
   [junit]  WARN 02:20:16,484 Generated random token
Token(bytes[e8991c8be2099f255726d6b263505054]). Random tokens will result in
an unbalanced ring; see http://wiki.apache.org/cassandra/Operations
   [junit] ------------- ---------------- ---------------
   [junit] Testsuite: org.apache.cassandra.dht.ByteOrderedPartitionerTest
   [junit] Tests run: 5, Failures: 0, Errors: 0, Time elapsed: 1.141 sec
   [junit]
   [junit] Testsuite:
org.apache.cassandra.dht.CollatingOrderPreservingPartitionerTest
   [junit] Tests run: 7, Failures: 0, Errors: 0, Time elapsed: 1.473 sec
   [junit]
   [junit] Testsuite:
org.apache.cassandra.dht.OrderPreservingPartitionerTest
   [junit] Tests run: 6, Failures: 0, Errors: 0, Time elapsed: 1.179 sec
   [junit]
   [junit] Testsuite: org.apache.cassandra.dht.RandomPartitionerTest
   [junit] Tests run: 5, Failures: 0, Errors: 0, Time elapsed: 0.766 sec
   [junit]
   [junit] Testsuite: org.apache.cassandra.dht.RangeTest
   [junit] Tests run: 13, Failures: 0, Errors: 0, Time elapsed: 0.389 sec
   [junit]
   [junit] Testsuite: org.apache.cassandra.gms.ArrivalWindowTest
   [junit] Tests run: 1, Failures: 0, Errors: 0, Time elapsed: 0.126 sec
   [junit]
   [junit] Testsuite: org.apache.cassandra.gms.GossipDigestTest
   [junit] Tests run: 1, Failures: 0, Errors: 0, Time elapsed: 0.059 sec
   [junit]
   [junit] Testsuite: org.apache.cassandra.gms.SerializationsTest
   [junit] Tests run: 2, Failures: 0, Errors: 0, Time elapsed: 0.377 sec
   [junit]
   [junit] Testsuite:
org.apache.cassandra.hadoop.ColumnFamilyInputFormatTest
   [junit] Tests run: 1, Failures: 0, Errors: 0, Time elapsed: 0.203 sec
   [junit]
   [junit] Testsuite: org.apache.cassandra.io.BloomFilterTrackerTest
   [junit] Tests run: 3, Failures: 0, Errors: 0, Time elapsed: 0.373 sec
   [junit]
   [junit] Testsuite: org.apache.cassandra.io.CompactSerializerTest
   [junit] Tests run: 2, Failures: 0, Errors: 0, Time elapsed: 1.74 sec
   [junit]
   [junit] Testsuite: org.apache.cassandra.io.LazilyCompactedRowTest
   [junit] Tests run: 7, Failures: 0, Errors: 0, Time elapsed: 28.386 sec
   [junit]
   [junit] ------------- Standard Error -----------------
   [junit]  WARN 02:20:46,488 setting live ratio to maximum of 64 instead of
{}, newRatio
   [junit] ------------- ---------------- ---------------
   [junit] Testsuite: org.apache.cassandra.io.sstable.DescriptorTest
   [junit] Tests run: 1, Failures: 0, Errors: 0, Time elapsed: 0.058 sec
   [junit]
   [junit] Testsuite: org.apache.cassandra.io.sstable.IndexHelperTest
   [junit] Tests run: 1, Failures: 0, Errors: 0, Time elapsed: 0.064 sec
   [junit]
   [junit] Testsuite: org.apache.cassandra.io.sstable.LegacySSTableTest
   [junit] Tests run: 1, Failures: 0, Errors: 0, Time elapsed: 1.927 sec
   [junit]
   [junit] ------------- Standard Error -----------------
   [junit]  WARN 02:21:08,414 Invalid file '.svn' in data directory <
https://builds.apache.org/hudson/job/Cassandra-0.8/ws/cassandra/test/data/legacy-sstables/e/Keyspace1
.>
   [junit]  WARN 02:21:08,999 Invalid file '.svn' in data directory <
https://builds.apache.org/hudson/job/Cassandra-0.8/ws/cassandra/test/data/legacy-sstables/b/Keyspace1
.>
   [junit] ------------- ---------------- ---------------
   [junit] Testsuite: org.apache.cassandra.io.sstable.SSTableReaderTest
   [junit] Tests run: 3, Failures: 0, Errors: 0, Time elapsed: 4.298 sec
   [junit]
   [junit] ------------- Standard Error -----------------
   [junit] ERROR 02:21:11,287 insufficient space to compact even the two
smallest files, aborting
   [junit] ERROR 02:21:12,844 insufficient space to compact even the two
smallest files, aborting
   [junit]  WARN 02:21:13,294 setting live ratio to maximum of 64 instead of
{}, newRatio
   [junit] ------------- ---------------- ---------------
   [junit] Testsuite: org.apache.cassandra.io.sstable.SSTableTest
   [junit] Tests run: 2, Failures: 0, Errors: 0, Time elapsed: 1.506 sec
   [junit]
   [junit] Testsuite:
org.apache.cassandra.io.sstable.SSTableWriterCommutativeTest
   [junit] Tests run: 1, Failures: 0, Errors: 0, Time elapsed: 1.299 sec
   [junit]
   [junit] Testsuite: org.apache.cassandra.io.sstable.SSTableWriterTest
   [junit] Tests run: 1, Failures: 0, Errors: 0, Time elapsed: 1.208 sec
   [junit]
   [junit] Testsuite:
org.apache.cassandra.io.util.BufferedRandomAccessFileTest
   [junit] Tests run: 20, Failures: 0, Errors: 0, Time elapsed: 2.733 sec
   [junit]
   [junit] Testsuite: org.apache.cassandra.locator.DynamicEndpointSnitchTest
   [junit] Tests run: 1, Failures: 0, Errors: 0, Time elapsed: 6.142 sec
   [junit]
   [junit] Testsuite:
org.apache.cassandra.locator.NetworkTopologyStrategyTest
   [junit] Tests run: 2, Failures: 0, Errors: 0, Time elapsed: 0.411 sec
   [junit]
   [junit] Testsuite:
org.apache.cassandra.locator.OldNetworkTopologyStrategyTest
   [junit] Tests run: 3, Failures: 0, Errors: 0, Time elapsed: 0.394 sec
   [junit]
   [junit] Testsuite:
org.apache.cassandra.locator.ReplicationStrategyEndpointCacheTest
   [junit] Tests run: 2, Failures: 0, Errors: 0, Time elapsed: 0.558 sec
   [junit]
   [junit] Testsuite: org.apache.cassandra.locator.SimpleStrategyTest
   [junit] Tests run: 4, Failures: 0, Errors: 0, Time elapsed: 0.616 sec
   [junit]
   [junit] Testsuite: org.apache.cassandra.locator.TokenMetadataTest
   [junit] Tests run: 3, Failures: 0, Errors: 0, Time elapsed: 0.388 sec
   [junit]
   [junit] Testsuite:
org.apache.cassandra.service.AntiEntropyServiceCounterTest
   [junit] Tests run: 7, Failures: 0, Errors: 0, Time elapsed: 5.406 sec
   [junit]
   [junit] ------------- Standard Error -----------------
   [junit]  WARN 02:21:39,604 Generated random token
Token(bytes[ad02f3e2eebdb9b3b2efff037fd4305a]). Random tokens will result in
an unbalanced ring; see http://wiki.apache.org/cassandra/Operations
   [junit] Exception in thread "AntiEntropyStage:1" java.lang.AssertionError
   [junit]     at
org.apache.cassandra.locator.TokenMetadata.firstTokenIndex(TokenMetadata.java:508)
   [junit]     at
org.apache.cassandra.locator.TokenMetadata.firstToken(TokenMetadata.java:522)
   [junit]     at
org.apache.cassandra.locator.AbstractReplicationStrategy.getNaturalEndpoints(AbstractReplicationStrategy.java:99)
   [junit]     at
org.apache.cassandra.service.StorageService.constructRangeToEndpointMap(StorageService.java:611)
   [junit]     at
org.apache.cassandra.service.StorageService.getRangeToAddressMap(StorageService.java:586)
   [junit]     at
org.apache.cassandra.service.AntiEntropyService.getNeighbors(AntiEntropyService.java:166)
   [junit]     at
org.apache.cassandra.service.AntiEntropyService.rendezvous(AntiEntropyService.java:198)
   [junit]     at
org.apache.cassandra.service.AntiEntropyService.access$100(AntiEntropyService.java:90)
   [junit]     at
org.apache.cassandra.service.AntiEntropyService$TreeResponseVerbHandler.doVerb(AntiEntropyService.java:657)
   [junit]     at
org.apache.cassandra.net.MessageDeliveryTask.run(MessageDeliveryTask.java:72)
   [junit]     at
java.util.concurrent.ThreadPoolExecutor$Worker.runTask(ThreadPoolExecutor.java:886)
   [junit]     at
java.util.concurrent.ThreadPoolExecutor$Worker.run(ThreadPoolExecutor.java:908)
   [junit]     at java.lang.Thread.run(Thread.java:619)
   [junit] ------------- ---------------- ---------------
   [junit] Testsuite:
org.apache.cassandra.service.AntiEntropyServiceStandardTest
   [junit] Tests run: 7, Failures: 0, Errors: 0, Time elapsed: 4.233 sec
   [junit]
   [junit] ------------- Standard Error -----------------
   [junit]  WARN 02:21:46,326 Generated random token
Token(bytes[b9e1042083c48d86db57c60e870f4523]). Random tokens will result in
an unbalanced ring; see http://wiki.apache.org/cassandra/Operations
   [junit] ------------- ---------------- ---------------
   [junit] Testsuite: org.apache.cassandra.service.CassandraServerTest
   [junit] Tests run: 1, Failures: 0, Errors: 0, Time elapsed: 0.384 sec
   [junit]
   [junit] Testsuite: org.apache.cassandra.service.ConsistencyLevelTest
   [junit] Tests run: 1, Failures: 0, Errors: 0, Time elapsed: 0.9 sec
   [junit]
   [junit] Testsuite:
org.apache.cassandra.service.EmbeddedCassandraServiceTest
   [junit] Tests run: 1, Failures: 0, Errors: 0, Time elapsed: 1.647 sec
   [junit]
   [junit] ------------- Standard Error -----------------
   [junit]  WARN 02:21:54,356 Unable to lock JVM memory (ENOMEM). This can
result in part of the JVM being swapped out, especially with mmapped I/O
enabled. Increase RLIMIT_MEMLOCK or run Cassandra as root.
   [junit]  WARN 02:21:55,156 Generated random token
Token(bytes[a37d56ec9c397f2cb7cfb9835709f1df]). Random tokens will result in
an unbalanced ring; see http://wiki.apache.org/cassandra/Operations
   [junit] ------------- ---------------- ---------------
   [junit] Testsuite: org.apache.cassandra.service.InitClientTest
   [junit] Tests run: 1, Failures: 0, Errors: 0, Time elapsed: 5.394 sec
   [junit]
   [junit] Testsuite: org.apache.cassandra.service.LeaveAndBootstrapTest
   [junit] Tests run: 6, Failures: 0, Errors: 0, Time elapsed: 3.523 sec
   [junit]
   [junit] ------------- Standard Error -----------------
   [junit]  WARN 02:22:06,174 Node /127.0.0.3 'leaving' token mismatch. Long
network partition?
   [junit] ERROR 02:22:06,272 insufficient space to compact even the two
smallest files, aborting
   [junit] ------------- ---------------- ---------------
   [junit] Testsuite: org.apache.cassandra.service.MoveTest
   [junit] Tests run: 3, Failures: 0, Errors: 0, Time elapsed: 1.984 sec
   [junit]
   [junit] Testsuite: org.apache.cassandra.service.RemoveTest
   [junit] Tests run: 5, Failures: 0, Errors: 0, Time elapsed: 3.297 sec
   [junit]
   [junit] ------------- Standard Error -----------------
   [junit] ERROR 02:22:13,651 insufficient space to compact even the two
smallest files, aborting
   [junit] ------------- ---------------- ---------------
   [junit] Testsuite: org.apache.cassandra.service.RowResolverTest
   [junit] Tests run: 5, Failures: 0, Errors: 0, Time elapsed: 0.4 sec
   [junit]
   [junit] Testsuite: org.apache.cassandra.service.SerializationsTest
   [junit] Tests run: 2, Failures: 0, Errors: 0, Time elapsed: 0.143 sec
   [junit]
   [junit] Testsuite: org.apache.cassandra.service.StorageProxyTest
   [junit] Tests run: 4, Failures: 0, Errors: 0, Time elapsed: 0.396 sec
   [junit]
   [junit] Testsuite: org.apache.cassandra.service.StorageServiceClientTest
   [junit] Tests run: 1, Failures: 0, Errors: 0, Time elapsed: 5.428 sec
   [junit]
   [junit] Testsuite: org.apache.cassandra.service.StorageServiceServerTest
   [junit] Tests run: 3, Failures: 0, Errors: 0, Time elapsed: 1.035 sec
   [junit]
   [junit] ------------- Standard Error -----------------
   [junit]  WARN 02:22:25,109 Generated random token
Token(bytes[3296889e13a03662bf621fd6a1400171]). Random tokens will result in
an unbalanced ring; see http://wiki.apache.org/cassandra/Operations
   [junit] ------------- ---------------- ---------------
   [junit] Testsuite: org.apache.cassandra.streaming.BootstrapTest
   [junit] Tests run: 1, Failures: 0, Errors: 0, Time elapsed: 0.585 sec
   [junit]
   [junit] Testsuite: org.apache.cassandra.streaming.SerializationsTest
   [junit] Tests run: 4, Failures: 0, Errors: 0, Time elapsed: 0.414 sec
   [junit]
   [junit] Testsuite: org.apache.cassandra.streaming.StreamingTransferTest
   [junit] Tests run: 3, Failures: 0, Errors: 0, Time elapsed: 2.756 sec
   [junit]
   [junit] ------------- Standard Error -----------------
   [junit]  WARN 02:22:29,581 Generated random token
Token(bytes[5368f7015e4bd857d82ebcee204507ab]). Random tokens will result in
an unbalanced ring; see http://wiki.apache.org/cassandra/Operations
   [junit] ------------- ---------------- ---------------
   [junit] Testsuite: org.apache.cassandra.thrift.ThriftValidationTest
   [junit] Tests run: 2, Failures: 0, Errors: 0, Time elapsed: 0.393 sec
   [junit]
   [junit] Testsuite: org.apache.cassandra.tools.SSTableExportTest
   [junit] Tests run: 5, Failures: 0, Errors: 0, Time elapsed: 1.758 sec
   [junit]
   [junit] ------------- Standard Output ---------------
   [junit] Importing 1 keys...
   [junit] 1 keys imported successfully.
   [junit] ------------- ---------------- ---------------
   [junit] Testsuite: org.apache.cassandra.tools.SSTableImportTest
   [junit] Tests run: 5, Failures: 0, Errors: 0, Time elapsed: 1.153 sec
   [junit]
   [junit] ------------- Standard Output ---------------
   [junit] Importing 2 keys...
   [junit] 2 keys imported successfully.
   [junit] Importing 2 keys...
   [junit] 2 keys imported successfully.
   [junit] Importing 2 keys...
   [junit] 2 keys imported successfully.
   [junit] Importing 3 keys...
   [junit] Importing 3 keys...
   [junit] 1 keys imported successfully.
   [junit] ------------- ---------------- ---------------
   [junit] ------------- Standard Error -----------------
   [junit] Line 2: Key 303630 is greater than previous, collection is not
sorted properly. Aborting import. You might need to delete SSTables
manually.
   [junit] ------------- ---------------- ---------------
   [junit] Testsuite: org.apache.cassandra.utils.BloomFilterTest
   [junit] Tests run: 7, Failures: 0, Errors: 0, Time elapsed: 0.7 sec
   [junit]
   [junit] Testsuite: org.apache.cassandra.utils.BoundedStatsDequeTest
   [junit] Tests run: 1, Failures: 0, Errors: 0, Time elapsed: 0.057 sec
   [junit]
   [junit] Testsuite: org.apache.cassandra.utils.ByteBufferUtilTest
   [junit] Tests run: 10, Failures: 0, Errors: 0, Time elapsed: 0.148 sec
   [junit]
   [junit] Testsuite: org.apache.cassandra.utils.EstimatedHistogramTest
   [junit] Tests run: 4, Failures: 0, Errors: 0, Time elapsed: 0.06 sec
   [junit]
   [junit] Testsuite: org.apache.cassandra.utils.FBUtilitiesTest
   [junit] Tests run: 5, Failures: 0, Errors: 0, Time elapsed: 0.141 sec
   [junit]
   [junit] Testsuite: org.apache.cassandra.utils.LegacyBloomFilterTest
   [junit] Tests run: 6, Failures: 0, Errors: 0, Time elapsed: 0.644 sec
   [junit]
   [junit] Testsuite: org.apache.cassandra.utils.MerkleTreeTest
   [junit] Tests run: 12, Failures: 1, Errors: 0, Time elapsed: 0.392 sec
   [junit]
   [junit] Testcase:
testDifference(org.apache.cassandra.utils.MerkleTreeTest):        FAILED
   [junit]
   [junit] junit.framework.AssertionFailedError:
   [junit]     at
org.apache.cassandra.utils.MerkleTreeTest.testDifference(MerkleTreeTest.java:459)
   [junit]
   [junit]
   [junit] Test org.apache.cassandra.utils.MerkleTreeTest FAILED
   [junit] Testsuite: org.apache.cassandra.utils.SerializationsTest
   [junit] Tests run: 3, Failures: 0, Errors: 0, Time elapsed: 0.64 sec
   [junit]

BUILD FAILED
<https://builds.apache.org/hudson/job/Cassandra-0.8/ws/cassandra/build.xml>:1048:
The following error occurred while executing this line:
<https://builds.apache.org/hudson/job/Cassandra-0.8/ws/cassandra/build.xml>:1034:
Some unit test(s) failed.

Total time: 17 minutes 18 seconds
[TASKS] Skipping publisher since build result is FAILURE
Archiving artifacts
Publishing Javadoc
Recording test results

Mime
  • Unnamed multipart/alternative (inline, None, 0 bytes)
View raw message