incubator-cassandra-dev mailing list archives

Site index · List index
Message view « Date » · « Thread »
Top « Date » · « Thread »
From Apache Jenkins Server <hud...@hudson.apache.org>
Subject Build failed in Jenkins: Cassandra-0.8 #89
Date Tue, 10 May 2011 13:33:10 GMT
See <https://builds.apache.org/hudson/job/Cassandra-0.8/89/changes>

Changes:

[jbellis] fix key_validation_class typo

------------------------------------------
[...truncated 2020 lines...]
    [junit] Tests run: 2, Failures: 0, Errors: 0, Time elapsed: 1.641 sec
    [junit] 
    [junit] Testsuite: org.apache.cassandra.io.LazilyCompactedRowTest
    [junit] Tests run: 7, Failures: 0, Errors: 0, Time elapsed: 29.847 sec
    [junit] 
    [junit] ------------- Standard Error -----------------
    [junit]  WARN 13:29:37,626 setting live ratio to maximum of 64 instead of 77.0
    [junit] ------------- ---------------- ---------------
    [junit] Testsuite: org.apache.cassandra.io.sstable.DescriptorTest
    [junit] Tests run: 1, Failures: 0, Errors: 0, Time elapsed: 0.058 sec
    [junit] 
    [junit] Testsuite: org.apache.cassandra.io.sstable.IndexHelperTest
    [junit] Tests run: 1, Failures: 0, Errors: 0, Time elapsed: 0.065 sec
    [junit] 
    [junit] Testsuite: org.apache.cassandra.io.sstable.LegacySSTableTest
    [junit] Tests run: 1, Failures: 0, Errors: 0, Time elapsed: 1.393 sec
    [junit] 
    [junit] ------------- Standard Error -----------------
    [junit]  WARN 13:30:00,537 Invalid file '.svn' in data directory <https://builds.apache.org/hudson/job/Cassandra-0.8/ws/cassandra/test/data/legacy-sstables/e/Keyspace1.>
    [junit]  WARN 13:30:01,127 Invalid file '.svn' in data directory <https://builds.apache.org/hudson/job/Cassandra-0.8/ws/cassandra/test/data/legacy-sstables/b/Keyspace1.>
    [junit] ------------- ---------------- ---------------
    [junit] Testsuite: org.apache.cassandra.io.sstable.SSTableReaderTest
    [junit] Tests run: 3, Failures: 0, Errors: 0, Time elapsed: 5.055 sec
    [junit] 
    [junit] ------------- Standard Error -----------------
    [junit] ERROR 13:30:03,566 insufficient space to compact even the two smallest files,
aborting
    [junit] ERROR 13:30:05,375 insufficient space to compact even the two smallest files,
aborting
    [junit]  WARN 13:30:05,914 setting live ratio to maximum of 64 instead of 70.89285714285714
    [junit] ------------- ---------------- ---------------
    [junit] Testsuite: org.apache.cassandra.io.sstable.SSTableTest
    [junit] Tests run: 2, Failures: 0, Errors: 0, Time elapsed: 1.59 sec
    [junit] 
    [junit] Testsuite: org.apache.cassandra.io.sstable.SSTableWriterCommutativeTest
    [junit] Tests run: 1, Failures: 0, Errors: 0, Time elapsed: 1.276 sec
    [junit] 
    [junit] Testsuite: org.apache.cassandra.io.sstable.SSTableWriterTest
    [junit] Tests run: 1, Failures: 0, Errors: 0, Time elapsed: 1.197 sec
    [junit] 
    [junit] Testsuite: org.apache.cassandra.io.util.BufferedRandomAccessFileTest
    [junit] Tests run: 20, Failures: 0, Errors: 0, Time elapsed: 2.99 sec
    [junit] 
    [junit] Testsuite: org.apache.cassandra.locator.DynamicEndpointSnitchTest
    [junit] Tests run: 1, Failures: 0, Errors: 0, Time elapsed: 6.145 sec
    [junit] 
    [junit] Testsuite: org.apache.cassandra.locator.NetworkTopologyStrategyTest
    [junit] Tests run: 2, Failures: 0, Errors: 0, Time elapsed: 0.41 sec
    [junit] 
    [junit] Testsuite: org.apache.cassandra.locator.OldNetworkTopologyStrategyTest
    [junit] Tests run: 3, Failures: 0, Errors: 0, Time elapsed: 0.396 sec
    [junit] 
    [junit] Testsuite: org.apache.cassandra.locator.ReplicationStrategyEndpointCacheTest
    [junit] Tests run: 2, Failures: 0, Errors: 0, Time elapsed: 0.612 sec
    [junit] 
    [junit] Testsuite: org.apache.cassandra.locator.SimpleStrategyTest
    [junit] Tests run: 4, Failures: 0, Errors: 0, Time elapsed: 0.726 sec
    [junit] 
    [junit] Testsuite: org.apache.cassandra.locator.TokenMetadataTest
    [junit] Tests run: 3, Failures: 0, Errors: 0, Time elapsed: 0.386 sec
    [junit] 
    [junit] Testsuite: org.apache.cassandra.service.AntiEntropyServiceCounterTest
    [junit] Tests run: 7, Failures: 0, Errors: 0, Time elapsed: 4.544 sec
    [junit] 
    [junit] ------------- Standard Error -----------------
    [junit]  WARN 13:30:32,953 Generated random token Token(bytes[6fbc6daf895334fa5a9f8d3faa7d7a95]).
Random tokens will result in an unbalanced ring; see http://wiki.apache.org/cassandra/Operations
    [junit] Exception in thread "AntiEntropyStage:1" java.lang.AssertionError
    [junit] 	at org.apache.cassandra.locator.TokenMetadata.firstTokenIndex(TokenMetadata.java:508)
    [junit] 	at org.apache.cassandra.locator.TokenMetadata.firstToken(TokenMetadata.java:522)
    [junit] 	at org.apache.cassandra.locator.AbstractReplicationStrategy.getNaturalEndpoints(AbstractReplicationStrategy.java:99)
    [junit] 	at org.apache.cassandra.service.StorageService.constructRangeToEndpointMap(StorageService.java:611)
    [junit] 	at org.apache.cassandra.service.StorageService.getRangeToAddressMap(StorageService.java:586)
    [junit] 	at org.apache.cassandra.service.AntiEntropyService.getNeighbors(AntiEntropyService.java:166)
    [junit] 	at org.apache.cassandra.service.AntiEntropyService.rendezvous(AntiEntropyService.java:198)
    [junit] 	at org.apache.cassandra.service.AntiEntropyService.access$100(AntiEntropyService.java:90)
    [junit] 	at org.apache.cassandra.service.AntiEntropyService$TreeResponseVerbHandler.doVerb(AntiEntropyService.java:657)
    [junit] 	at org.apache.cassandra.net.MessageDeliveryTask.run(MessageDeliveryTask.java:72)
    [junit] 	at java.util.concurrent.ThreadPoolExecutor$Worker.runTask(ThreadPoolExecutor.java:886)
    [junit] 	at java.util.concurrent.ThreadPoolExecutor$Worker.run(ThreadPoolExecutor.java:908)
    [junit] 	at java.lang.Thread.run(Thread.java:619)
    [junit] ------------- ---------------- ---------------
    [junit] Testsuite: org.apache.cassandra.service.AntiEntropyServiceStandardTest
    [junit] Tests run: 7, Failures: 0, Errors: 0, Time elapsed: 4.533 sec
    [junit] 
    [junit] ------------- Standard Error -----------------
    [junit]  WARN 13:30:38,740 Generated random token Token(bytes[afca01bd24781548182089960fa9b810]).
Random tokens will result in an unbalanced ring; see http://wiki.apache.org/cassandra/Operations
    [junit] Exception in thread "AntiEntropyStage:1" java.lang.AssertionError
    [junit] 	at org.apache.cassandra.locator.TokenMetadata.firstTokenIndex(TokenMetadata.java:508)
    [junit] 	at org.apache.cassandra.locator.TokenMetadata.firstToken(TokenMetadata.java:522)
    [junit] 	at org.apache.cassandra.locator.AbstractReplicationStrategy.getNaturalEndpoints(AbstractReplicationStrategy.java:99)
    [junit] 	at org.apache.cassandra.service.StorageService.constructRangeToEndpointMap(StorageService.java:611)
    [junit] 	at org.apache.cassandra.service.StorageService.getRangeToAddressMap(StorageService.java:586)
    [junit] 	at org.apache.cassandra.service.AntiEntropyService.getNeighbors(AntiEntropyService.java:166)
    [junit] 	at org.apache.cassandra.service.AntiEntropyService.rendezvous(AntiEntropyService.java:198)
    [junit] 	at org.apache.cassandra.service.AntiEntropyService.access$100(AntiEntropyService.java:90)
    [junit] 	at org.apache.cassandra.service.AntiEntropyService$TreeResponseVerbHandler.doVerb(AntiEntropyService.java:657)
    [junit] 	at org.apache.cassandra.net.MessageDeliveryTask.run(MessageDeliveryTask.java:72)
    [junit] 	at java.util.concurrent.ThreadPoolExecutor$Worker.runTask(ThreadPoolExecutor.java:886)
    [junit] 	at java.util.concurrent.ThreadPoolExecutor$Worker.run(ThreadPoolExecutor.java:908)
    [junit] 	at java.lang.Thread.run(Thread.java:619)
    [junit] ------------- ---------------- ---------------
    [junit] Testsuite: org.apache.cassandra.service.CassandraServerTest
    [junit] Tests run: 1, Failures: 0, Errors: 0, Time elapsed: 0.387 sec
    [junit] 
    [junit] Testsuite: org.apache.cassandra.service.ConsistencyLevelTest
    [junit] Tests run: 1, Failures: 0, Errors: 0, Time elapsed: 0.998 sec
    [junit] 
    [junit] Testsuite: org.apache.cassandra.service.EmbeddedCassandraServiceTest
    [junit] Tests run: 1, Failures: 0, Errors: 0, Time elapsed: 1.814 sec
    [junit] 
    [junit] ------------- Standard Error -----------------
    [junit]  WARN 13:30:47,260 Unable to lock JVM memory (ENOMEM). This can result in part
of the JVM being swapped out, especially with mmapped I/O enabled. Increase RLIMIT_MEMLOCK
or run Cassandra as root.
    [junit]  WARN 13:30:48,100 Generated random token Token(bytes[1a0518428989bdbc9369b25c20dccdcc]).
Random tokens will result in an unbalanced ring; see http://wiki.apache.org/cassandra/Operations
    [junit] ------------- ---------------- ---------------
    [junit] Testsuite: org.apache.cassandra.service.InitClientTest
    [junit] Tests run: 1, Failures: 0, Errors: 0, Time elapsed: 5.396 sec
    [junit] 
    [junit] Testsuite: org.apache.cassandra.service.LeaveAndBootstrapTest
    [junit] Tests run: 6, Failures: 0, Errors: 0, Time elapsed: 4.203 sec
    [junit] 
    [junit] ------------- Standard Error -----------------
    [junit]  WARN 13:30:59,911 Node /127.0.0.3 'leaving' token mismatch. Long network partition?
    [junit] ERROR 13:31:00,007 insufficient space to compact even the two smallest files,
aborting
    [junit] ------------- ---------------- ---------------
    [junit] Testsuite: org.apache.cassandra.service.MoveTest
    [junit] Tests run: 3, Failures: 0, Errors: 0, Time elapsed: 2.409 sec
    [junit] 
    [junit] Testsuite: org.apache.cassandra.service.RemoveTest
    [junit] Tests run: 5, Failures: 0, Errors: 0, Time elapsed: 3.435 sec
    [junit] 
    [junit] ------------- Standard Error -----------------
    [junit] ERROR 13:31:08,071 insufficient space to compact even the two smallest files,
aborting
    [junit] ------------- ---------------- ---------------
    [junit] Testsuite: org.apache.cassandra.service.RowResolverTest
    [junit] Tests run: 5, Failures: 0, Errors: 0, Time elapsed: 0.395 sec
    [junit] 
    [junit] Testsuite: org.apache.cassandra.service.SerializationsTest
    [junit] Tests run: 2, Failures: 0, Errors: 0, Time elapsed: 0.144 sec
    [junit] 
    [junit] Testsuite: org.apache.cassandra.service.StorageProxyTest
    [junit] Tests run: 4, Failures: 0, Errors: 0, Time elapsed: 0.395 sec
    [junit] 
    [junit] Testsuite: org.apache.cassandra.service.StorageServiceClientTest
    [junit] Tests run: 1, Failures: 0, Errors: 0, Time elapsed: 5.437 sec
    [junit] 
    [junit] Testsuite: org.apache.cassandra.service.StorageServiceServerTest
    [junit] Tests run: 3, Failures: 0, Errors: 0, Time elapsed: 1.871 sec
    [junit] 
    [junit] ------------- Standard Error -----------------
    [junit]  WARN 13:31:19,603 Generated random token Token(bytes[00a29474c71aa16e9e5a46f8d41f2937]).
Random tokens will result in an unbalanced ring; see http://wiki.apache.org/cassandra/Operations
    [junit] ------------- ---------------- ---------------
    [junit] Testsuite: org.apache.cassandra.streaming.BootstrapTest
    [junit] Tests run: 1, Failures: 0, Errors: 0, Time elapsed: 0.547 sec
    [junit] 
    [junit] Testsuite: org.apache.cassandra.streaming.SerializationsTest
    [junit] Tests run: 4, Failures: 0, Errors: 0, Time elapsed: 0.409 sec
    [junit] 
    [junit] Testsuite: org.apache.cassandra.streaming.StreamingTransferTest
    [junit] Tests run: 3, Failures: 0, Errors: 0, Time elapsed: 3.671 sec
    [junit] 
    [junit] ------------- Standard Error -----------------
    [junit]  WARN 13:31:26,711 Generated random token Token(bytes[ee1ea0a96222ddb4bead59fe1bbf3b40]).
Random tokens will result in an unbalanced ring; see http://wiki.apache.org/cassandra/Operations
    [junit] ------------- ---------------- ---------------
    [junit] Testsuite: org.apache.cassandra.thrift.ThriftValidationTest
    [junit] Tests run: 2, Failures: 0, Errors: 0, Time elapsed: 0.39 sec
    [junit] 
    [junit] Testsuite: org.apache.cassandra.tools.SSTableExportTest
    [junit] Tests run: 5, Failures: 0, Errors: 0, Time elapsed: 1.718 sec
    [junit] 
    [junit] ------------- Standard Output ---------------
    [junit] Importing 1 keys...
    [junit] 1 keys imported successfully.
    [junit] ------------- ---------------- ---------------
    [junit] Testsuite: org.apache.cassandra.tools.SSTableImportTest
    [junit] Tests run: 5, Failures: 0, Errors: 0, Time elapsed: 1.272 sec
    [junit] 
    [junit] ------------- Standard Output ---------------
    [junit] Importing 2 keys...
    [junit] 2 keys imported successfully.
    [junit] Importing 2 keys...
    [junit] 2 keys imported successfully.
    [junit] Importing 2 keys...
    [junit] 2 keys imported successfully.
    [junit] Importing 3 keys...
    [junit] Importing 3 keys...
    [junit] 1 keys imported successfully.
    [junit] ------------- ---------------- ---------------
    [junit] ------------- Standard Error -----------------
    [junit] Line 2: Key 303630 is greater than previous, collection is not sorted properly.
Aborting import. You might need to delete SSTables manually.
    [junit] ------------- ---------------- ---------------
    [junit] Testsuite: org.apache.cassandra.utils.BloomFilterTest
    [junit] Tests run: 7, Failures: 0, Errors: 0, Time elapsed: 0.697 sec
    [junit] 
    [junit] Testsuite: org.apache.cassandra.utils.BoundedStatsDequeTest
    [junit] Tests run: 1, Failures: 0, Errors: 0, Time elapsed: 0.057 sec
    [junit] 
    [junit] Testsuite: org.apache.cassandra.utils.ByteBufferUtilTest
    [junit] Tests run: 10, Failures: 0, Errors: 0, Time elapsed: 0.148 sec
    [junit] 
    [junit] Testsuite: org.apache.cassandra.utils.EstimatedHistogramTest
    [junit] Tests run: 4, Failures: 0, Errors: 0, Time elapsed: 0.06 sec
    [junit] 
    [junit] Testsuite: org.apache.cassandra.utils.FBUtilitiesTest
    [junit] Tests run: 5, Failures: 0, Errors: 0, Time elapsed: 0.141 sec
    [junit] 
    [junit] Testsuite: org.apache.cassandra.utils.LegacyBloomFilterTest
    [junit] Tests run: 6, Failures: 0, Errors: 0, Time elapsed: 0.634 sec
    [junit] 
    [junit] Testsuite: org.apache.cassandra.utils.MerkleTreeTest
    [junit] Tests run: 12, Failures: 0, Errors: 0, Time elapsed: 0.399 sec
    [junit] 
    [junit] Testsuite: org.apache.cassandra.utils.SerializationsTest
    [junit] Tests run: 3, Failures: 0, Errors: 0, Time elapsed: 0.609 sec
    [junit] 
     [echo] running driverunit tests
    [junit] WARNING: multiple versions of ant detected in path for junit 
    [junit]          jar:file:/home/hudson/tools/ant/latest/lib/ant.jar!/org/apache/tools/ant/Project.class
    [junit]      and jar:<https://builds.apache.org/hudson/job/Cassandra-0.8/ws/cassandra/build/lib/jars/ant-1.6.5.jar!/org/apache/tools/ant/Project.class>
    [junit] Testsuite: org.apache.cassandra.cql.JdbcDriverTest
    [junit] Tests run: 9, Failures: 0, Errors: 0, Time elapsed: 3.397 sec
    [junit] 
    [junit] ------------- Standard Error -----------------
    [junit]  WARN 13:31:44,559 Unable to lock JVM memory (ENOMEM). This can result in part
of the JVM being swapped out, especially with mmapped I/O enabled. Increase RLIMIT_MEMLOCK
or run Cassandra as root.
    [junit]  WARN 13:31:45,588 Generated random token Token(bytes[ca87f4ff4886fa0a9489038160ac7f15]).
Random tokens will result in an unbalanced ring; see http://wiki.apache.org/cassandra/Operations
    [junit] ------------- ---------------- ---------------
    [junit] Testsuite: org.apache.cassandra.cql.jdbc.PreparedStatementTest
    [junit] Tests run: 6, Failures: 0, Errors: 1, Time elapsed: 3.456 sec
    [junit] 
    [junit] ------------- Standard Error -----------------
    [junit]  WARN 13:31:49,189 Unable to lock JVM memory (ENOMEM). This can result in part
of the JVM being swapped out, especially with mmapped I/O enabled. Increase RLIMIT_MEMLOCK
or run Cassandra as root.
    [junit]  WARN 13:31:49,963 Generated random token Token(bytes[537bda4de3a411a7f6d04ca7d8af51cc]).
Random tokens will result in an unbalanced ring; see http://wiki.apache.org/cassandra/Operations
    [junit] ------------- ---------------- ---------------
    [junit] Testcase: testInteger(org.apache.cassandra.cql.jdbc.PreparedStatementTest):	Caused
an ERROR
    [junit] Non-integer value null
    [junit] java.sql.SQLException: Non-integer value null
    [junit] 	at org.apache.cassandra.cql.jdbc.CResultSet.getInt(CResultSet.java:189)
    [junit] 	at org.apache.cassandra.cql.jdbc.CResultSet.getInt(CResultSet.java:194)
    [junit] 	at org.apache.cassandra.cql.jdbc.PreparedStatementTest.testInteger(PreparedStatementTest.java:346)
    [junit] 
    [junit] 
    [junit] Test org.apache.cassandra.cql.jdbc.PreparedStatementTest FAILED

BUILD FAILED
<https://builds.apache.org/hudson/job/Cassandra-0.8/ws/cassandra/build.xml>:1052: The
following error occurred while executing this line:
<https://builds.apache.org/hudson/job/Cassandra-0.8/ws/cassandra/build.xml>:1034: Some
driverunit test(s) failed.

Total time: 17 minutes 10 seconds
[TASKS] Skipping publisher since build result is FAILURE
Archiving artifacts
Publishing Javadoc
Recording test results


Mime
View raw message