incubator-cassandra-dev mailing list archives

Site index · List index
Message view « Date » · « Thread »
Top « Date » · « Thread »
From Apache Jenkins Server <hud...@hudson.apache.org>
Subject Build failed in Jenkins: Cassandra #894
Date Fri, 13 May 2011 01:27:56 GMT
See <https://builds.apache.org/hudson/job/Cassandra/894/changes>

Changes:

[jbellis] merge from 0.8.1

------------------------------------------
[...truncated 2068 lines...]
    [junit] Testsuite: org.apache.cassandra.db.migration.SerializationsTest
    [junit] Tests run: 1, Failures: 0, Errors: 0, Time elapsed: 0.622 sec
    [junit] 
    [junit] Testsuite: org.apache.cassandra.dht.BootStrapperTest
    [junit] Tests run: 4, Failures: 0, Errors: 0, Time elapsed: 3.428 sec
    [junit] 
    [junit] ------------- Standard Error -----------------
    [junit]  WARN 01:23:48,649 Generated random token Token(bytes[e135e489ed7b29afd447ee8b79060766]).
Random tokens will result in an unbalanced ring; see http://wiki.apache.org/cassandra/Operations
    [junit] ------------- ---------------- ---------------
    [junit] Testsuite: org.apache.cassandra.dht.ByteOrderedPartitionerTest
    [junit] Tests run: 5, Failures: 0, Errors: 0, Time elapsed: 1.129 sec
    [junit] 
    [junit] Testsuite: org.apache.cassandra.dht.CollatingOrderPreservingPartitionerTest
    [junit] Tests run: 7, Failures: 0, Errors: 0, Time elapsed: 1.485 sec
    [junit] 
    [junit] Testsuite: org.apache.cassandra.dht.OrderPreservingPartitionerTest
    [junit] Tests run: 6, Failures: 0, Errors: 0, Time elapsed: 1.177 sec
    [junit] 
    [junit] Testsuite: org.apache.cassandra.dht.RandomPartitionerTest
    [junit] Tests run: 5, Failures: 0, Errors: 0, Time elapsed: 0.774 sec
    [junit] 
    [junit] Testsuite: org.apache.cassandra.dht.RangeTest
    [junit] Tests run: 13, Failures: 0, Errors: 0, Time elapsed: 0.391 sec
    [junit] 
    [junit] Testsuite: org.apache.cassandra.gms.ArrivalWindowTest
    [junit] Tests run: 1, Failures: 0, Errors: 0, Time elapsed: 0.126 sec
    [junit] 
    [junit] Testsuite: org.apache.cassandra.gms.GossipDigestTest
    [junit] Tests run: 1, Failures: 0, Errors: 0, Time elapsed: 0.058 sec
    [junit] 
    [junit] Testsuite: org.apache.cassandra.gms.SerializationsTest
    [junit] Tests run: 2, Failures: 0, Errors: 0, Time elapsed: 0.381 sec
    [junit] 
    [junit] Testsuite: org.apache.cassandra.hadoop.ColumnFamilyInputFormatTest
    [junit] Tests run: 1, Failures: 0, Errors: 0, Time elapsed: 0.203 sec
    [junit] 
    [junit] Testsuite: org.apache.cassandra.io.BloomFilterTrackerTest
    [junit] Tests run: 3, Failures: 0, Errors: 0, Time elapsed: 0.377 sec
    [junit] 
    [junit] Testsuite: org.apache.cassandra.io.CompactSerializerTest
    [junit] Tests run: 2, Failures: 0, Errors: 0, Time elapsed: 1.751 sec
    [junit] 
    [junit] Testsuite: org.apache.cassandra.io.LazilyCompactedRowTest
    [junit] Tests run: 7, Failures: 0, Errors: 0, Time elapsed: 33.04 sec
    [junit] 
    [junit] ------------- Standard Error -----------------
    [junit]  WARN 01:24:19,190 setting live ratio to maximum of 64 instead of 74.0
    [junit] ------------- ---------------- ---------------
    [junit] Testsuite: org.apache.cassandra.io.sstable.DescriptorTest
    [junit] Tests run: 1, Failures: 0, Errors: 0, Time elapsed: 0.058 sec
    [junit] 
    [junit] Testsuite: org.apache.cassandra.io.sstable.IndexHelperTest
    [junit] Tests run: 1, Failures: 0, Errors: 0, Time elapsed: 0.065 sec
    [junit] 
    [junit] Testsuite: org.apache.cassandra.io.sstable.LegacySSTableTest
    [junit] Tests run: 1, Failures: 0, Errors: 0, Time elapsed: 1.378 sec
    [junit] 
    [junit] ------------- Standard Error -----------------
    [junit]  WARN 01:24:44,541 Invalid file '.svn' in data directory <https://builds.apache.org/hudson/job/Cassandra/ws/cassandra/test/data/legacy-sstables/e/Keyspace1.>
    [junit]  WARN 01:24:45,151 Invalid file '.svn' in data directory <https://builds.apache.org/hudson/job/Cassandra/ws/cassandra/test/data/legacy-sstables/b/Keyspace1.>
    [junit] ------------- ---------------- ---------------
    [junit] Testsuite: org.apache.cassandra.io.sstable.SSTableReaderTest
    [junit] Tests run: 4, Failures: 0, Errors: 0, Time elapsed: 8.219 sec
    [junit] Tests run: 4, Failures: 0, Errors: 0, Time elapsed: 8.219 sec
    [junit] 
    [junit] ------------- Standard Error -----------------
    [junit] ERROR 01:24:49,159 insufficient space to compact even the two smallest files,
aborting
    [junit] ERROR 01:24:51,514 insufficient space to compact even the two smallest files,
aborting
    [junit]  WARN 01:24:52,178 setting live ratio to maximum of 64 instead of 70.35714285714286
    [junit] ------------- ---------------- ---------------
    [junit] Testsuite: org.apache.cassandra.io.sstable.SSTableTest
    [junit] Tests run: 2, Failures: 0, Errors: 0, Time elapsed: 1.48 sec
    [junit] 
    [junit] Testsuite: org.apache.cassandra.io.sstable.SSTableWriterCommutativeTest
    [junit] Tests run: 1, Failures: 0, Errors: 0, Time elapsed: 1.658 sec
    [junit] 
    [junit] Testsuite: org.apache.cassandra.io.sstable.SSTableWriterTest
    [junit] Tests run: 1, Failures: 0, Errors: 0, Time elapsed: 1.268 sec
    [junit] 
    [junit] Testsuite: org.apache.cassandra.io.util.BufferedRandomAccessFileTest
    [junit] Tests run: 20, Failures: 0, Errors: 0, Time elapsed: 2.939 sec
    [junit] 
    [junit] Testsuite: org.apache.cassandra.locator.DynamicEndpointSnitchTest
    [junit] Tests run: 1, Failures: 0, Errors: 0, Time elapsed: 6.144 sec
    [junit] 
    [junit] Testsuite: org.apache.cassandra.locator.NetworkTopologyStrategyTest
    [junit] Tests run: 2, Failures: 0, Errors: 0, Time elapsed: 0.407 sec
    [junit] 
    [junit] Testsuite: org.apache.cassandra.locator.OldNetworkTopologyStrategyTest
    [junit] Tests run: 3, Failures: 0, Errors: 0, Time elapsed: 0.395 sec
    [junit] 
    [junit] Testsuite: org.apache.cassandra.locator.ReplicationStrategyEndpointCacheTest
    [junit] Tests run: 2, Failures: 0, Errors: 0, Time elapsed: 0.566 sec
    [junit] 
    [junit] Testsuite: org.apache.cassandra.locator.SimpleStrategyTest
    [junit] Tests run: 4, Failures: 0, Errors: 0, Time elapsed: 1.026 sec
    [junit] 
    [junit] Testsuite: org.apache.cassandra.locator.TokenMetadataTest
    [junit] Tests run: 3, Failures: 0, Errors: 0, Time elapsed: 0.386 sec
    [junit] 
    [junit] Testsuite: org.apache.cassandra.service.AntiEntropyServiceCounterTest
    [junit] Tests run: 7, Failures: 0, Errors: 0, Time elapsed: 8.792 sec
    [junit] 
    [junit] ------------- Standard Error -----------------
    [junit]  WARN 01:25:22,359 Generated random token Token(bytes[97ba8bd729693df133f63423f084cfa8]).
Random tokens will result in an unbalanced ring; see http://wiki.apache.org/cassandra/Operations
    [junit] Exception in thread "AntiEntropyStage:1" java.lang.AssertionError
    [junit] 	at org.apache.cassandra.locator.TokenMetadata.firstTokenIndex(TokenMetadata.java:508)
    [junit] 	at org.apache.cassandra.locator.TokenMetadata.firstToken(TokenMetadata.java:522)
    [junit] 	at org.apache.cassandra.locator.AbstractReplicationStrategy.getNaturalEndpoints(AbstractReplicationStrategy.java:99)
    [junit] 	at org.apache.cassandra.service.StorageService.constructRangeToEndpointMap(StorageService.java:616)
    [junit] 	at org.apache.cassandra.service.StorageService.getRangeToAddressMap(StorageService.java:591)
    [junit] 	at org.apache.cassandra.service.AntiEntropyService.getNeighbors(AntiEntropyService.java:166)
    [junit] 	at org.apache.cassandra.service.AntiEntropyService.rendezvous(AntiEntropyService.java:198)
    [junit] 	at org.apache.cassandra.service.AntiEntropyService.access$100(AntiEntropyService.java:90)
    [junit] 	at org.apache.cassandra.service.AntiEntropyService$TreeResponseVerbHandler.doVerb(AntiEntropyService.java:657)
    [junit] 	at org.apache.cassandra.net.MessageDeliveryTask.run(MessageDeliveryTask.java:72)
    [junit] 	at java.util.concurrent.ThreadPoolExecutor$Worker.runTask(ThreadPoolExecutor.java:886)
    [junit] 	at java.util.concurrent.ThreadPoolExecutor$Worker.run(ThreadPoolExecutor.java:908)
    [junit] 	at java.lang.Thread.run(Thread.java:619)
    [junit] ------------- ---------------- ---------------
    [junit] Testsuite: org.apache.cassandra.service.AntiEntropyServiceStandardTest
    [junit] Tests run: 7, Failures: 0, Errors: 0, Time elapsed: 4.472 sec
    [junit] 
    [junit] ------------- Standard Error -----------------
    [junit]  WARN 01:25:31,448 Generated random token Token(bytes[ad4d96dba00575b46f6e0ab157a566f5]).
Random tokens will result in an unbalanced ring; see http://wiki.apache.org/cassandra/Operations
    [junit] ------------- ---------------- ---------------
    [junit] Testsuite: org.apache.cassandra.service.CassandraServerTest
    [junit] Tests run: 1, Failures: 0, Errors: 0, Time elapsed: 0.393 sec
    [junit] 
    [junit] Testsuite: org.apache.cassandra.service.ConsistencyLevelTest
    [junit] Tests run: 1, Failures: 0, Errors: 0, Time elapsed: 0.857 sec
    [junit] 
    [junit] Testsuite: org.apache.cassandra.service.EmbeddedCassandraServiceTest
    [junit] Tests run: 1, Failures: 0, Errors: 0, Time elapsed: 1.784 sec
    [junit] 
    [junit] ------------- Standard Error -----------------
    [junit]  WARN 01:25:39,704 Unable to lock JVM memory (ENOMEM). This can result in part
of the JVM being swapped out, especially with mmapped I/O enabled. Increase RLIMIT_MEMLOCK
or run Cassandra as root.
    [junit]  WARN 01:25:40,748 Generated random token Token(bytes[5a77d785918fe1bca8fb82466ad3021e]).
Random tokens will result in an unbalanced ring; see http://wiki.apache.org/cassandra/Operations
    [junit] ------------- ---------------- ---------------
    [junit] Testsuite: org.apache.cassandra.service.InitClientTest
    [junit] Tests run: 1, Failures: 0, Errors: 0, Time elapsed: 5.396 sec
    [junit] 
    [junit] Testsuite: org.apache.cassandra.service.LeaveAndBootstrapTest
    [junit] Tests run: 6, Failures: 0, Errors: 0, Time elapsed: 3.81 sec
    [junit] 
    [junit] ------------- Standard Error -----------------
    [junit]  WARN 01:25:51,988 Node /127.0.0.3 'leaving' token mismatch. Long network partition?
    [junit] ERROR 01:25:52,063 insufficient space to compact even the two smallest files,
aborting
    [junit] ------------- ---------------- ---------------
    [junit] Testsuite: org.apache.cassandra.service.MoveTest
    [junit] Tests run: 3, Failures: 0, Errors: 0, Time elapsed: 3.008 sec
    [junit] 
    [junit] Testsuite: org.apache.cassandra.service.RemoveTest
    [junit] Tests run: 5, Failures: 0, Errors: 0, Time elapsed: 4.045 sec
    [junit] 
    [junit] ------------- Standard Error -----------------
    [junit] ERROR 01:26:01,194 insufficient space to compact even the two smallest files,
aborting
    [junit] ------------- ---------------- ---------------
    [junit] Testsuite: org.apache.cassandra.service.RowResolverTest
    [junit] Tests run: 5, Failures: 0, Errors: 0, Time elapsed: 0.415 sec
    [junit] 
    [junit] Testsuite: org.apache.cassandra.service.SerializationsTest
    [junit] Tests run: 2, Failures: 0, Errors: 0, Time elapsed: 0.147 sec
    [junit] 
    [junit] Testsuite: org.apache.cassandra.service.StorageProxyTest
    [junit] Tests run: 4, Failures: 0, Errors: 0, Time elapsed: 0.401 sec
    [junit] 
    [junit] Testsuite: org.apache.cassandra.service.StorageServiceClientTest
    [junit] Tests run: 1, Failures: 0, Errors: 0, Time elapsed: 5.451 sec
    [junit] 
    [junit] Testsuite: org.apache.cassandra.service.StorageServiceServerTest
    [junit] Tests run: 3, Failures: 0, Errors: 0, Time elapsed: 1.128 sec
    [junit] 
    [junit] ------------- Standard Error -----------------
    [junit]  WARN 01:26:12,885 Generated random token Token(bytes[71ef1b40feee730fa8914b2725e702b9]).
Random tokens will result in an unbalanced ring; see http://wiki.apache.org/cassandra/Operations
    [junit] ------------- ---------------- ---------------
    [junit] Testsuite: org.apache.cassandra.streaming.BootstrapTest
    [junit] Tests run: 1, Failures: 0, Errors: 0, Time elapsed: 0.599 sec
    [junit] 
    [junit] Testsuite: org.apache.cassandra.streaming.SerializationsTest
    [junit] Tests run: 4, Failures: 0, Errors: 0, Time elapsed: 0.498 sec
    [junit] 
    [junit] Testsuite: org.apache.cassandra.streaming.StreamingTransferTest
    [junit] Tests run: 3, Failures: 0, Errors: 0, Time elapsed: 4.047 sec
    [junit] 
    [junit] ------------- Standard Error -----------------
    [junit]  WARN 01:26:18,136 Generated random token Token(bytes[ff6d440cb93d1e88bb83ccd1ffce4ab4]).
Random tokens will result in an unbalanced ring; see http://wiki.apache.org/cassandra/Operations
    [junit] ------------- ---------------- ---------------
    [junit] Testsuite: org.apache.cassandra.thrift.ThriftValidationTest
    [junit] Tests run: 2, Failures: 0, Errors: 0, Time elapsed: 0.397 sec
    [junit] 
    [junit] Testsuite: org.apache.cassandra.tools.SSTableExportTest
    [junit] Tests run: 5, Failures: 0, Errors: 0, Time elapsed: 1.776 sec
    [junit] 
    [junit] ------------- Standard Output ---------------
    [junit] Importing 1 keys...
    [junit] 1 keys imported successfully.
    [junit] ------------- ---------------- ---------------
    [junit] Testsuite: org.apache.cassandra.tools.SSTableImportTest
    [junit] Tests run: 5, Failures: 0, Errors: 0, Time elapsed: 1.31 sec
    [junit] 
    [junit] ------------- Standard Output ---------------
    [junit] Importing 2 keys...
    [junit] 2 keys imported successfully.
    [junit] Importing 2 keys...
    [junit] 2 keys imported successfully.
    [junit] Importing 2 keys...
    [junit] 2 keys imported successfully.
    [junit] Importing 3 keys...
    [junit] Importing 3 keys...
    [junit] 1 keys imported successfully.
    [junit] ------------- ---------------- ---------------
    [junit] ------------- Standard Error -----------------
    [junit] Line 2: Key 303630 is greater than previous, collection is not sorted properly.
Aborting import. You might need to delete SSTables manually.
    [junit] ------------- ---------------- ---------------
    [junit] Testsuite: org.apache.cassandra.utils.BloomFilterTest
    [junit] Tests run: 7, Failures: 0, Errors: 0, Time elapsed: 0.709 sec
    [junit] 
    [junit] Testsuite: org.apache.cassandra.utils.BoundedStatsDequeTest
    [junit] Tests run: 1, Failures: 0, Errors: 0, Time elapsed: 0.056 sec
    [junit] 
    [junit] Testsuite: org.apache.cassandra.utils.ByteBufferUtilTest
    [junit] Tests run: 10, Failures: 0, Errors: 0, Time elapsed: 0.149 sec
    [junit] 
    [junit] Testsuite: org.apache.cassandra.utils.EstimatedHistogramTest
    [junit] Tests run: 4, Failures: 0, Errors: 0, Time elapsed: 0.06 sec
    [junit] 
    [junit] Testsuite: org.apache.cassandra.utils.FBUtilitiesTest
    [junit] Tests run: 5, Failures: 0, Errors: 0, Time elapsed: 0.141 sec
    [junit] 
    [junit] Testsuite: org.apache.cassandra.utils.LegacyBloomFilterTest
    [junit] Tests run: 6, Failures: 0, Errors: 0, Time elapsed: 0.63 sec
    [junit] 
    [junit] Testsuite: org.apache.cassandra.utils.MerkleTreeTest
    [junit] Tests run: 12, Failures: 0, Errors: 0, Time elapsed: 0.398 sec
    [junit] 
    [junit] Testsuite: org.apache.cassandra.utils.SerializationsTest
    [junit] Tests run: 3, Failures: 0, Errors: 0, Time elapsed: 0.593 sec
    [junit] 

BUILD FAILED
<https://builds.apache.org/hudson/job/Cassandra/ws/cassandra/build.xml>:1048: The following
error occurred while executing this line:
<https://builds.apache.org/hudson/job/Cassandra/ws/cassandra/build.xml>:1034: Some unit
test(s) failed.

Total time: 17 minutes 26 seconds
[TASKS] Skipping publisher since build result is FAILURE
Publishing Javadoc
Archiving artifacts
Recording test results


Mime
View raw message