incubator-cassandra-dev mailing list archives

Site index · List index
Message view « Date » · « Thread »
Top « Date » · « Thread »
From Apache Jenkins Server <hud...@hudson.apache.org>
Subject Build failed in Jenkins: Cassandra-0.8 #81
Date Sun, 08 May 2011 05:21:03 GMT
See <https://builds.apache.org/hudson/job/Cassandra-0.8/81/changes>

Changes:

[jbellis] rename ColumnDecoder.Key -> ColumnDecoder.KeyValidator

------------------------------------------
[...truncated 1972 lines...]
    [junit] Tests run: 5, Failures: 0, Errors: 0, Time elapsed: 0.082 sec
    [junit] 
    [junit] Testsuite: org.apache.cassandra.db.marshal.TypeValidationTest
    [junit] Tests run: 9, Failures: 0, Errors: 0, Time elapsed: 0.381 sec
    [junit] 
    [junit] Testsuite: org.apache.cassandra.db.marshal.UUIDTypeTest
    [junit] Tests run: 5, Failures: 0, Errors: 0, Time elapsed: 0.106 sec
    [junit] 
    [junit] Testsuite: org.apache.cassandra.db.migration.SerializationsTest
    [junit] Tests run: 1, Failures: 0, Errors: 0, Time elapsed: 0.627 sec
    [junit] 
    [junit] Testsuite: org.apache.cassandra.dht.BootStrapperTest
    [junit] Tests run: 4, Failures: 0, Errors: 0, Time elapsed: 3.508 sec
    [junit] 
    [junit] ------------- Standard Error -----------------
    [junit]  WARN 05:17:17,327 Generated random token Token(bytes[ebbb3a17ea259a2f11190e694526cbe7]).
Random tokens will result in an unbalanced ring; see http://wiki.apache.org/cassandra/Operations
    [junit] ------------- ---------------- ---------------
    [junit] Testsuite: org.apache.cassandra.dht.ByteOrderedPartitionerTest
    [junit] Tests run: 5, Failures: 0, Errors: 0, Time elapsed: 1.135 sec
    [junit] 
    [junit] Testsuite: org.apache.cassandra.dht.CollatingOrderPreservingPartitionerTest
    [junit] Tests run: 7, Failures: 0, Errors: 0, Time elapsed: 1.636 sec
    [junit] 
    [junit] Testsuite: org.apache.cassandra.dht.OrderPreservingPartitionerTest
    [junit] Tests run: 6, Failures: 0, Errors: 0, Time elapsed: 1.149 sec
    [junit] 
    [junit] Testsuite: org.apache.cassandra.dht.RandomPartitionerTest
    [junit] Tests run: 5, Failures: 0, Errors: 0, Time elapsed: 0.768 sec
    [junit] 
    [junit] Testsuite: org.apache.cassandra.dht.RangeTest
    [junit] Tests run: 13, Failures: 0, Errors: 0, Time elapsed: 0.381 sec
    [junit] 
    [junit] Testsuite: org.apache.cassandra.gms.ArrivalWindowTest
    [junit] Tests run: 1, Failures: 0, Errors: 0, Time elapsed: 0.125 sec
    [junit] 
    [junit] Testsuite: org.apache.cassandra.gms.GossipDigestTest
    [junit] Tests run: 1, Failures: 0, Errors: 0, Time elapsed: 0.058 sec
    [junit] 
    [junit] Testsuite: org.apache.cassandra.gms.SerializationsTest
    [junit] Tests run: 2, Failures: 0, Errors: 0, Time elapsed: 0.377 sec
    [junit] 
    [junit] Testsuite: org.apache.cassandra.hadoop.ColumnFamilyInputFormatTest
    [junit] Tests run: 1, Failures: 0, Errors: 0, Time elapsed: 0.228 sec
    [junit] 
    [junit] Testsuite: org.apache.cassandra.io.BloomFilterTrackerTest
    [junit] Tests run: 3, Failures: 0, Errors: 0, Time elapsed: 0.364 sec
    [junit] 
    [junit] Testsuite: org.apache.cassandra.io.CompactSerializerTest
    [junit] Tests run: 2, Failures: 0, Errors: 0, Time elapsed: 1.599 sec
    [junit] 
    [junit] Testsuite: org.apache.cassandra.io.LazilyCompactedRowTest
    [junit] Tests run: 7, Failures: 0, Errors: 0, Time elapsed: 24.527 sec
    [junit] 
    [junit] ------------- Standard Error -----------------
    [junit]  WARN 05:17:46,323 setting live ratio to maximum of 64 instead of {}, newRatio
    [junit] ------------- ---------------- ---------------
    [junit] Testsuite: org.apache.cassandra.io.sstable.DescriptorTest
    [junit] Tests run: 1, Failures: 0, Errors: 0, Time elapsed: 0.058 sec
    [junit] 
    [junit] Testsuite: org.apache.cassandra.io.sstable.IndexHelperTest
    [junit] Tests run: 1, Failures: 0, Errors: 0, Time elapsed: 0.065 sec
    [junit] 
    [junit] Testsuite: org.apache.cassandra.io.sstable.LegacySSTableTest
    [junit] Tests run: 1, Failures: 0, Errors: 0, Time elapsed: 1.362 sec
    [junit] 
    [junit] ------------- Standard Error -----------------
    [junit]  WARN 05:18:04,712 Invalid file '.svn' in data directory <https://builds.apache.org/hudson/job/Cassandra-0.8/ws/cassandra/test/data/legacy-sstables/e/Keyspace1.>
    [junit]  WARN 05:18:05,303 Invalid file '.svn' in data directory <https://builds.apache.org/hudson/job/Cassandra-0.8/ws/cassandra/test/data/legacy-sstables/b/Keyspace1.>
    [junit] ------------- ---------------- ---------------
    [junit] Testsuite: org.apache.cassandra.io.sstable.SSTableReaderTest
    [junit] Tests run: 3, Failures: 0, Errors: 0, Time elapsed: 5.671 sec
    [junit] 
    [junit] ------------- Standard Error -----------------
    [junit] ERROR 05:18:07,687 insufficient space to compact even the two smallest files,
aborting
    [junit] ERROR 05:18:09,754 insufficient space to compact even the two smallest files,
aborting
    [junit]  WARN 05:18:10,434 setting live ratio to maximum of 64 instead of {}, newRatio
    [junit] ------------- ---------------- ---------------
    [junit] Testsuite: org.apache.cassandra.io.sstable.SSTableTest
    [junit] Tests run: 2, Failures: 0, Errors: 0, Time elapsed: 1.454 sec
    [junit] 
    [junit] Testsuite: org.apache.cassandra.io.sstable.SSTableWriterCommutativeTest
    [junit] Tests run: 1, Failures: 0, Errors: 0, Time elapsed: 1.306 sec
    [junit] 
    [junit] Testsuite: org.apache.cassandra.io.sstable.SSTableWriterTest
    [junit] Tests run: 1, Failures: 0, Errors: 0, Time elapsed: 1.259 sec
    [junit] 
    [junit] Testsuite: org.apache.cassandra.io.util.BufferedRandomAccessFileTest
    [junit] Tests run: 20, Failures: 0, Errors: 0, Time elapsed: 2.894 sec
    [junit] 
    [junit] Testsuite: org.apache.cassandra.locator.DynamicEndpointSnitchTest
    [junit] Tests run: 1, Failures: 0, Errors: 0, Time elapsed: 6.141 sec
    [junit] 
    [junit] Testsuite: org.apache.cassandra.locator.NetworkTopologyStrategyTest
    [junit] Tests run: 2, Failures: 0, Errors: 0, Time elapsed: 0.402 sec
    [junit] 
    [junit] Testsuite: org.apache.cassandra.locator.OldNetworkTopologyStrategyTest
    [junit] Tests run: 3, Failures: 0, Errors: 0, Time elapsed: 0.393 sec
    [junit] 
    [junit] Testsuite: org.apache.cassandra.locator.ReplicationStrategyEndpointCacheTest
    [junit] Tests run: 2, Failures: 0, Errors: 0, Time elapsed: 0.565 sec
    [junit] 
    [junit] Testsuite: org.apache.cassandra.locator.SimpleStrategyTest
    [junit] Tests run: 4, Failures: 0, Errors: 0, Time elapsed: 0.669 sec
    [junit] 
    [junit] Testsuite: org.apache.cassandra.locator.TokenMetadataTest
    [junit] Tests run: 3, Failures: 0, Errors: 0, Time elapsed: 0.393 sec
    [junit] 
    [junit] Testsuite: org.apache.cassandra.service.AntiEntropyServiceCounterTest
    [junit] Tests run: 7, Failures: 0, Errors: 0, Time elapsed: 4.496 sec
    [junit] 
    [junit] ------------- Standard Error -----------------
    [junit]  WARN 05:18:37,333 Generated random token Token(bytes[1e3ba1896bb5a1bc5779fd2b6a3ce4a0]).
Random tokens will result in an unbalanced ring; see http://wiki.apache.org/cassandra/Operations
    [junit] ------------- ---------------- ---------------
    [junit] Testsuite: org.apache.cassandra.service.AntiEntropyServiceStandardTest
    [junit] Tests run: 7, Failures: 0, Errors: 0, Time elapsed: 4.29 sec
    [junit] 
    [junit] ------------- Standard Error -----------------
    [junit]  WARN 05:18:43,051 Generated random token Token(bytes[64541c533fd21b32dbbacc06907f4f8d]).
Random tokens will result in an unbalanced ring; see http://wiki.apache.org/cassandra/Operations
    [junit] ------------- ---------------- ---------------
    [junit] Testsuite: org.apache.cassandra.service.CassandraServerTest
    [junit] Tests run: 1, Failures: 0, Errors: 0, Time elapsed: 0.387 sec
    [junit] 
    [junit] Testsuite: org.apache.cassandra.service.ConsistencyLevelTest
    [junit] Tests run: 1, Failures: 0, Errors: 0, Time elapsed: 0.837 sec
    [junit] 
    [junit] Testsuite: org.apache.cassandra.service.EmbeddedCassandraServiceTest
    [junit] Tests run: 1, Failures: 0, Errors: 0, Time elapsed: 1.408 sec
    [junit] 
    [junit] ------------- Standard Error -----------------
    [junit]  WARN 05:18:51,138 Unable to lock JVM memory (ENOMEM). This can result in part
of the JVM being swapped out, especially with mmapped I/O enabled. Increase RLIMIT_MEMLOCK
or run Cassandra as root.
    [junit]  WARN 05:18:51,847 Generated random token Token(bytes[08c50b030bd670a95570e082b75e39c8]).
Random tokens will result in an unbalanced ring; see http://wiki.apache.org/cassandra/Operations
    [junit] ------------- ---------------- ---------------
    [junit] Testsuite: org.apache.cassandra.service.InitClientTest
    [junit] Tests run: 1, Failures: 0, Errors: 0, Time elapsed: 5.397 sec
    [junit] 
    [junit] Testsuite: org.apache.cassandra.service.LeaveAndBootstrapTest
    [junit] Tests run: 6, Failures: 0, Errors: 0, Time elapsed: 3.318 sec
    [junit] 
    [junit] ------------- Standard Error -----------------
    [junit]  WARN 05:19:02,602 Node /127.0.0.3 'leaving' token mismatch. Long network partition?
    [junit] ERROR 05:19:02,693 insufficient space to compact even the two smallest files,
aborting
    [junit] ------------- ---------------- ---------------
    [junit] Testsuite: org.apache.cassandra.service.MoveTest
    [junit] Tests run: 3, Failures: 0, Errors: 0, Time elapsed: 2.106 sec
    [junit] 
    [junit] Testsuite: org.apache.cassandra.service.RemoveTest
    [junit] Tests run: 5, Failures: 0, Errors: 0, Time elapsed: 3.25 sec
    [junit] 
    [junit] ------------- Standard Error -----------------
    [junit] ERROR 05:19:10,142 insufficient space to compact even the two smallest files,
aborting
    [junit] ------------- ---------------- ---------------
    [junit] Testsuite: org.apache.cassandra.service.RowResolverTest
    [junit] Tests run: 5, Failures: 0, Errors: 0, Time elapsed: 0.393 sec
    [junit] 
    [junit] Testsuite: org.apache.cassandra.service.SerializationsTest
    [junit] Tests run: 2, Failures: 0, Errors: 0, Time elapsed: 0.143 sec
    [junit] 
    [junit] Testsuite: org.apache.cassandra.service.StorageProxyTest
    [junit] Tests run: 4, Failures: 0, Errors: 0, Time elapsed: 0.393 sec
    [junit] 
    [junit] Testsuite: org.apache.cassandra.service.StorageServiceClientTest
    [junit] Tests run: 1, Failures: 0, Errors: 0, Time elapsed: 5.44 sec
    [junit] 
    [junit] Testsuite: org.apache.cassandra.service.StorageServiceServerTest
    [junit] Tests run: 3, Failures: 0, Errors: 0, Time elapsed: 1.135 sec
    [junit] 
    [junit] ------------- Standard Error -----------------
    [junit]  WARN 05:19:21,611 Generated random token Token(bytes[a950288782f833e6e1d301cd18a6880e]).
Random tokens will result in an unbalanced ring; see http://wiki.apache.org/cassandra/Operations
    [junit] ------------- ---------------- ---------------
    [junit] Testsuite: org.apache.cassandra.streaming.BootstrapTest
    [junit] Tests run: 1, Failures: 0, Errors: 0, Time elapsed: 0.552 sec
    [junit] 
    [junit] Testsuite: org.apache.cassandra.streaming.SerializationsTest
    [junit] Tests run: 4, Failures: 0, Errors: 0, Time elapsed: 0.407 sec
    [junit] 
    [junit] Testsuite: org.apache.cassandra.streaming.StreamingTransferTest
    [junit] Tests run: 3, Failures: 0, Errors: 0, Time elapsed: 2.818 sec
    [junit] 
    [junit] ------------- Standard Error -----------------
    [junit]  WARN 05:19:25,942 Generated random token Token(bytes[58349b184c23edafe1a1e842562bb820]).
Random tokens will result in an unbalanced ring; see http://wiki.apache.org/cassandra/Operations
    [junit] ------------- ---------------- ---------------
    [junit] Testsuite: org.apache.cassandra.thrift.ThriftValidationTest
    [junit] Tests run: 2, Failures: 0, Errors: 0, Time elapsed: 0.403 sec
    [junit] 
    [junit] Testsuite: org.apache.cassandra.tools.SSTableExportTest
    [junit] Tests run: 5, Failures: 0, Errors: 0, Time elapsed: 1.601 sec
    [junit] 
    [junit] ------------- Standard Output ---------------
    [junit] Importing 1 keys...
    [junit] 1 keys imported successfully.
    [junit] ------------- ---------------- ---------------
    [junit] Testsuite: org.apache.cassandra.tools.SSTableImportTest
    [junit] Tests run: 5, Failures: 0, Errors: 0, Time elapsed: 1.313 sec
    [junit] 
    [junit] ------------- Standard Output ---------------
    [junit] Importing 2 keys...
    [junit] 2 keys imported successfully.
    [junit] Importing 2 keys...
    [junit] 2 keys imported successfully.
    [junit] Importing 2 keys...
    [junit] 2 keys imported successfully.
    [junit] Importing 3 keys...
    [junit] Importing 3 keys...
    [junit] 1 keys imported successfully.
    [junit] ------------- ---------------- ---------------
    [junit] ------------- Standard Error -----------------
    [junit] Line 2: Key 303630 is greater than previous, collection is not sorted properly.
Aborting import. You might need to delete SSTables manually.
    [junit] ------------- ---------------- ---------------
    [junit] Testsuite: org.apache.cassandra.utils.BloomFilterTest
    [junit] Tests run: 7, Failures: 0, Errors: 0, Time elapsed: 0.702 sec
    [junit] 
    [junit] Testsuite: org.apache.cassandra.utils.BoundedStatsDequeTest
    [junit] Tests run: 1, Failures: 0, Errors: 0, Time elapsed: 0.057 sec
    [junit] 
    [junit] Testsuite: org.apache.cassandra.utils.ByteBufferUtilTest
    [junit] Tests run: 10, Failures: 0, Errors: 0, Time elapsed: 0.149 sec
    [junit] 
    [junit] Testsuite: org.apache.cassandra.utils.EstimatedHistogramTest
    [junit] Tests run: 4, Failures: 0, Errors: 0, Time elapsed: 0.059 sec
    [junit] 
    [junit] Testsuite: org.apache.cassandra.utils.FBUtilitiesTest
    [junit] Tests run: 5, Failures: 0, Errors: 0, Time elapsed: 0.141 sec
    [junit] 
    [junit] Testsuite: org.apache.cassandra.utils.LegacyBloomFilterTest
    [junit] Tests run: 6, Failures: 0, Errors: 0, Time elapsed: 0.633 sec
    [junit] 
    [junit] Testsuite: org.apache.cassandra.utils.MerkleTreeTest
    [junit] Tests run: 12, Failures: 1, Errors: 0, Time elapsed: 0.393 sec
    [junit] 
    [junit] Testcase: testDifference(org.apache.cassandra.utils.MerkleTreeTest):	FAILED
    [junit] 
    [junit] junit.framework.AssertionFailedError: 
    [junit] 	at org.apache.cassandra.utils.MerkleTreeTest.testDifference(MerkleTreeTest.java:459)
    [junit] 
    [junit] 
    [junit] Test org.apache.cassandra.utils.MerkleTreeTest FAILED
    [junit] Testsuite: org.apache.cassandra.utils.SerializationsTest
    [junit] Tests run: 3, Failures: 0, Errors: 0, Time elapsed: 0.644 sec
    [junit] 

BUILD FAILED
<https://builds.apache.org/hudson/job/Cassandra-0.8/ws/cassandra/build.xml>:1048: The
following error occurred while executing this line:
<https://builds.apache.org/hudson/job/Cassandra-0.8/ws/cassandra/build.xml>:1034: Some
unit test(s) failed.

Total time: 16 minutes 50 seconds
[TASKS] Skipping publisher since build result is FAILURE
Archiving artifacts
Publishing Javadoc
Recording test results


Mime
View raw message