incubator-cassandra-dev mailing list archives

Site index · List index
Message view « Date » · « Thread »
Top « Date » · « Thread »
From Apache Jenkins Server <hud...@hudson.apache.org>
Subject Build failed in Jenkins: Cassandra-0.8 #90
Date Tue, 10 May 2011 15:44:50 GMT
See <https://builds.apache.org/hudson/job/Cassandra-0.8/90/>

------------------------------------------
Started by an SCM change
Building remotely on ubuntu1
hudson.util.IOException2: remote file operation failed: <https://builds.apache.org/hudson/job/Cassandra-0.8/ws/>
at hudson.remoting.Channel@15e54345:ubuntu1
	at hudson.FilePath.act(FilePath.java:752)
	at hudson.FilePath.act(FilePath.java:738)
	at hudson.scm.SubversionSCM.checkout(SubversionSCM.java:684)
	at hudson.scm.SubversionSCM.checkout(SubversionSCM.java:633)
	at hudson.model.AbstractProject.checkout(AbstractProject.java:1181)
	at hudson.model.AbstractBuild$AbstractRunner.checkout(AbstractBuild.java:536)
	at hudson.model.AbstractBuild$AbstractRunner.run(AbstractBuild.java:424)
	at hudson.model.Run.run(Run.java:1374)
	at hudson.model.FreeStyleBuild.run(FreeStyleBuild.java:46)
	at hudson.model.ResourceController.execute(ResourceController.java:88)
	at hudson.model.Executor.run(Executor.java:145)
Caused by: java.io.IOException: Remote call on ubuntu1 failed
	at hudson.remoting.Channel.call(Channel.java:652)
	at hudson.FilePath.act(FilePath.java:745)
	... 10 more
Caused by: java.lang.Error: Failed to deserialize the Callable object.
	at hudson.remoting.UserRequest.perform(UserRequest.java:104)
	at hudson.remoting.UserRequest.perform(UserRequest.java:48)
	at hudson.remoting.Request$2.run(Request.java:270)
	at java.util.concurrent.Executors$RunnableAdapter.call(Executors.java:471)
	at java.util.concurrent.FutureTask$Sync.innerRun(FutureTask.java:334)
	at java.util.concurrent.FutureTask.run(FutureTask.java:166)
	at java.util.concurrent.ThreadPoolExecutor.runWorker(ThreadPoolExecutor.java:1110)
	at java.util.concurrent.ThreadPoolExecutor$Worker.run(ThreadPoolExecutor.java:603)
	at java.lang.Thread.run(Thread.java:636)
Caused by: java.lang.IllegalStateException: Unable to call fetch2. Invalid object ID 10121
	at hudson.remoting.RemoteInvocationHandler$RPCRequest.perform(RemoteInvocationHandler.java:268)
	at hudson.remoting.Request$2.run(Request.java:270)
	at java.util.concurrent.Executors$RunnableAdapter.call(Executors.java:441)
	at java.util.concurrent.FutureTask$Sync.innerRun(FutureTask.java:303)
	at java.util.concurrent.FutureTask.run(FutureTask.java:138)
	at java.util.concurrent.ThreadPoolExecutor$Worker.runTask(ThreadPoolExecutor.java:886)
	at java.util.concurrent.ThreadPoolExecutor$Worker.run(ThreadPoolExecutor.java:908)
	at java.lang.Thread.run(Thread.java:662)
[TASKS] Skipping publisher since build result is FAILURE
Archiving artifacts
ERROR: Publisher hudson.tasks.ArtifactArchiver aborted due to exception
java.lang.NullPointerException
	at hudson.remoting.MultiClassLoaderSerializer$Input.readClassLoader(MultiClassLoaderSerializer.java:94)
	at hudson.remoting.MultiClassLoaderSerializer$Input.resolveClass(MultiClassLoaderSerializer.java:111)
	at java.io.ObjectInputStream.readNonProxyDesc(ObjectInputStream.java:1574)
	at java.io.ObjectInputStream.readClassDesc(ObjectInputStream.java:1495)
	at java.io.ObjectInputStream.readOrdinaryObject(ObjectInputStream.java:1731)
	at java.io.ObjectInputStream.readObject0(ObjectInputStream.java:1328)
	at java.io.ObjectInputStream.readObject(ObjectInputStream.java:350)
	at hudson.remoting.UserRequest.deserialize(UserRequest.java:182)
	at hudson.remoting.UserResponse.retrieve(UserRequest.java:211)
	at hudson.remoting.Channel.call(Channel.java:644)
	at hudson.EnvVars.getRemote(EnvVars.java:202)
	at hudson.model.Computer.getEnvironment(Computer.java:805)
	at hudson.model.Run.getEnvironment(Run.java:1778)
	at hudson.model.AbstractBuild.getEnvironment(AbstractBuild.java:745)
	at hudson.tasks.ArtifactArchiver.perform(ArtifactArchiver.java:116)
	at hudson.tasks.BuildStepMonitor$1.perform(BuildStepMonitor.java:19)
	at hudson.model.AbstractBuild$AbstractRunner.perform(AbstractBuild.java:662)
	at hudson.model.AbstractBuild$AbstractRunner.performAllBuildSteps(AbstractBuild.java:638)
	at hudson.model.AbstractBuild$AbstractRunner.performAllBuildSteps(AbstractBuild.java:616)
	at hudson.model.Build$RunnerImpl.post2(Build.java:161)
	at hudson.model.AbstractBuild$AbstractRunner.post(AbstractBuild.java:585)
	at hudson.model.Run.run(Run.java:1398)
	at hudson.model.FreeStyleBuild.run(FreeStyleBuild.java:46)
	at hudson.model.ResourceController.execute(ResourceController.java:88)
	at hudson.model.Executor.run(Executor.java:145)
Publishing Javadoc
ERROR: Publisher hudson.tasks.JavadocArchiver aborted due to exception
java.lang.IllegalArgumentException: Negative time
	at java.io.File.setLastModified(File.java:1258)
	at hudson.FilePath.readFromTar(FilePath.java:1617)
	at hudson.FilePath.copyRecursiveTo(FilePath.java:1542)
	at hudson.FilePath.copyRecursiveTo(FilePath.java:1450)
	at hudson.tasks.JavadocArchiver.perform(JavadocArchiver.java:98)
	at hudson.tasks.BuildStepMonitor$1.perform(BuildStepMonitor.java:19)
	at hudson.model.AbstractBuild$AbstractRunner.perform(AbstractBuild.java:662)
	at hudson.model.AbstractBuild$AbstractRunner.performAllBuildSteps(AbstractBuild.java:638)
	at hudson.model.AbstractBuild$AbstractRunner.performAllBuildSteps(AbstractBuild.java:616)
	at hudson.model.Build$RunnerImpl.post2(Build.java:161)
	at hudson.model.AbstractBuild$AbstractRunner.post(AbstractBuild.java:585)
	at hudson.model.Run.run(Run.java:1398)
	at hudson.model.FreeStyleBuild.run(FreeStyleBuild.java:46)
	at hudson.model.ResourceController.execute(ResourceController.java:88)
	at hudson.model.Executor.run(Executor.java:145)
Recording test results


Mime
View raw message