incubator-cassandra-dev mailing list archives

Site index · List index
Message view « Date » · « Thread »
Top « Date » · « Thread »
From Apache Jenkins Server <hud...@hudson.apache.org>
Subject Build failed in Jenkins: Cassandra-0.7 #471
Date Fri, 06 May 2011 19:50:27 GMT
See <https://builds.apache.org/hudson/job/Cassandra-0.7/471/changes>

Changes:

[jbellis] add back obsolete mutation debug log

------------------------------------------
[...truncated 1654 lines...]
    [junit] Testsuite: org.apache.cassandra.db.RowIterationTest
    [junit] Tests run: 3, Failures: 0, Errors: 0, Time elapsed: 0.326 sec
    [junit] 
    [junit] Testsuite: org.apache.cassandra.db.RowTest
    [junit] Tests run: 4, Failures: 0, Errors: 0, Time elapsed: 2.405 sec
    [junit] 
    [junit] Testsuite: org.apache.cassandra.db.ScrubTest
    [junit] Tests run: 4, Failures: 0, Errors: 0, Time elapsed: 1.043 sec
    [junit] 
    [junit] Testsuite: org.apache.cassandra.db.SerializationsTest
    [junit] Tests run: 7, Failures: 0, Errors: 0, Time elapsed: 0.436 sec
    [junit] 
    [junit] Testsuite: org.apache.cassandra.db.SuperColumnTest
    [junit] Tests run: 1, Failures: 0, Errors: 0, Time elapsed: 0.126 sec
    [junit] 
    [junit] Testsuite: org.apache.cassandra.db.TableTest
    [junit] Tests run: 10, Failures: 0, Errors: 0, Time elapsed: 1.077 sec
    [junit] 
    [junit] Testsuite: org.apache.cassandra.db.TimeSortTest
    [junit] Tests run: 2, Failures: 0, Errors: 0, Time elapsed: 1.454 sec
    [junit] 
    [junit] Testsuite: org.apache.cassandra.db.commitlog.CommitLogHeaderTest
    [junit] Tests run: 2, Failures: 0, Errors: 0, Time elapsed: 0.395 sec
    [junit] 
    [junit] Testsuite: org.apache.cassandra.db.marshal.IntegerTypeTest
    [junit] Tests run: 10, Failures: 0, Errors: 0, Time elapsed: 0.183 sec
    [junit] 
    [junit] Testsuite: org.apache.cassandra.db.marshal.TimeUUIDTypeTest
    [junit] Tests run: 6, Failures: 0, Errors: 0, Time elapsed: 0.072 sec
    [junit] 
    [junit] Testsuite: org.apache.cassandra.db.marshal.TypeCompareTest
    [junit] Tests run: 5, Failures: 0, Errors: 0, Time elapsed: 0.076 sec
    [junit] 
    [junit] Testsuite: org.apache.cassandra.db.marshal.TypeValidationTest
    [junit] Tests run: 9, Failures: 0, Errors: 0, Time elapsed: 0.267 sec
    [junit] 
    [junit] Testsuite: org.apache.cassandra.db.migration.SerializationsTest
    [junit] Tests run: 1, Failures: 0, Errors: 0, Time elapsed: 0.623 sec
    [junit] 
    [junit] Testsuite: org.apache.cassandra.dht.BootStrapperTest
    [junit] Tests run: 4, Failures: 0, Errors: 0, Time elapsed: 1.696 sec
    [junit] 
    [junit] ------------- Standard Error -----------------
    [junit]  WARN 12:47:42,709 Generated random token Token(bytes[a27f00672a1721e2e4a700ff44b961eb]).
Random tokens will result in an unbalanced ring; see http://wiki.apache.org/cassandra/Operations
    [junit] ------------- ---------------- ---------------
    [junit] Testsuite: org.apache.cassandra.dht.ByteOrderedPartitionerTest
    [junit] Tests run: 5, Failures: 0, Errors: 0, Time elapsed: 1.151 sec
    [junit] 
    [junit] Testsuite: org.apache.cassandra.dht.CollatingOrderPreservingPartitionerTest
    [junit] Tests run: 7, Failures: 0, Errors: 0, Time elapsed: 1.467 sec
    [junit] 
    [junit] Testsuite: org.apache.cassandra.dht.OrderPreservingPartitionerTest
    [junit] Tests run: 6, Failures: 0, Errors: 0, Time elapsed: 1.167 sec
    [junit] 
    [junit] Testsuite: org.apache.cassandra.dht.RandomPartitionerTest
    [junit] Tests run: 5, Failures: 0, Errors: 0, Time elapsed: 0.779 sec
    [junit] 
    [junit] Testsuite: org.apache.cassandra.dht.RangeTest
    [junit] Tests run: 13, Failures: 0, Errors: 0, Time elapsed: 0.393 sec
    [junit] 
    [junit] Testsuite: org.apache.cassandra.gms.ArrivalWindowTest
    [junit] Tests run: 1, Failures: 0, Errors: 0, Time elapsed: 0.113 sec
    [junit] 
    [junit] Testsuite: org.apache.cassandra.gms.GossipDigestTest
    [junit] Tests run: 1, Failures: 0, Errors: 0, Time elapsed: 0.053 sec
    [junit] 
    [junit] Testsuite: org.apache.cassandra.gms.SerializationsTest
    [junit] Tests run: 2, Failures: 0, Errors: 0, Time elapsed: 0.399 sec
    [junit] 
    [junit] Testsuite: org.apache.cassandra.hadoop.ColumnFamilyInputFormatTest
    [junit] Tests run: 1, Failures: 0, Errors: 0, Time elapsed: 0.182 sec
    [junit] 
    [junit] Testsuite: org.apache.cassandra.io.BloomFilterTrackerTest
    [junit] Tests run: 3, Failures: 0, Errors: 0, Time elapsed: 0.403 sec
    [junit] 
    [junit] Testsuite: org.apache.cassandra.io.CompactSerializerTest
    [junit] Tests run: 2, Failures: 0, Errors: 0, Time elapsed: 1.312 sec
    [junit] 
    [junit] Testsuite: org.apache.cassandra.io.LazilyCompactedRowTest
    [junit] Tests run: 6, Failures: 0, Errors: 0, Time elapsed: 1.678 sec
    [junit] 
    [junit] Testsuite: org.apache.cassandra.io.sstable.DescriptorTest
    [junit] Tests run: 1, Failures: 0, Errors: 0, Time elapsed: 0.053 sec
    [junit] 
    [junit] Testsuite: org.apache.cassandra.io.sstable.IndexHelperTest
    [junit] Tests run: 1, Failures: 0, Errors: 0, Time elapsed: 0.059 sec
    [junit] 
    [junit] Testsuite: org.apache.cassandra.io.sstable.LegacySSTableTest
    [junit] Tests run: 1, Failures: 0, Errors: 0, Time elapsed: 1.379 sec
    [junit] 
    [junit] ------------- Standard Error -----------------
    [junit]  WARN 12:48:05,353 Invalid file '.svn' in data directory <https://builds.apache.org/hudson/job/Cassandra-0.7/ws/cassandra/test/data/legacy-sstables/b/Keyspace1.>
    [junit]  WARN 12:48:05,948 Invalid file '.svn' in data directory <https://builds.apache.org/hudson/job/Cassandra-0.7/ws/cassandra/test/data/legacy-sstables/e/Keyspace1.>
    [junit] ------------- ---------------- ---------------
    [junit] Testsuite: org.apache.cassandra.io.sstable.SSTableReaderTest
    [junit] Tests run: 3, Failures: 0, Errors: 0, Time elapsed: 0.806 sec
    [junit] 
    [junit] Testsuite: org.apache.cassandra.io.sstable.SSTableTest
    [junit] Tests run: 2, Failures: 0, Errors: 0, Time elapsed: 1.117 sec
    [junit] 
    [junit] Testsuite: org.apache.cassandra.io.sstable.SSTableWriterTest
    [junit] Tests run: 1, Failures: 0, Errors: 0, Time elapsed: 0.601 sec
    [junit] 
    [junit] Testsuite: org.apache.cassandra.io.util.BufferedRandomAccessFileTest
    [junit] Tests run: 17, Failures: 0, Errors: 0, Time elapsed: 0.505 sec
    [junit] 
    [junit] Testsuite: org.apache.cassandra.locator.DynamicEndpointSnitchTest
    [junit] Tests run: 1, Failures: 0, Errors: 0, Time elapsed: 6.145 sec
    [junit] 
    [junit] Testsuite: org.apache.cassandra.locator.NetworkTopologyStrategyTest
    [junit] Tests run: 2, Failures: 0, Errors: 0, Time elapsed: 0.411 sec
    [junit] 
    [junit] Testsuite: org.apache.cassandra.locator.OldNetworkTopologyStrategyTest
    [junit] Tests run: 3, Failures: 0, Errors: 0, Time elapsed: 0.415 sec
    [junit] 
    [junit] Testsuite: org.apache.cassandra.locator.ReplicationStrategyEndpointCacheTest
    [junit] Tests run: 2, Failures: 0, Errors: 0, Time elapsed: 0.56 sec
    [junit] 
    [junit] Testsuite: org.apache.cassandra.locator.SimpleStrategyTest
    [junit] Tests run: 4, Failures: 0, Errors: 0, Time elapsed: 0.563 sec
    [junit] 
    [junit] Testsuite: org.apache.cassandra.locator.TokenMetadataTest
    [junit] Tests run: 3, Failures: 0, Errors: 0, Time elapsed: 0.393 sec
    [junit] 
    [junit] Testsuite: org.apache.cassandra.service.AntiEntropyServiceTest
    [junit] Exception in thread "Thread-4" java.lang.RuntimeException: java.lang.NullPointerException
    [junit] 	at org.apache.cassandra.utils.WrappedRunnable.run(WrappedRunnable.java:34)
    [junit] 	at org.apache.cassandra.streaming.StreamInSession.closeIfFinished(StreamInSession.java:168)
    [junit] 	at org.apache.cassandra.streaming.IncomingStreamReader.read(IncomingStreamReader.java:63)
    [junit] 	at org.apache.cassandra.net.IncomingTcpConnection.run(IncomingTcpConnection.java:91)
    [junit] Caused by: java.lang.NullPointerException
    [junit] 	at org.apache.cassandra.service.AntiEntropyService.completedRequest(AntiEntropyService.java:134)
    [junit] 	at org.apache.cassandra.service.AntiEntropyService$Differencer$Callback.runMayThrow(AntiEntropyService.java:532)
    [junit] 	at org.apache.cassandra.utils.WrappedRunnable.run(WrappedRunnable.java:30)
    [junit] 	... 3 more
    [junit] Tests run: 7, Failures: 0, Errors: 0, Time elapsed: 0.996 sec
    [junit] 
    [junit] ------------- Standard Error -----------------
    [junit]  WARN 12:48:26,934 Generated random token Token(bytes[36797e5563e77bc4e6717d53d5bfb7bd]).
Random tokens will result in an unbalanced ring; see http://wiki.apache.org/cassandra/Operations
    [junit] ------------- ---------------- ---------------
    [junit] Testsuite: org.apache.cassandra.service.CassandraServerTest
    [junit] Tests run: 1, Failures: 0, Errors: 0, Time elapsed: 0.41 sec
    [junit] 
    [junit] Testsuite: org.apache.cassandra.service.ConsistencyLevelTest
    [junit] Tests run: 1, Failures: 0, Errors: 0, Time elapsed: 0.577 sec
    [junit] 
    [junit] Testsuite: org.apache.cassandra.service.EmbeddedCassandraServiceTest
    [junit] Tests run: 1, Failures: 0, Errors: 0, Time elapsed: 0.751 sec
    [junit] 
    [junit] ------------- Standard Error -----------------
    [junit]  WARN 12:48:31,571 Unable to lock JVM memory (ENOMEM). This can result in part
of the JVM being swapped out, especially with mmapped I/O enabled. Increase RLIMIT_MEMLOCK
or run Cassandra as root.
    [junit]  WARN 12:48:31,795 Generated random token Token(bytes[122ceca7accd951efb761d38f83484d8]).
Random tokens will result in an unbalanced ring; see http://wiki.apache.org/cassandra/Operations
    [junit] ------------- ---------------- ---------------
    [junit] Testsuite: org.apache.cassandra.service.InitClientTest
    [junit] Tests run: 1, Failures: 0, Errors: 0, Time elapsed: 5.395 sec
    [junit] 
    [junit] Testsuite: org.apache.cassandra.service.MoveTest
    [junit] Tests run: 6, Failures: 0, Errors: 0, Time elapsed: 1.039 sec
    [junit] 
    [junit] ------------- Standard Error -----------------
    [junit]  WARN 12:48:40,445 Node /127.0.0.3 'leaving' token mismatch. Long network partition?
    [junit] ------------- ---------------- ---------------
    [junit] Testsuite: org.apache.cassandra.service.RemoveTest
    [junit] Tests run: 5, Failures: 0, Errors: 0, Time elapsed: 1.795 sec
    [junit] 
    [junit] Testsuite: org.apache.cassandra.service.RowResolverTest
    [junit] Tests run: 5, Failures: 0, Errors: 0, Time elapsed: 0.417 sec
    [junit] 
    [junit] Testsuite: org.apache.cassandra.service.SerializationsTest
    [junit] Tests run: 2, Failures: 0, Errors: 0, Time elapsed: 0.419 sec
    [junit] 
    [junit] Testsuite: org.apache.cassandra.service.StorageProxyTest
    [junit] Tests run: 4, Failures: 0, Errors: 0, Time elapsed: 0.43 sec
    [junit] 
    [junit] Testsuite: org.apache.cassandra.service.StorageServiceClientTest
    [junit] Tests run: 1, Failures: 0, Errors: 0, Time elapsed: 5.416 sec
    [junit] 
    [junit] Testsuite: org.apache.cassandra.service.StorageServiceServerTest
    [junit] Tests run: 3, Failures: 0, Errors: 0, Time elapsed: 0.644 sec
    [junit] 
    [junit] ------------- Standard Error -----------------
    [junit]  WARN 12:48:54,478 Generated random token Token(bytes[8c122ddeed776bd67865e41dc9f10f21]).
Random tokens will result in an unbalanced ring; see http://wiki.apache.org/cassandra/Operations
    [junit] ------------- ---------------- ---------------
    [junit] Testsuite: org.apache.cassandra.streaming.BootstrapTest
    [junit] Tests run: 1, Failures: 0, Errors: 0, Time elapsed: 0.551 sec
    [junit] 
    [junit] Testsuite: org.apache.cassandra.streaming.SerializationsTest
    [junit] Tests run: 4, Failures: 0, Errors: 0, Time elapsed: 0.442 sec
    [junit] 
    [junit] Testsuite: org.apache.cassandra.streaming.StreamingTransferTest
    [junit] Tests run: 3, Failures: 0, Errors: 0, Time elapsed: 0.607 sec
    [junit] 
    [junit] ------------- Standard Error -----------------
    [junit]  WARN 12:48:58,290 Generated random token Token(bytes[0b299665426365cd080b4a6fcb8961ed]).
Random tokens will result in an unbalanced ring; see http://wiki.apache.org/cassandra/Operations
    [junit] ------------- ---------------- ---------------
    [junit] Testsuite: org.apache.cassandra.tools.SSTableExportTest
    [junit] Tests run: 4, Failures: 0, Errors: 0, Time elapsed: 0.709 sec
    [junit] 
    [junit] ------------- Standard Output ---------------
    [junit] Importing 1 keys...
    [junit] 1 keys imported successfully.
    [junit] ------------- ---------------- ---------------
    [junit] Testsuite: org.apache.cassandra.tools.SSTableImportTest
    [junit] Tests run: 3, Failures: 0, Errors: 0, Time elapsed: 0.683 sec
    [junit] 
    [junit] ------------- Standard Output ---------------
    [junit] Importing 2 keys...
    [junit] 2 keys imported successfully.
    [junit] Importing 2 keys...
    [junit] 2 keys imported successfully.
    [junit] Importing 3 keys...
    [junit] ------------- ---------------- ---------------
    [junit] ------------- Standard Error -----------------
    [junit] Line 2: Key 303630 is greater than previous, collection is not sorted properly.
Aborting import. You might need to delete SSTables manually.
    [junit] ------------- ---------------- ---------------
    [junit] Testsuite: org.apache.cassandra.utils.BloomFilterTest
    [junit] Tests run: 7, Failures: 0, Errors: 0, Time elapsed: 0.735 sec
    [junit] 
    [junit] Testsuite: org.apache.cassandra.utils.BoundedStatsDequeTest
    [junit] Tests run: 1, Failures: 0, Errors: 0, Time elapsed: 0.051 sec
    [junit] 
    [junit] Testsuite: org.apache.cassandra.utils.ByteBufferUtilTest
    [junit] Tests run: 10, Failures: 0, Errors: 0, Time elapsed: 0.138 sec
    [junit] 
    [junit] Testsuite: org.apache.cassandra.utils.EstimatedHistogramTest
    [junit] Tests run: 4, Failures: 0, Errors: 0, Time elapsed: 0.056 sec
    [junit] 
    [junit] Testsuite: org.apache.cassandra.utils.FBUtilitiesTest
    [junit] Tests run: 2, Failures: 0, Errors: 0, Time elapsed: 0.119 sec
    [junit] 
    [junit] Testsuite: org.apache.cassandra.utils.LegacyBloomFilterTest
    [junit] Tests run: 7, Failures: 0, Errors: 0, Time elapsed: 0.69 sec
    [junit] 
    [junit] Testsuite: org.apache.cassandra.utils.MerkleTreeTest
    [junit] Tests run: 14, Failures: 0, Errors: 0, Time elapsed: 0.421 sec
    [junit] 
    [junit] Testsuite: org.apache.cassandra.utils.SerializationsTest
    [junit] Tests run: 3, Failures: 0, Errors: 0, Time elapsed: 0.672 sec
    [junit] 

BUILD FAILED
<https://builds.apache.org/hudson/job/Cassandra-0.7/ws/cassandra/build.xml>:852: The
following error occurred while executing this line:
<https://builds.apache.org/hudson/job/Cassandra-0.7/ws/cassandra/build.xml>:838: Some
unit test(s) failed.

Total time: 12 minutes 8 seconds
[TASKS] Skipping publisher since build result is FAILURE
Publishing Javadoc
Archiving artifacts
Recording test results


Mime
View raw message