incubator-cassandra-dev mailing list archives

Site index · List index
Message view « Date » · « Thread »
Top « Date » · « Thread »
From Apache Jenkins Server <hud...@hudson.apache.org>
Subject Build failed in Jenkins: Cassandra #884
Date Fri, 06 May 2011 17:32:07 GMT
See <https://builds.apache.org/hudson/job/Cassandra/884/>

------------------------------------------
[...truncated 2008 lines...]
    [junit] 
    [junit] Testsuite: org.apache.cassandra.dht.RangeTest
    [junit] Tests run: 13, Failures: 0, Errors: 0, Time elapsed: 0.39 sec
    [junit] 
    [junit] Testsuite: org.apache.cassandra.gms.ArrivalWindowTest
    [junit] Tests run: 1, Failures: 0, Errors: 0, Time elapsed: 0.125 sec
    [junit] 
    [junit] Testsuite: org.apache.cassandra.gms.GossipDigestTest
    [junit] Tests run: 1, Failures: 0, Errors: 0, Time elapsed: 0.058 sec
    [junit] 
    [junit] Testsuite: org.apache.cassandra.gms.SerializationsTest
    [junit] Tests run: 2, Failures: 0, Errors: 0, Time elapsed: 0.379 sec
    [junit] 
    [junit] Testsuite: org.apache.cassandra.hadoop.ColumnFamilyInputFormatTest
    [junit] Tests run: 1, Failures: 0, Errors: 0, Time elapsed: 0.203 sec
    [junit] 
    [junit] Testsuite: org.apache.cassandra.io.BloomFilterTrackerTest
    [junit] Tests run: 3, Failures: 0, Errors: 0, Time elapsed: 0.37 sec
    [junit] 
    [junit] Testsuite: org.apache.cassandra.io.CompactSerializerTest
    [junit] Tests run: 2, Failures: 0, Errors: 0, Time elapsed: 1.734 sec
    [junit] 
    [junit] Testsuite: org.apache.cassandra.io.LazilyCompactedRowTest
    [junit] Tests run: 7, Failures: 0, Errors: 0, Time elapsed: 26.67 sec
    [junit] 
    [junit] ------------- Standard Error -----------------
    [junit]  WARN 17:28:47,082 setting live ratio to maximum of 64 instead of {}, newRatio
    [junit] ------------- ---------------- ---------------
    [junit] Testsuite: org.apache.cassandra.io.sstable.DescriptorTest
    [junit] Tests run: 1, Failures: 0, Errors: 0, Time elapsed: 0.059 sec
    [junit] 
    [junit] Testsuite: org.apache.cassandra.io.sstable.IndexHelperTest
    [junit] Tests run: 1, Failures: 0, Errors: 0, Time elapsed: 0.066 sec
    [junit] 
    [junit] Testsuite: org.apache.cassandra.io.sstable.LegacySSTableTest
    [junit] Tests run: 1, Failures: 0, Errors: 0, Time elapsed: 1.365 sec
    [junit] 
    [junit] ------------- Standard Error -----------------
    [junit]  WARN 17:29:07,806 Invalid file '.svn' in data directory <https://builds.apache.org/hudson/job/Cassandra/ws/cassandra/test/data/legacy-sstables/e/Keyspace1.>
    [junit]  WARN 17:29:08,392 Invalid file '.svn' in data directory <https://builds.apache.org/hudson/job/Cassandra/ws/cassandra/test/data/legacy-sstables/b/Keyspace1.>
    [junit] ------------- ---------------- ---------------
    [junit] Testsuite: org.apache.cassandra.io.sstable.SSTableReaderTest
    [junit] Tests run: 3, Failures: 0, Errors: 0, Time elapsed: 4.862 sec
    [junit] 
    [junit] ------------- Standard Error -----------------
    [junit] ERROR 17:29:11,021 insufficient space to compact even the two smallest files,
aborting
    [junit] ERROR 17:29:12,723 insufficient space to compact even the two smallest files,
aborting
    [junit]  WARN 17:29:13,185 setting live ratio to maximum of 64 instead of {}, newRatio
    [junit] ------------- ---------------- ---------------
    [junit] Testsuite: org.apache.cassandra.io.sstable.SSTableTest
    [junit] Tests run: 2, Failures: 0, Errors: 0, Time elapsed: 1.44 sec
    [junit] 
    [junit] Testsuite: org.apache.cassandra.io.sstable.SSTableWriterCommutativeTest
    [junit] Tests run: 1, Failures: 0, Errors: 0, Time elapsed: 2.649 sec
    [junit] 
    [junit] Testsuite: org.apache.cassandra.io.sstable.SSTableWriterTest
    [junit] Tests run: 1, Failures: 0, Errors: 0, Time elapsed: 1.24 sec
    [junit] 
    [junit] Testsuite: org.apache.cassandra.io.util.BufferedRandomAccessFileTest
    [junit] Tests run: 20, Failures: 0, Errors: 0, Time elapsed: 2.861 sec
    [junit] 
    [junit] Testsuite: org.apache.cassandra.locator.DynamicEndpointSnitchTest
    [junit] Tests run: 1, Failures: 0, Errors: 0, Time elapsed: 6.144 sec
    [junit] 
    [junit] Testsuite: org.apache.cassandra.locator.NetworkTopologyStrategyTest
    [junit] Tests run: 2, Failures: 0, Errors: 0, Time elapsed: 0.423 sec
    [junit] 
    [junit] Testsuite: org.apache.cassandra.locator.OldNetworkTopologyStrategyTest
    [junit] Tests run: 3, Failures: 0, Errors: 0, Time elapsed: 0.4 sec
    [junit] 
    [junit] Testsuite: org.apache.cassandra.locator.ReplicationStrategyEndpointCacheTest
    [junit] Tests run: 2, Failures: 0, Errors: 0, Time elapsed: 0.565 sec
    [junit] 
    [junit] Testsuite: org.apache.cassandra.locator.SimpleStrategyTest
    [junit] Tests run: 4, Failures: 0, Errors: 0, Time elapsed: 0.659 sec
    [junit] 
    [junit] Testsuite: org.apache.cassandra.locator.TokenMetadataTest
    [junit] Tests run: 3, Failures: 0, Errors: 0, Time elapsed: 0.388 sec
    [junit] 
    [junit] Testsuite: org.apache.cassandra.service.AntiEntropyServiceCounterTest
    [junit] Tests run: 7, Failures: 0, Errors: 0, Time elapsed: 5.123 sec
    [junit] 
    [junit] ------------- Standard Error -----------------
    [junit]  WARN 17:29:41,262 Generated random token Token(bytes[52b4eeab614d4298b18b1a49b595cc49]).
Random tokens will result in an unbalanced ring; see http://wiki.apache.org/cassandra/Operations
    [junit] Exception in thread "AntiEntropyStage:1" java.lang.AssertionError
    [junit] 	at org.apache.cassandra.locator.TokenMetadata.firstTokenIndex(TokenMetadata.java:508)
    [junit] 	at org.apache.cassandra.locator.TokenMetadata.firstToken(TokenMetadata.java:522)
    [junit] 	at org.apache.cassandra.locator.AbstractReplicationStrategy.getNaturalEndpoints(AbstractReplicationStrategy.java:99)
    [junit] 	at org.apache.cassandra.service.StorageService.constructRangeToEndpointMap(StorageService.java:611)
    [junit] 	at org.apache.cassandra.service.StorageService.getRangeToAddressMap(StorageService.java:586)
    [junit] 	at org.apache.cassandra.service.AntiEntropyService.getNeighbors(AntiEntropyService.java:166)
    [junit] 	at org.apache.cassandra.service.AntiEntropyService.rendezvous(AntiEntropyService.java:198)
    [junit] 	at org.apache.cassandra.service.AntiEntropyService.access$100(AntiEntropyService.java:90)
    [junit] 	at org.apache.cassandra.service.AntiEntropyService$TreeResponseVerbHandler.doVerb(AntiEntropyService.java:657)
    [junit] 	at org.apache.cassandra.net.MessageDeliveryTask.run(MessageDeliveryTask.java:72)
    [junit] 	at java.util.concurrent.ThreadPoolExecutor$Worker.runTask(ThreadPoolExecutor.java:886)
    [junit] 	at java.util.concurrent.ThreadPoolExecutor$Worker.run(ThreadPoolExecutor.java:908)
    [junit] 	at java.lang.Thread.run(Thread.java:619)
    [junit] ------------- ---------------- ---------------
    [junit] Testsuite: org.apache.cassandra.service.AntiEntropyServiceStandardTest
    [junit] Tests run: 7, Failures: 0, Errors: 0, Time elapsed: 5.315 sec
    [junit] 
    [junit] ------------- Standard Error -----------------
    [junit]  WARN 17:29:47,863 Generated random token Token(bytes[62c7dab6aa7464312bdece8858036400]).
Random tokens will result in an unbalanced ring; see http://wiki.apache.org/cassandra/Operations
    [junit] Exception in thread "AntiEntropyStage:1" java.lang.AssertionError
    [junit] 	at org.apache.cassandra.locator.TokenMetadata.firstTokenIndex(TokenMetadata.java:508)
    [junit] 	at org.apache.cassandra.locator.TokenMetadata.firstToken(TokenMetadata.java:522)
    [junit] 	at org.apache.cassandra.locator.AbstractReplicationStrategy.getNaturalEndpoints(AbstractReplicationStrategy.java:99)
    [junit] 	at org.apache.cassandra.service.StorageService.constructRangeToEndpointMap(StorageService.java:611)
    [junit] 	at org.apache.cassandra.service.StorageService.getRangeToAddressMap(StorageService.java:586)
    [junit] 	at org.apache.cassandra.service.AntiEntropyService.getNeighbors(AntiEntropyService.java:166)
    [junit] 	at org.apache.cassandra.service.AntiEntropyService.rendezvous(AntiEntropyService.java:198)
    [junit] 	at org.apache.cassandra.service.AntiEntropyService.access$100(AntiEntropyService.java:90)
    [junit] 	at org.apache.cassandra.service.AntiEntropyService$TreeResponseVerbHandler.doVerb(AntiEntropyService.java:657)
    [junit] 	at org.apache.cassandra.net.MessageDeliveryTask.run(MessageDeliveryTask.java:72)
    [junit] 	at java.util.concurrent.ThreadPoolExecutor$Worker.runTask(ThreadPoolExecutor.java:886)
    [junit] 	at java.util.concurrent.ThreadPoolExecutor$Worker.run(ThreadPoolExecutor.java:908)
    [junit] 	at java.lang.Thread.run(Thread.java:619)
    [junit] ------------- ---------------- ---------------
    [junit] Testsuite: org.apache.cassandra.service.CassandraServerTest
    [junit] Tests run: 1, Failures: 0, Errors: 0, Time elapsed: 0.39 sec
    [junit] 
    [junit] Testsuite: org.apache.cassandra.service.ConsistencyLevelTest
    [junit] Tests run: 1, Failures: 0, Errors: 0, Time elapsed: 1.879 sec
    [junit] 
    [junit] Testsuite: org.apache.cassandra.service.EmbeddedCassandraServiceTest
    [junit] Tests run: 1, Failures: 0, Errors: 0, Time elapsed: 1.667 sec
    [junit] 
    [junit] ------------- Standard Error -----------------
    [junit]  WARN 17:29:57,658 Unable to lock JVM memory (ENOMEM). This can result in part
of the JVM being swapped out, especially with mmapped I/O enabled. Increase RLIMIT_MEMLOCK
or run Cassandra as root.
    [junit]  WARN 17:29:58,569 Generated random token Token(bytes[aea0f8001436dcf7fa798dc885253e5b]).
Random tokens will result in an unbalanced ring; see http://wiki.apache.org/cassandra/Operations
    [junit] ------------- ---------------- ---------------
    [junit] Testsuite: org.apache.cassandra.service.InitClientTest
    [junit] Tests run: 1, Failures: 0, Errors: 0, Time elapsed: 5.391 sec
    [junit] 
    [junit] Testsuite: org.apache.cassandra.service.LeaveAndBootstrapTest
    [junit] Tests run: 6, Failures: 0, Errors: 0, Time elapsed: 3.626 sec
    [junit] 
    [junit] ------------- Standard Error -----------------
    [junit]  WARN 17:30:09,664 Node /127.0.0.3 'leaving' token mismatch. Long network partition?
    [junit] ERROR 17:30:09,743 insufficient space to compact even the two smallest files,
aborting
    [junit] ------------- ---------------- ---------------
    [junit] Testsuite: org.apache.cassandra.service.MoveTest
    [junit] Tests run: 3, Failures: 0, Errors: 0, Time elapsed: 1.959 sec
    [junit] 
    [junit] Testsuite: org.apache.cassandra.service.RemoveTest
    [junit] Tests run: 5, Failures: 0, Errors: 0, Time elapsed: 3.044 sec
    [junit] 
    [junit] ------------- Standard Error -----------------
    [junit] ERROR 17:30:16,887 insufficient space to compact even the two smallest files,
aborting
    [junit] ------------- ---------------- ---------------
    [junit] Testsuite: org.apache.cassandra.service.RowResolverTest
    [junit] Tests run: 5, Failures: 0, Errors: 0, Time elapsed: 0.395 sec
    [junit] 
    [junit] Testsuite: org.apache.cassandra.service.SerializationsTest
    [junit] Tests run: 2, Failures: 0, Errors: 0, Time elapsed: 0.143 sec
    [junit] 
    [junit] Testsuite: org.apache.cassandra.service.StorageProxyTest
    [junit] Tests run: 4, Failures: 0, Errors: 0, Time elapsed: 0.397 sec
    [junit] 
    [junit] Testsuite: org.apache.cassandra.service.StorageServiceClientTest
    [junit] Tests run: 1, Failures: 0, Errors: 0, Time elapsed: 5.437 sec
    [junit] 
    [junit] Testsuite: org.apache.cassandra.service.StorageServiceServerTest
    [junit] Tests run: 3, Failures: 0, Errors: 0, Time elapsed: 1.145 sec
    [junit] 
    [junit] ------------- Standard Error -----------------
    [junit]  WARN 17:30:28,573 Generated random token Token(bytes[6c69c3b563194c5d32e62be48ae86cd9]).
Random tokens will result in an unbalanced ring; see http://wiki.apache.org/cassandra/Operations
    [junit] ------------- ---------------- ---------------
    [junit] Testsuite: org.apache.cassandra.streaming.BootstrapTest
    [junit] Tests run: 1, Failures: 0, Errors: 0, Time elapsed: 0.551 sec
    [junit] 
    [junit] Testsuite: org.apache.cassandra.streaming.SerializationsTest
    [junit] Tests run: 4, Failures: 0, Errors: 0, Time elapsed: 0.408 sec
    [junit] 
    [junit] Testsuite: org.apache.cassandra.streaming.StreamingTransferTest
    [junit] Tests run: 3, Failures: 0, Errors: 0, Time elapsed: 2.543 sec
    [junit] 
    [junit] ------------- Standard Error -----------------
    [junit]  WARN 17:30:33,685 Generated random token Token(bytes[7ea72236112cd051ab6b77a569e47ec4]).
Random tokens will result in an unbalanced ring; see http://wiki.apache.org/cassandra/Operations
    [junit] ------------- ---------------- ---------------
    [junit] Testsuite: org.apache.cassandra.thrift.ThriftValidationTest
    [junit] Tests run: 2, Failures: 0, Errors: 0, Time elapsed: 0.401 sec
    [junit] 
    [junit] Testsuite: org.apache.cassandra.tools.SSTableExportTest
    [junit] Tests run: 5, Failures: 0, Errors: 0, Time elapsed: 1.905 sec
    [junit] 
    [junit] ------------- Standard Output ---------------
    [junit] Importing 1 keys...
    [junit] 1 keys imported successfully.
    [junit] ------------- ---------------- ---------------
    [junit] Testsuite: org.apache.cassandra.tools.SSTableImportTest
    [junit] Tests run: 5, Failures: 0, Errors: 0, Time elapsed: 1.245 sec
    [junit] 
    [junit] ------------- Standard Output ---------------
    [junit] Importing 2 keys...
    [junit] 2 keys imported successfully.
    [junit] Importing 2 keys...
    [junit] 2 keys imported successfully.
    [junit] Importing 2 keys...
    [junit] 2 keys imported successfully.
    [junit] Importing 3 keys...
    [junit] Importing 3 keys...
    [junit] 1 keys imported successfully.
    [junit] ------------- ---------------- ---------------
    [junit] ------------- Standard Error -----------------
    [junit] Line 2: Key 303630 is greater than previous, collection is not sorted properly.
Aborting import. You might need to delete SSTables manually.
    [junit] ------------- ---------------- ---------------
    [junit] Testsuite: org.apache.cassandra.utils.BloomFilterTest
    [junit] Tests run: 7, Failures: 0, Errors: 0, Time elapsed: 0.714 sec
    [junit] 
    [junit] Testsuite: org.apache.cassandra.utils.BoundedStatsDequeTest
    [junit] Tests run: 1, Failures: 0, Errors: 0, Time elapsed: 0.058 sec
    [junit] 
    [junit] Testsuite: org.apache.cassandra.utils.ByteBufferUtilTest
    [junit] Tests run: 10, Failures: 0, Errors: 0, Time elapsed: 0.15 sec
    [junit] 
    [junit] Testsuite: org.apache.cassandra.utils.EstimatedHistogramTest
    [junit] Tests run: 4, Failures: 0, Errors: 0, Time elapsed: 0.06 sec
    [junit] 
    [junit] Testsuite: org.apache.cassandra.utils.FBUtilitiesTest
    [junit] Tests run: 5, Failures: 0, Errors: 0, Time elapsed: 0.151 sec
    [junit] 
    [junit] Testsuite: org.apache.cassandra.utils.LegacyBloomFilterTest
    [junit] Tests run: 6, Failures: 0, Errors: 0, Time elapsed: 0.634 sec
    [junit] 
    [junit] Testsuite: org.apache.cassandra.utils.MerkleTreeTest
    [junit] Tests run: 12, Failures: 1, Errors: 0, Time elapsed: 0.391 sec
    [junit] 
    [junit] Testcase: testDifference(org.apache.cassandra.utils.MerkleTreeTest):	FAILED
    [junit] 
    [junit] junit.framework.AssertionFailedError: 
    [junit] 	at org.apache.cassandra.utils.MerkleTreeTest.testDifference(MerkleTreeTest.java:459)
    [junit] 
    [junit] 
    [junit] Test org.apache.cassandra.utils.MerkleTreeTest FAILED
    [junit] Testsuite: org.apache.cassandra.utils.SerializationsTest
    [junit] Tests run: 3, Failures: 0, Errors: 0, Time elapsed: 0.611 sec
    [junit] 

BUILD FAILED
<https://builds.apache.org/hudson/job/Cassandra/ws/cassandra/build.xml>:1048: The following
error occurred while executing this line:
<https://builds.apache.org/hudson/job/Cassandra/ws/cassandra/build.xml>:1034: Some unit
test(s) failed.

Total time: 17 minutes 19 seconds
[TASKS] Skipping publisher since build result is FAILURE
Publishing Javadoc
Archiving artifacts
Recording test results


Mime
View raw message