incubator-cassandra-dev mailing list archives

Site index · List index
Message view « Date » · « Thread »
Top « Date » · « Thread »
From Apache Hudson Server <hud...@hudson.apache.org>
Subject Build failed in Jenkins: Cassandra-Coverage #19
Date Sat, 02 Apr 2011 00:31:02 GMT
See <https://hudson.apache.org/hudson/job/Cassandra-Coverage/19/changes>

Changes:

[jbellis] isFrozen needs to be volatile

[jbellis] revert #1954 for now

[jbellis] r/m unused code

[jbellis] really revert SSTableExport move

[jbellis] move stress package from o.a.c.contrib to o.a.c

[jbellis] move example code from contrib/ to examples/, and tools from contrib/ to tools/

[jbellis] Revert incomplete move of sstable [ex/im]port code

[jbellis] upgrade to whirr 0.4
patch by Pavel Yaskevich for CASSANDRA-2265

[jbellis] modernize column name quoting

------------------------------------------
[...truncated 1904 lines...]
    [junit] Testcase: testStartRemoving(org.apache.cassandra.service.RemoveTest):	Caused an
ERROR
    [junit] null
    [junit] java.lang.NullPointerException
    [junit] 	at org.apache.cassandra.net.MessagingService.shutdown(MessagingService.java:407)
    [junit] 	at org.apache.cassandra.service.RemoveTest.tearDown(RemoveTest.java:90)
    [junit] 
    [junit] 
    [junit] Testcase: testFinishRemoving(org.apache.cassandra.service.RemoveTest):	Caused
an ERROR
    [junit] /127.0.0.1:7010 is in use by another process.  Change listen_address:storage_port
in cassandra.yaml to values that do not conflict with other services
    [junit] org.apache.cassandra.config.ConfigurationException: /127.0.0.1:7010 is in use
by another process.  Change listen_address:storage_port in cassandra.yaml to values that do
not conflict with other services
    [junit] 	at org.apache.cassandra.net.MessagingService.getServerSocket(MessagingService.java:195)
    [junit] 	at org.apache.cassandra.net.MessagingService.listen(MessagingService.java:168)
    [junit] 	at org.apache.cassandra.service.RemoveTest.setup(RemoveTest.java:74)
    [junit] 
    [junit] 
    [junit] Testcase: testFinishRemoving(org.apache.cassandra.service.RemoveTest):	Caused
an ERROR
    [junit] null
    [junit] java.lang.NullPointerException
    [junit] 	at org.apache.cassandra.net.MessagingService.shutdown(MessagingService.java:407)
    [junit] 	at org.apache.cassandra.service.RemoveTest.tearDown(RemoveTest.java:90)
    [junit] 
    [junit] 
    [junit] Flushing results...
    [junit] Flushing results done
    [junit] Cobertura: Loaded information on 812 classes.
    [junit] Cobertura: Saved information on 812 classes.
    [junit] Test org.apache.cassandra.service.RemoveTest FAILED
    [junit] Testsuite: org.apache.cassandra.service.RowResolverTest
    [junit] Tests run: 5, Failures: 0, Errors: 0, Time elapsed: 0.453 sec
    [junit] 
    [junit] Flushing results...
    [junit] Flushing results done
    [junit] Cobertura: Loaded information on 812 classes.
    [junit] Cobertura: Saved information on 812 classes.
    [junit] Testsuite: org.apache.cassandra.service.SerializationsTest
    [junit] Tests run: 2, Failures: 0, Errors: 0, Time elapsed: 0.45 sec
    [junit] 
    [junit] Flushing results...
    [junit] Flushing results done
    [junit] Cobertura: Loaded information on 812 classes.
    [junit] Cobertura: Saved information on 812 classes.
    [junit] Testsuite: org.apache.cassandra.service.StorageProxyTest
    [junit] Tests run: 4, Failures: 0, Errors: 0, Time elapsed: 0.496 sec
    [junit] 
    [junit] Flushing results...
    [junit] Flushing results done
    [junit] Cobertura: Loaded information on 812 classes.
    [junit] Cobertura: Saved information on 812 classes.
    [junit] Testsuite: org.apache.cassandra.service.StorageServiceClientTest
    [junit] Tests run: 1, Failures: 0, Errors: 0, Time elapsed: 5.477 sec
    [junit] 
    [junit] Flushing results...
    [junit] Flushing results done
    [junit] Cobertura: Loaded information on 812 classes.
    [junit] Cobertura: Saved information on 812 classes.
    [junit] Testsuite: org.apache.cassandra.service.StorageServiceServerTest
    [junit] Tests run: 3, Failures: 0, Errors: 0, Time elapsed: 0.821 sec
    [junit] 
    [junit] ------------- Standard Error -----------------
    [junit]  WARN 17:29:11,337 Generated random token Token(bytes[fb88b7e7024fb63fbb43492cb3935727]).
Random tokens will result in an unbalanced ring; see http://wiki.apache.org/cassandra/Operations
    [junit] ------------- ---------------- ---------------
    [junit] Flushing results...
    [junit] Flushing results done
    [junit] Cobertura: Loaded information on 812 classes.
    [junit] Cobertura: Saved information on 812 classes.
    [junit] Testsuite: org.apache.cassandra.streaming.BootstrapTest
    [junit] Tests run: 1, Failures: 0, Errors: 0, Time elapsed: 0.672 sec
    [junit] 
    [junit] Flushing results...
    [junit] Flushing results done
    [junit] Cobertura: Loaded information on 812 classes.
    [junit] Cobertura: Saved information on 812 classes.
    [junit] Testsuite: org.apache.cassandra.streaming.SerializationsTest
    [junit] Tests run: 4, Failures: 0, Errors: 0, Time elapsed: 0.521 sec
    [junit] 
    [junit] Flushing results...
    [junit] Flushing results done
    [junit] Cobertura: Loaded information on 812 classes.
    [junit] Cobertura: Saved information on 812 classes.
    [junit] Testsuite: org.apache.cassandra.streaming.StreamingTransferTest
    [junit] Tests run: 3, Failures: 0, Errors: 0, Time elapsed: 1.097 sec
    [junit] 
    [junit] ------------- Standard Error -----------------
    [junit]  WARN 17:29:19,039 Generated random token Token(bytes[db2e0a661c8453319672287cad7777d0]).
Random tokens will result in an unbalanced ring; see http://wiki.apache.org/cassandra/Operations
    [junit] ------------- ---------------- ---------------
    [junit] Flushing results...
    [junit] Flushing results done
    [junit] Cobertura: Loaded information on 812 classes.
    [junit] Cobertura: Saved information on 812 classes.
    [junit] Testsuite: org.apache.cassandra.thrift.ThriftValidationTest
    [junit] Tests run: 2, Failures: 0, Errors: 0, Time elapsed: 0.457 sec
    [junit] 
    [junit] Flushing results...
    [junit] Flushing results done
    [junit] Cobertura: Loaded information on 812 classes.
    [junit] Cobertura: Saved information on 812 classes.
    [junit] Testsuite: org.apache.cassandra.tools.SSTableExportTest
    [junit] Tests run: 5, Failures: 0, Errors: 0, Time elapsed: 1.055 sec
    [junit] 
    [junit] ------------- Standard Output ---------------
    [junit] Importing 1 keys...
    [junit] 1 keys imported successfully.
    [junit] ------------- ---------------- ---------------
    [junit] Flushing results...
    [junit] Flushing results done
    [junit] Cobertura: Loaded information on 812 classes.
    [junit] Cobertura: Saved information on 812 classes.
    [junit] Testsuite: org.apache.cassandra.tools.SSTableImportTest
    [junit] Tests run: 5, Failures: 0, Errors: 0, Time elapsed: 0.915 sec
    [junit] 
    [junit] ------------- Standard Output ---------------
    [junit] Importing 2 keys...
    [junit] 2 keys imported successfully.
    [junit] Importing 2 keys...
    [junit] 2 keys imported successfully.
    [junit] Importing 2 keys...
    [junit] 2 keys imported successfully.
    [junit] Importing 3 keys...
    [junit] Importing 3 keys...
    [junit] 1 keys imported successfully.
    [junit] ------------- ---------------- ---------------
    [junit] ------------- Standard Error -----------------
    [junit] Line 2: Key 303630 is greater than previous, collection is not sorted properly.
Aborting import. You might need to delete SSTables manually.
    [junit] ------------- ---------------- ---------------
    [junit] Flushing results...
    [junit] Flushing results done
    [junit] Cobertura: Loaded information on 812 classes.
    [junit] Cobertura: Saved information on 812 classes.
    [junit] Testsuite: org.apache.cassandra.utils.BloomFilterTest
    [junit] Tests run: 7, Failures: 0, Errors: 0, Time elapsed: 2.485 sec
    [junit] 
    [junit] Flushing results...
    [junit] Flushing results done
    [junit] Cobertura: Loaded information on 812 classes.
    [junit] Cobertura: Saved information on 812 classes.
    [junit] Testsuite: org.apache.cassandra.utils.BoundedStatsDequeTest
    [junit] Tests run: 1, Failures: 0, Errors: 0, Time elapsed: 0.064 sec
    [junit] 
    [junit] Flushing results...
    [junit] Flushing results done
    [junit] Cobertura: Loaded information on 812 classes.
    [junit] Cobertura: Saved information on 812 classes.
    [junit] Testsuite: org.apache.cassandra.utils.ByteBufferUtilTest
    [junit] Tests run: 10, Failures: 0, Errors: 0, Time elapsed: 0.178 sec
    [junit] 
    [junit] Flushing results...
    [junit] Flushing results done
    [junit] Cobertura: Loaded information on 812 classes.
    [junit] Cobertura: Saved information on 812 classes.
    [junit] Testsuite: org.apache.cassandra.utils.EstimatedHistogramTest
    [junit] Tests run: 4, Failures: 0, Errors: 0, Time elapsed: 0.078 sec
    [junit] 
    [junit] Flushing results...
    [junit] Flushing results done
    [junit] Cobertura: Loaded information on 812 classes.
    [junit] Cobertura: Saved information on 812 classes.
    [junit] Testsuite: org.apache.cassandra.utils.FBUtilitiesTest
    [junit] Tests run: 5, Failures: 0, Errors: 0, Time elapsed: 0.168 sec
    [junit] 
    [junit] Flushing results...
    [junit] Flushing results done
    [junit] Cobertura: Loaded information on 812 classes.
    [junit] Cobertura: Saved information on 812 classes.
    [junit] Testsuite: org.apache.cassandra.utils.LegacyBloomFilterTest
    [junit] Tests run: 6, Failures: 0, Errors: 0, Time elapsed: 3.094 sec
    [junit] 
    [junit] Flushing results...
    [junit] Flushing results done
    [junit] Cobertura: Loaded information on 812 classes.
    [junit] Cobertura: Saved information on 812 classes.
    [junit] Testsuite: org.apache.cassandra.utils.MerkleTreeTest
    [junit] Tests run: 14, Failures: 0, Errors: 0, Time elapsed: 0.504 sec
    [junit] 
    [junit] Flushing results...
    [junit] Flushing results done
    [junit] Cobertura: Loaded information on 812 classes.
    [junit] Cobertura: Saved information on 812 classes.
    [junit] Testsuite: org.apache.cassandra.utils.SerializationsTest
    [junit] Tests run: 3, Failures: 0, Errors: 0, Time elapsed: 0.805 sec
    [junit] 
    [junit] Flushing results...
    [junit] Flushing results done
    [junit] Cobertura: Loaded information on 812 classes.
    [junit] Cobertura: Saved information on 812 classes.
     [echo] running driverunit tests
    [junit] WARNING: multiple versions of ant detected in path for junit 
    [junit]          jar:file:/home/hudson/tools/ant/latest/lib/ant.jar!/org/apache/tools/ant/Project.class
    [junit]      and jar:<https://hudson.apache.org/hudson/job/Cassandra-Coverage/ws/cassandra/build/lib/jars/ant-1.6.5.jar!/org/apache/tools/ant/Project.class>
    [junit] Testsuite: org.apache.cassandra.cql.JdbcDriverTest
    [junit] Tests run: 9, Failures: 0, Errors: 0, Time elapsed: 1.495 sec
    [junit] 
    [junit] ------------- Standard Error -----------------
    [junit]  WARN 17:29:54,338 Unable to lock JVM memory (ENOMEM). This can result in part
of the JVM being swapped out, especially with mmapped I/O enabled. Increase RLIMIT_MEMLOCK
or run Cassandra as root.
    [junit]  WARN 17:29:54,733 Generated random token Token(bytes[eddac5d1fc055fd4c7392192ab7a6d92]).
Random tokens will result in an unbalanced ring; see http://wiki.apache.org/cassandra/Operations
    [junit] ------------- ---------------- ---------------
    [junit] Flushing results...
    [junit] Flushing results done
    [junit] Cobertura: Loaded information on 812 classes.
    [junit] Cobertura: Saved information on 812 classes.
    [junit] Testsuite: org.apache.cassandra.cql.jdbc.PreparedStatementTest
    [junit] Tests run: 6, Failures: 0, Errors: 0, Time elapsed: 1.516 sec
    [junit] 
    [junit] ------------- Standard Error -----------------
    [junit]  WARN 17:29:58,123 Unable to lock JVM memory (ENOMEM). This can result in part
of the JVM being swapped out, especially with mmapped I/O enabled. Increase RLIMIT_MEMLOCK
or run Cassandra as root.
    [junit]  WARN 17:29:58,493 Generated random token Token(bytes[756929ea4da08d7fa04761833a7c555d]).
Random tokens will result in an unbalanced ring; see http://wiki.apache.org/cassandra/Operations
    [junit] ------------- ---------------- ---------------
    [junit] Flushing results...
    [junit] Flushing results done
    [junit] Cobertura: Loaded information on 812 classes.
    [junit] Cobertura: Saved information on 812 classes.

cobertura-report:
[cobertura-report] Cobertura 1.9.4.1 - GNU GPL License (NO WARRANTY) - See COPYRIGHT file
[cobertura-report] Cobertura: Loaded information on 812 classes.
[cobertura-report] Report time: 4634ms
[cobertura-report] Cobertura 1.9.4.1 - GNU GPL License (NO WARRANTY) - See COPYRIGHT file
[cobertura-report] Cobertura: Loaded information on 812 classes.
[cobertura-report] Report time: 5157ms

codecoverage:

BUILD SUCCESSFUL
Total time: 6 minutes 28 seconds
Recording test results
Publishing Cobertura coverage report...
Publishing Cobertura coverage results...
ERROR: Publisher hudson.plugins.cobertura.CoberturaPublisher aborted due to exception
java.lang.ClassCastException: cannot assign instance of hudson.FilePath to field hudson.plugins.cobertura.renderers.SourceCodePainter.destination
of type hudson.FilePath in instance of hudson.plugins.cobertura.renderers.SourceCodePainter
	at java.io.ObjectStreamClass$FieldReflector.setObjFieldValues(ObjectStreamClass.java:2056)
	at java.io.ObjectStreamClass.setObjFieldValues(ObjectStreamClass.java:1229)
	at java.io.ObjectInputStream.defaultReadFields(ObjectInputStream.java:1969)
	at java.io.ObjectInputStream.readSerialData(ObjectInputStream.java:1887)
	at java.io.ObjectInputStream.readOrdinaryObject(ObjectInputStream.java:1770)
	at java.io.ObjectInputStream.readObject0(ObjectInputStream.java:1346)
	at java.io.ObjectInputStream.defaultReadFields(ObjectInputStream.java:1963)
	at java.io.ObjectInputStream.readSerialData(ObjectInputStream.java:1887)
	at java.io.ObjectInputStream.readOrdinaryObject(ObjectInputStream.java:1770)
	at java.io.ObjectInputStream.readObject0(ObjectInputStream.java:1346)
	at java.io.ObjectInputStream.readObject(ObjectInputStream.java:368)
	at hudson.remoting.UserRequest.deserialize(UserRequest.java:178)
	at hudson.remoting.UserRequest.perform(UserRequest.java:98)
	at hudson.remoting.UserRequest.perform(UserRequest.java:48)
	at hudson.remoting.Request$2.run(Request.java:270)
	at java.util.concurrent.Executors$RunnableAdapter.call(Executors.java:471)
	at java.util.concurrent.FutureTask$Sync.innerRun(FutureTask.java:334)
	at java.util.concurrent.FutureTask.run(FutureTask.java:166)
	at java.util.concurrent.ThreadPoolExecutor.runWorker(ThreadPoolExecutor.java:1110)
	at java.util.concurrent.ThreadPoolExecutor$Worker.run(ThreadPoolExecutor.java:603)
	at java.lang.Thread.run(Thread.java:636)


Mime
View raw message