incubator-cassandra-dev mailing list archives

Site index · List index
Message view « Date » · « Thread »
Top « Date » · « Thread »
From Apache Hudson Server <hud...@hudson.apache.org>
Subject Build failed in Jenkins: Cassandra-0.7-Coverage #17
Date Sat, 02 Apr 2011 00:30:53 GMT
See <https://hudson.apache.org/hudson/job/Cassandra-0.7-Coverage/17/changes>

Changes:

[jbellis] revert whirr change, it's for 0.8 only

[jbellis] upgrade to whirr 0.4
patch by Pavel Yaskevich for CASSANDRA-2265

------------------------------------------
[...truncated 1586 lines...]
    [junit] 	at org.apache.cassandra.utils.WrappedRunnable.run(WrappedRunnable.java:30)
    [junit] 	... 3 more
    [junit] Flushing results done
    [junit] Cobertura: Loaded information on 1002 classes.
    [junit] Cobertura: Saved information on 1002 classes.
    [junit] Testsuite: org.apache.cassandra.service.CassandraServerTest
    [junit] Tests run: 1, Failures: 0, Errors: 0, Time elapsed: 0.485 sec
    [junit] 
    [junit] Flushing results...
    [junit] Flushing results done
    [junit] Cobertura: Loaded information on 1002 classes.
    [junit] Cobertura: Saved information on 1002 classes.
    [junit] Testsuite: org.apache.cassandra.service.ConsistencyLevelTest
    [junit] Tests run: 1, Failures: 0, Errors: 0, Time elapsed: 0.756 sec
    [junit] 
    [junit] Flushing results...
    [junit] Flushing results done
    [junit] Cobertura: Loaded information on 1002 classes.
    [junit] Cobertura: Saved information on 1002 classes.
    [junit] Testsuite: org.apache.cassandra.service.EmbeddedCassandraServiceTest
    [junit] Tests run: 1, Failures: 0, Errors: 0, Time elapsed: 1.051 sec
    [junit] 
    [junit] ------------- Standard Error -----------------
    [junit]  WARN 17:28:20,319 Unable to lock JVM memory (ENOMEM). This can result in part
of the JVM being swapped out, especially with mmapped I/O enabled. Increase RLIMIT_MEMLOCK
or run Cassandra as root.
    [junit]  WARN 17:28:20,703 Generated random token Token(bytes[3d09b201c50855602026584372928a09]).
Random tokens will result in an unbalanced ring; see http://wiki.apache.org/cassandra/Operations
    [junit] ------------- ---------------- ---------------
    [junit] Flushing results...
    [junit] Flushing results done
    [junit] Cobertura: Loaded information on 1002 classes.
    [junit] Cobertura: Saved information on 1002 classes.
    [junit] Testsuite: org.apache.cassandra.service.InitClientTest
    [junit] Tests run: 1, Failures: 0, Errors: 0, Time elapsed: 5.479 sec
    [junit] 
    [junit] ------------- Standard Error -----------------
    [junit] ERROR 17:28:26,173 Received untranslated stream from newer protcol version. Terminating
connection!
    [junit] ------------- ---------------- ---------------
    [junit] Flushing results...
    [junit] Flushing results done
    [junit] Cobertura: Loaded information on 1002 classes.
    [junit] Cobertura: Saved information on 1002 classes.
    [junit] Testsuite: org.apache.cassandra.service.MoveTest
    [junit] Tests run: 6, Failures: 0, Errors: 0, Time elapsed: 1.294 sec
    [junit] 
    [junit] ------------- Standard Error -----------------
    [junit]  WARN 17:28:33,074 Node /127.0.0.3 'leaving' token mismatch. Long network partition?
    [junit] ------------- ---------------- ---------------
    [junit] Flushing results...
    [junit] Flushing results done
    [junit] Cobertura: Loaded information on 1002 classes.
    [junit] Cobertura: Saved information on 1002 classes.
    [junit] Testsuite: org.apache.cassandra.service.RemoveTest
    [junit] Tests run: 5, Failures: 0, Errors: 0, Time elapsed: 1.988 sec
    [junit] 
    [junit] Flushing results...
    [junit] Flushing results done
    [junit] Cobertura: Loaded information on 1002 classes.
    [junit] Cobertura: Saved information on 1002 classes.
    [junit] Testsuite: org.apache.cassandra.service.RowResolverTest
    [junit] Tests run: 5, Failures: 0, Errors: 0, Time elapsed: 0.491 sec
    [junit] 
    [junit] Flushing results...
    [junit] Flushing results done
    [junit] Cobertura: Loaded information on 1002 classes.
    [junit] Cobertura: Saved information on 1002 classes.
    [junit] Testsuite: org.apache.cassandra.service.SerializationsTest
    [junit] Tests run: 2, Failures: 0, Errors: 0, Time elapsed: 0.486 sec
    [junit] 
    [junit] Flushing results...
    [junit] Flushing results done
    [junit] Cobertura: Loaded information on 1002 classes.
    [junit] Cobertura: Saved information on 1002 classes.
    [junit] Testsuite: org.apache.cassandra.service.StorageProxyTest
    [junit] Tests run: 4, Failures: 0, Errors: 0, Time elapsed: 0.529 sec
    [junit] 
    [junit] Flushing results...
    [junit] Flushing results done
    [junit] Cobertura: Loaded information on 1002 classes.
    [junit] Cobertura: Saved information on 1002 classes.
    [junit] Testsuite: org.apache.cassandra.service.StorageServiceClientTest
    [junit] Tests run: 1, Failures: 0, Errors: 0, Time elapsed: 5.494 sec
    [junit] 
    [junit] Flushing results...
    [junit] Flushing results done
    [junit] Cobertura: Loaded information on 1002 classes.
    [junit] Cobertura: Saved information on 1002 classes.
    [junit] Testsuite: org.apache.cassandra.service.StorageServiceServerTest
    [junit] Tests run: 3, Failures: 0, Errors: 0, Time elapsed: 0.848 sec
    [junit] 
    [junit] ------------- Standard Error -----------------
    [junit]  WARN 17:28:57,426 Generated random token Token(bytes[c3084e80b689f63ff7e535dd84433122]).
Random tokens will result in an unbalanced ring; see http://wiki.apache.org/cassandra/Operations
    [junit] ------------- ---------------- ---------------
    [junit] Flushing results...
    [junit] Flushing results done
    [junit] Cobertura: Loaded information on 1002 classes.
    [junit] Cobertura: Saved information on 1002 classes.
    [junit] Testsuite: org.apache.cassandra.streaming.BootstrapTest
    [junit] Tests run: 1, Failures: 0, Errors: 0, Time elapsed: 0.695 sec
    [junit] 
    [junit] Flushing results...
    [junit] Flushing results done
    [junit] Cobertura: Loaded information on 1002 classes.
    [junit] Cobertura: Saved information on 1002 classes.
    [junit] Testsuite: org.apache.cassandra.streaming.SerializationsTest
    [junit] Tests run: 4, Failures: 0, Errors: 0, Time elapsed: 0.546 sec
    [junit] 
    [junit] Flushing results...
    [junit] Flushing results done
    [junit] Cobertura: Loaded information on 1002 classes.
    [junit] Cobertura: Saved information on 1002 classes.
    [junit] Testsuite: org.apache.cassandra.streaming.StreamingTransferTest
    [junit] Tests run: 0, Failures: 0, Errors: 1, Time elapsed: 0.367 sec
    [junit] 
    [junit] Testcase: org.apache.cassandra.streaming.StreamingTransferTest:	Caused an ERROR
    [junit] /127.0.0.1:7010 is in use by another process.  Change listen_address:storage_port
in cassandra.yaml to values that do not conflict with other services
    [junit] org.apache.cassandra.config.ConfigurationException: /127.0.0.1:7010 is in use
by another process.  Change listen_address:storage_port in cassandra.yaml to values that do
not conflict with other services
    [junit] 	at org.apache.cassandra.net.MessagingService.listen(MessagingService.java:174)
    [junit] 	at org.apache.cassandra.service.StorageService.joinTokenRing(StorageService.java:424)
    [junit] 	at org.apache.cassandra.service.StorageService.initServer(StorageService.java:404)
    [junit] 	at org.apache.cassandra.streaming.StreamingTransferTest.setup(StreamingTransferTest.java:58)
    [junit] 
    [junit] 
    [junit] Flushing results...
    [junit] Flushing results done
    [junit] Cobertura: Loaded information on 1002 classes.
    [junit] Cobertura: Saved information on 1002 classes.
    [junit] Test org.apache.cassandra.streaming.StreamingTransferTest FAILED
    [junit] Testsuite: org.apache.cassandra.tools.SSTableExportTest
    [junit] Tests run: 4, Failures: 0, Errors: 0, Time elapsed: 0.939 sec
    [junit] 
    [junit] ------------- Standard Output ---------------
    [junit] Importing 1 keys...
    [junit] 1 keys imported successfully.
    [junit] ------------- ---------------- ---------------
    [junit] Flushing results...
    [junit] Flushing results done
    [junit] Cobertura: Loaded information on 1002 classes.
    [junit] Cobertura: Saved information on 1002 classes.
    [junit] Testsuite: org.apache.cassandra.tools.SSTableImportTest
    [junit] Tests run: 3, Failures: 0, Errors: 0, Time elapsed: 0.86 sec
    [junit] 
    [junit] ------------- Standard Output ---------------
    [junit] Importing 2 keys...
    [junit] 2 keys imported successfully.
    [junit] Importing 2 keys...
    [junit] 2 keys imported successfully.
    [junit] Importing 3 keys...
    [junit] ------------- ---------------- ---------------
    [junit] ------------- Standard Error -----------------
    [junit] Line 2: Key 303630 is greater than previous, collection is not sorted properly.
Aborting import. You might need to delete SSTables manually.
    [junit] ------------- ---------------- ---------------
    [junit] Flushing results...
    [junit] Flushing results done
    [junit] Cobertura: Loaded information on 1002 classes.
    [junit] Cobertura: Saved information on 1002 classes.
    [junit] Testsuite: org.apache.cassandra.utils.BloomFilterTest
    [junit] Tests run: 7, Failures: 0, Errors: 0, Time elapsed: 2.486 sec
    [junit] 
    [junit] Flushing results...
    [junit] Flushing results done
    [junit] Cobertura: Loaded information on 1002 classes.
    [junit] Cobertura: Saved information on 1002 classes.
    [junit] Testsuite: org.apache.cassandra.utils.BoundedStatsDequeTest
    [junit] Tests run: 1, Failures: 0, Errors: 0, Time elapsed: 0.062 sec
    [junit] 
    [junit] Flushing results...
    [junit] Flushing results done
    [junit] Cobertura: Loaded information on 1002 classes.
    [junit] Cobertura: Saved information on 1002 classes.
    [junit] Testsuite: org.apache.cassandra.utils.ByteBufferUtilTest
    [junit] Tests run: 10, Failures: 0, Errors: 0, Time elapsed: 0.173 sec
    [junit] 
    [junit] Flushing results...
    [junit] Flushing results done
    [junit] Cobertura: Loaded information on 1002 classes.
    [junit] Cobertura: Saved information on 1002 classes.
    [junit] Testsuite: org.apache.cassandra.utils.EstimatedHistogramTest
    [junit] Tests run: 4, Failures: 0, Errors: 0, Time elapsed: 0.075 sec
    [junit] 
    [junit] Flushing results...
    [junit] Flushing results done
    [junit] Cobertura: Loaded information on 1002 classes.
    [junit] Cobertura: Saved information on 1002 classes.
    [junit] Testsuite: org.apache.cassandra.utils.FBUtilitiesTest
    [junit] Tests run: 2, Failures: 0, Errors: 0, Time elapsed: 0.149 sec
    [junit] 
    [junit] Flushing results...
    [junit] Flushing results done
    [junit] Cobertura: Loaded information on 1002 classes.
    [junit] Cobertura: Saved information on 1002 classes.
    [junit] Testsuite: org.apache.cassandra.utils.LegacyBloomFilterTest
    [junit] Tests run: 7, Failures: 0, Errors: 0, Time elapsed: 3.079 sec
    [junit] 
    [junit] Flushing results...
    [junit] Flushing results done
    [junit] Cobertura: Loaded information on 1002 classes.
    [junit] Cobertura: Saved information on 1002 classes.
    [junit] Testsuite: org.apache.cassandra.utils.MerkleTreeTest
    [junit] Tests run: 14, Failures: 0, Errors: 0, Time elapsed: 0.517 sec
    [junit] 
    [junit] Flushing results...
    [junit] Flushing results done
    [junit] Cobertura: Loaded information on 1002 classes.
    [junit] Cobertura: Saved information on 1002 classes.
    [junit] Testsuite: org.apache.cassandra.utils.SerializationsTest
    [junit] Tests run: 3, Failures: 0, Errors: 0, Time elapsed: 0.86 sec
    [junit] 
    [junit] Flushing results...
    [junit] Flushing results done
    [junit] Cobertura: Loaded information on 1002 classes.
    [junit] Cobertura: Saved information on 1002 classes.

cobertura-report:
[cobertura-report] Cobertura 1.9.4.1 - GNU GPL License (NO WARRANTY) - See COPYRIGHT file
[cobertura-report] Cobertura: Loaded information on 1002 classes.
[cobertura-report] Report time: 4635ms
[cobertura-report] Cobertura 1.9.4.1 - GNU GPL License (NO WARRANTY) - See COPYRIGHT file
[cobertura-report] Cobertura: Loaded information on 1002 classes.
[cobertura-report] Report time: 5835ms

codecoverage:

BUILD SUCCESSFUL
Total time: 6 minutes 30 seconds
Recording test results
Publishing Cobertura coverage report...
Publishing Cobertura coverage results...
ERROR: Publisher hudson.plugins.cobertura.CoberturaPublisher aborted due to exception
java.lang.ClassCastException: cannot assign instance of hudson.FilePath to field hudson.plugins.cobertura.renderers.SourceCodePainter.destination
of type hudson.FilePath in instance of hudson.plugins.cobertura.renderers.SourceCodePainter
	at java.io.ObjectStreamClass$FieldReflector.setObjFieldValues(ObjectStreamClass.java:2056)
	at java.io.ObjectStreamClass.setObjFieldValues(ObjectStreamClass.java:1229)
	at java.io.ObjectInputStream.defaultReadFields(ObjectInputStream.java:1969)
	at java.io.ObjectInputStream.readSerialData(ObjectInputStream.java:1887)
	at java.io.ObjectInputStream.readOrdinaryObject(ObjectInputStream.java:1770)
	at java.io.ObjectInputStream.readObject0(ObjectInputStream.java:1346)
	at java.io.ObjectInputStream.defaultReadFields(ObjectInputStream.java:1963)
	at java.io.ObjectInputStream.readSerialData(ObjectInputStream.java:1887)
	at java.io.ObjectInputStream.readOrdinaryObject(ObjectInputStream.java:1770)
	at java.io.ObjectInputStream.readObject0(ObjectInputStream.java:1346)
	at java.io.ObjectInputStream.readObject(ObjectInputStream.java:368)
	at hudson.remoting.UserRequest.deserialize(UserRequest.java:178)
	at hudson.remoting.UserRequest.perform(UserRequest.java:98)
	at hudson.remoting.UserRequest.perform(UserRequest.java:48)
	at hudson.remoting.Request$2.run(Request.java:270)
	at java.util.concurrent.Executors$RunnableAdapter.call(Executors.java:471)
	at java.util.concurrent.FutureTask$Sync.innerRun(FutureTask.java:334)
	at java.util.concurrent.FutureTask.run(FutureTask.java:166)
	at java.util.concurrent.ThreadPoolExecutor.runWorker(ThreadPoolExecutor.java:1110)
	at java.util.concurrent.ThreadPoolExecutor$Worker.run(ThreadPoolExecutor.java:603)
	at java.lang.Thread.run(Thread.java:636)


Mime
View raw message