incubator-cassandra-dev mailing list archives

Site index · List index
Message view « Date » · « Thread »
Top « Date » · « Thread »
From Apache Hudson Server <hud...@hudson.apache.org>
Subject Build failed in Hudson: Cassandra-0.7 #49
Date Fri, 03 Dec 2010 18:40:21 GMT
See <https://hudson.apache.org/hudson/job/Cassandra-0.7/49/changes>

Changes:

[jbellis] improved validation of column_metadata
patch by jbellis; reviewed by gdusbabek for CASSANDRA-1813

------------------------------------------
[...truncated 1566 lines...]
    [junit] Testsuite: org.apache.cassandra.dht.OrderPreservingPartitionerTest
    [junit] Tests run: 6, Failures: 0, Errors: 0, Time elapsed: 8.487 sec
    [junit] 
    [junit] Cobertura: Loaded information on 961 classes.
    [junit] Cobertura: Saved information on 961 classes.
    [junit] Testsuite: org.apache.cassandra.dht.RandomPartitionerTest
    [junit] Tests run: 5, Failures: 0, Errors: 0, Time elapsed: 4.098 sec
    [junit] 
    [junit] Cobertura: Loaded information on 961 classes.
    [junit] Cobertura: Saved information on 961 classes.
    [junit] Testsuite: org.apache.cassandra.dht.RangeTest
    [junit] Tests run: 12, Failures: 0, Errors: 0, Time elapsed: 0.502 sec
    [junit] 
    [junit] Cobertura: Loaded information on 961 classes.
    [junit] Cobertura: Saved information on 961 classes.
    [junit] Testsuite: org.apache.cassandra.gms.ArrivalWindowTest
    [junit] Tests run: 1, Failures: 0, Errors: 0, Time elapsed: 0.137 sec
    [junit] 
    [junit] Cobertura: Loaded information on 961 classes.
    [junit] Cobertura: Saved information on 961 classes.
    [junit] Testsuite: org.apache.cassandra.gms.GossipDigestTest
    [junit] Tests run: 1, Failures: 0, Errors: 0, Time elapsed: 0.067 sec
    [junit] 
    [junit] Cobertura: Loaded information on 961 classes.
    [junit] Cobertura: Saved information on 961 classes.
    [junit] Testsuite: org.apache.cassandra.hadoop.ColumnFamilyInputFormatTest
    [junit] Tests run: 1, Failures: 0, Errors: 0, Time elapsed: 0.215 sec
    [junit] 
    [junit] Cobertura: Loaded information on 961 classes.
    [junit] Cobertura: Saved information on 961 classes.
    [junit] Testsuite: org.apache.cassandra.io.BloomFilterTrackerTest
    [junit] Tests run: 3, Failures: 0, Errors: 0, Time elapsed: 0.442 sec
    [junit] 
    [junit] Cobertura: Loaded information on 961 classes.
    [junit] Cobertura: Saved information on 961 classes.
    [junit] Testsuite: org.apache.cassandra.io.LazilyCompactedRowTest
    [junit] Tests run: 5, Failures: 0, Errors: 0, Time elapsed: 27.382 sec
    [junit] 
    [junit] Cobertura: Loaded information on 961 classes.
    [junit] Cobertura: Saved information on 961 classes.
    [junit] Testsuite: org.apache.cassandra.io.sstable.LegacySSTableTest
    [junit] Tests run: 1, Failures: 0, Errors: 0, Time elapsed: 3.736 sec
    [junit] 
    [junit] ------------- Standard Error -----------------
    [junit]  WARN 18:36:14,512 Invalid file '.svn' in data directory <https://hudson.apache.org/hudson/job/Cassandra-0.7/ws/cassandra/test/data/legacy-sstables/b/Keyspace1.>
    [junit] ------------- ---------------- ---------------
    [junit] Cobertura: Loaded information on 961 classes.
    [junit] Cobertura: Saved information on 961 classes.
    [junit] Testsuite: org.apache.cassandra.io.sstable.SSTableReaderTest
    [junit] Tests run: 3, Failures: 0, Errors: 0, Time elapsed: 5.079 sec
    [junit] 
    [junit] Cobertura: Loaded information on 961 classes.
    [junit] Cobertura: Saved information on 961 classes.
    [junit] Testsuite: org.apache.cassandra.io.sstable.SSTableTest
    [junit] Tests run: 2, Failures: 0, Errors: 0, Time elapsed: 7.023 sec
    [junit] 
    [junit] Cobertura: Loaded information on 961 classes.
    [junit] Cobertura: Saved information on 961 classes.
    [junit] Testsuite: org.apache.cassandra.io.sstable.SSTableWriterTest
    [junit] Tests run: 1, Failures: 0, Errors: 0, Time elapsed: 1.262 sec
    [junit] 
    [junit] Cobertura: Loaded information on 961 classes.
    [junit] Cobertura: Saved information on 961 classes.
    [junit] Testsuite: org.apache.cassandra.io.util.BufferedRandomAccessFileTest
    [junit] Tests run: 4, Failures: 0, Errors: 0, Time elapsed: 0.624 sec
    [junit] 
    [junit] Cobertura: Loaded information on 961 classes.
    [junit] Cobertura: Saved information on 961 classes.
    [junit] Testsuite: org.apache.cassandra.locator.DynamicEndpointSnitchTest
    [junit] Tests run: 1, Failures: 0, Errors: 0, Time elapsed: 6.247 sec
    [junit] 
    [junit] Cobertura: Loaded information on 961 classes.
    [junit] Cobertura: Saved information on 961 classes.
    [junit] Testsuite: org.apache.cassandra.locator.NetworkTopologyStrategyTest
    [junit] Tests run: 1, Failures: 0, Errors: 0, Time elapsed: 0.495 sec
    [junit] 
    [junit] Cobertura: Loaded information on 961 classes.
    [junit] Cobertura: Saved information on 961 classes.
    [junit] Testsuite: org.apache.cassandra.locator.OldNetworkTopologyStrategyTest
    [junit] Tests run: 3, Failures: 0, Errors: 0, Time elapsed: 0.51 sec
    [junit] 
    [junit] Cobertura: Loaded information on 961 classes.
    [junit] Cobertura: Saved information on 961 classes.
    [junit] Testsuite: org.apache.cassandra.locator.ReplicationStrategyEndpointCacheTest
    [junit] Tests run: 2, Failures: 0, Errors: 0, Time elapsed: 0.73 sec
    [junit] 
    [junit] Cobertura: Loaded information on 961 classes.
    [junit] Cobertura: Saved information on 961 classes.
    [junit] Testsuite: org.apache.cassandra.locator.SimpleStrategyTest
    [junit] Tests run: 4, Failures: 0, Errors: 0, Time elapsed: 0.747 sec
    [junit] 
    [junit] Cobertura: Loaded information on 961 classes.
    [junit] Cobertura: Saved information on 961 classes.
    [junit] Testsuite: org.apache.cassandra.locator.TokenMetadataTest
    [junit] Tests run: 2, Failures: 0, Errors: 0, Time elapsed: 0.496 sec
    [junit] 
    [junit] Cobertura: Loaded information on 961 classes.
    [junit] Cobertura: Saved information on 961 classes.
    [junit] Testsuite: org.apache.cassandra.service.AntiEntropyServiceTest
    [junit] Exception in thread "Thread-5" java.lang.RuntimeException: java.lang.NullPointerException
    [junit] 	at org.apache.cassandra.utils.WrappedRunnable.run(WrappedRunnable.java:34)
    [junit] 	at org.apache.cassandra.streaming.StreamInSession.closeIfFinished(StreamInSession.java:164)
    [junit] 	at org.apache.cassandra.streaming.IncomingStreamReader.read(IncomingStreamReader.java:66)
    [junit] 	at org.apache.cassandra.net.IncomingTcpConnection.run(IncomingTcpConnection.java:75)
    [junit] Caused by: java.lang.NullPointerException
    [junit] 	at org.apache.cassandra.service.AntiEntropyService.completedRequest(AntiEntropyService.java:133)
    [junit] 	at org.apache.cassandra.service.AntiEntropyService$Differencer$Callback.runMayThrow(AntiEntropyService.java:537)
    [junit] 	at org.apache.cassandra.utils.WrappedRunnable.run(WrappedRunnable.java:30)
    [junit] 	... 3 more
    [junit] Tests run: 7, Failures: 0, Errors: 0, Time elapsed: 4.886 sec
    [junit] 
    [junit] ------------- Standard Error -----------------
    [junit]  WARN 18:37:18,430 Generated random token Token(bytes[1bc3f42e0a8459e01f94dcdf7887efc6]).
Random tokens will result in an unbalanced ring; see http://wiki.apache.org/cassandra/Operations
    [junit] Exception in thread "AntiEntropyStage:1" java.lang.AssertionError
    [junit] 	at org.apache.cassandra.locator.TokenMetadata.firstTokenIndex(TokenMetadata.java:392)
    [junit] 	at org.apache.cassandra.locator.TokenMetadata.firstToken(TokenMetadata.java:406)
    [junit] 	at org.apache.cassandra.locator.AbstractReplicationStrategy.getNaturalEndpoints(AbstractReplicationStrategy.java:98)
    [junit] 	at org.apache.cassandra.service.StorageService.constructRangeToEndpointMap(StorageService.java:561)
    [junit] 	at org.apache.cassandra.service.StorageService.getRangeToAddressMap(StorageService.java:536)
    [junit] 	at org.apache.cassandra.service.AntiEntropyService.getNeighbors(AntiEntropyService.java:158)
    [junit] 	at org.apache.cassandra.service.AntiEntropyService.rendezvous(AntiEntropyService.java:182)
    [junit] 	at org.apache.cassandra.service.AntiEntropyService.access$100(AntiEntropyService.java:86)
    [junit] 	at org.apache.cassandra.service.AntiEntropyService$TreeResponseVerbHandler.doVerb(AntiEntropyService.java:659)
    [junit] 	at org.apache.cassandra.net.MessageDeliveryTask.run(MessageDeliveryTask.java:63)
    [junit] 	at java.util.concurrent.ThreadPoolExecutor$Worker.runTask(ThreadPoolExecutor.java:886)
    [junit] 	at java.util.concurrent.ThreadPoolExecutor$Worker.run(ThreadPoolExecutor.java:908)
    [junit] 	at java.lang.Thread.run(Thread.java:619)
    [junit] ------------- ---------------- ---------------
    [junit] Cobertura: Loaded information on 961 classes.
    [junit] Cobertura: Saved information on 961 classes.
    [junit] Testsuite: org.apache.cassandra.service.CassandraServerTest
    [junit] Tests run: 1, Failures: 0, Errors: 0, Time elapsed: 0.432 sec
    [junit] 
    [junit] Cobertura: Loaded information on 961 classes.
    [junit] Cobertura: Saved information on 961 classes.
    [junit] Testsuite: org.apache.cassandra.service.EmbeddedCassandraServiceTest
    [junit] Tests run: 1, Failures: 0, Errors: 0, Time elapsed: 1.944 sec
    [junit] 
    [junit] ------------- Standard Error -----------------
    [junit]  WARN 18:37:30,178 Unable to lock JVM memory (ENOMEM). This can result in part
of the JVM being swapped out, especially with mmapped I/O enabled. Increase RLIMIT_MEMLOCK
or run Cassandra as root.
    [junit]  WARN 18:37:31,211 Generated random token Token(bytes[c1c82138febb2677ee0f6b07115a9505]).
Random tokens will result in an unbalanced ring; see http://wiki.apache.org/cassandra/Operations
    [junit] ------------- ---------------- ---------------
    [junit] Cobertura: Loaded information on 961 classes.
    [junit] Cobertura: Saved information on 961 classes.
    [junit] Testsuite: org.apache.cassandra.service.InitClientTest
    [junit] Tests run: 1, Failures: 0, Errors: 0, Time elapsed: 5.489 sec
    [junit] 
    [junit] Cobertura: Loaded information on 961 classes.
    [junit] Cobertura: Saved information on 961 classes.
    [junit] Testsuite: org.apache.cassandra.service.MoveTest
    [junit] Tests run: 6, Failures: 0, Errors: 0, Time elapsed: 4.083 sec
    [junit] 
    [junit] ------------- Standard Error -----------------
    [junit]  WARN 18:37:47,726 Node /127.0.0.3 'leaving' token mismatch. Long network partition?
    [junit] ------------- ---------------- ---------------
    [junit] Cobertura: Loaded information on 961 classes.
    [junit] Cobertura: Saved information on 961 classes.
    [junit] Testsuite: org.apache.cassandra.service.ReadResponseResolverTest
    [junit] Tests run: 5, Failures: 0, Errors: 0, Time elapsed: 0.515 sec
    [junit] 
    [junit] Cobertura: Loaded information on 961 classes.
    [junit] Cobertura: Saved information on 961 classes.
    [junit] Testsuite: org.apache.cassandra.service.RemoveTest
    [junit] Tests run: 5, Failures: 0, Errors: 0, Time elapsed: 4.135 sec
    [junit] 
    [junit] Cobertura: Loaded information on 961 classes.
    [junit] Cobertura: Saved information on 961 classes.
    [junit] Testsuite: org.apache.cassandra.service.StorageProxyTest
    [junit] Tests run: 4, Failures: 0, Errors: 0, Time elapsed: 0.501 sec
    [junit] 
    [junit] Cobertura: Loaded information on 961 classes.
    [junit] Cobertura: Saved information on 961 classes.
    [junit] Testsuite: org.apache.cassandra.service.StorageServiceClientTest
    [junit] Tests run: 1, Failures: 0, Errors: 0, Time elapsed: 5.51 sec
    [junit] 
    [junit] Cobertura: Loaded information on 961 classes.
    [junit] Cobertura: Saved information on 961 classes.
    [junit] Testsuite: org.apache.cassandra.service.StorageServiceServerTest
    [junit] Tests run: 3, Failures: 0, Errors: 0, Time elapsed: 1.138 sec
    [junit] 
    [junit] ------------- Standard Error -----------------
    [junit]  WARN 18:38:16,557 Generated random token Token(bytes[bad1fada5d13668a2852407bb019a453]).
Random tokens will result in an unbalanced ring; see http://wiki.apache.org/cassandra/Operations
    [junit] ------------- ---------------- ---------------
    [junit] Cobertura: Loaded information on 961 classes.
    [junit] Cobertura: Saved information on 961 classes.
    [junit] Testsuite: org.apache.cassandra.streaming.BootstrapTest
    [junit] Tests run: 1, Failures: 0, Errors: 0, Time elapsed: 0.682 sec
    [junit] 
    [junit] Cobertura: Loaded information on 961 classes.
    [junit] Cobertura: Saved information on 961 classes.
    [junit] Testsuite: org.apache.cassandra.streaming.StreamingTransferTest
    [junit] Tests run: 2, Failures: 0, Errors: 0, Time elapsed: 1.894 sec
    [junit] 
    [junit] ------------- Standard Error -----------------
    [junit]  WARN 18:38:25,179 Generated random token Token(bytes[8c4fe5987da8a818c2196b320e1e3dcc]).
Random tokens will result in an unbalanced ring; see http://wiki.apache.org/cassandra/Operations
    [junit] ------------- ---------------- ---------------
    [junit] Cobertura: Loaded information on 961 classes.
    [junit] Cobertura: Saved information on 961 classes.
    [junit] Testsuite: org.apache.cassandra.tools.SSTableExportTest
    [junit] Tests run: 4, Failures: 0, Errors: 0, Time elapsed: 1.249 sec
    [junit] 
    [junit] Cobertura: Loaded information on 961 classes.
    [junit] Cobertura: Saved information on 961 classes.
    [junit] Testsuite: org.apache.cassandra.tools.SSTableImportTest
    [junit] Tests run: 2, Failures: 0, Errors: 0, Time elapsed: 0.863 sec
    [junit] 
    [junit] Cobertura: Loaded information on 961 classes.
    [junit] Cobertura: Saved information on 961 classes.
    [junit] Testsuite: org.apache.cassandra.utils.BloomFilterTest
    [junit] Tests run: 6, Failures: 0, Errors: 0, Time elapsed: 6.292 sec
    [junit] 
    [junit] Cobertura: Loaded information on 961 classes.
    [junit] Cobertura: Saved information on 961 classes.
    [junit] Testsuite: org.apache.cassandra.utils.BoundedStatsDequeTest
    [junit] Tests run: 1, Failures: 0, Errors: 0, Time elapsed: 0.067 sec
    [junit] 
    [junit] Cobertura: Loaded information on 961 classes.
    [junit] Cobertura: Saved information on 961 classes.
    [junit] Testsuite: org.apache.cassandra.utils.EstimatedHistogramTest
    [junit] Tests run: 1, Failures: 0, Errors: 0, Time elapsed: 0.083 sec
    [junit] 
    [junit] Cobertura: Loaded information on 961 classes.
    [junit] Cobertura: Saved information on 961 classes.
    [junit] Testsuite: org.apache.cassandra.utils.FBUtilitiesTest
    [junit] Tests run: 4, Failures: 0, Errors: 0, Time elapsed: 0.17 sec
    [junit] 
    [junit] Cobertura: Loaded information on 961 classes.
    [junit] Cobertura: Saved information on 961 classes.
    [junit] Testsuite: org.apache.cassandra.utils.FilterTest
    [junit] Tests run: 1, Failures: 0, Errors: 0, Time elapsed: 2.061 sec
    [junit] 
    [junit] Cobertura: Loaded information on 961 classes.
    [junit] Cobertura: Saved information on 961 classes.
    [junit] Testsuite: org.apache.cassandra.utils.MerkleTreeTest
    [junit] Tests run: 14, Failures: 0, Errors: 0, Time elapsed: 0.581 sec
    [junit] 
    [junit] Cobertura: Loaded information on 961 classes.
    [junit] Cobertura: Saved information on 961 classes.

BUILD FAILED
<https://hudson.apache.org/hudson/job/Cassandra-0.7/ws/cassandra/build.xml>:456: The
following error occurred while executing this line:
<https://hudson.apache.org/hudson/job/Cassandra-0.7/ws/cassandra/build.xml>:451: Some
unit test(s) failed.

Total time: 17 minutes 43 seconds
[TASKS] Skipping publisher since build result is FAILURE
Publishing Javadoc
Archiving artifacts
Recording test results
Skipping Cobertura coverage report as build was not UNSTABLE or better ...


Mime
View raw message