incubator-cassandra-dev mailing list archives

Site index · List index
Message view « Date » · « Thread »
Top « Date » · « Thread »
From Apache Hudson Server <hud...@hudson.apache.org>
Subject Build failed in Hudson: Cassandra-0.7 #48
Date Fri, 03 Dec 2010 16:19:11 GMT
See <https://hudson.apache.org/hudson/job/Cassandra-0.7/48/changes>

Changes:

[jbellis] validateCfDef on add_keyspace
patch by jbellis

------------------------------------------
[...truncated 1566 lines...]
    [junit] Testsuite: org.apache.cassandra.dht.OrderPreservingPartitionerTest
    [junit] Tests run: 6, Failures: 0, Errors: 0, Time elapsed: 8.484 sec
    [junit] 
    [junit] Cobertura: Loaded information on 961 classes.
    [junit] Cobertura: Saved information on 961 classes.
    [junit] Testsuite: org.apache.cassandra.dht.RandomPartitionerTest
    [junit] Tests run: 5, Failures: 0, Errors: 0, Time elapsed: 4.135 sec
    [junit] 
    [junit] Cobertura: Loaded information on 961 classes.
    [junit] Cobertura: Saved information on 961 classes.
    [junit] Testsuite: org.apache.cassandra.dht.RangeTest
    [junit] Tests run: 12, Failures: 0, Errors: 0, Time elapsed: 0.509 sec
    [junit] 
    [junit] Cobertura: Loaded information on 961 classes.
    [junit] Cobertura: Saved information on 961 classes.
    [junit] Testsuite: org.apache.cassandra.gms.ArrivalWindowTest
    [junit] Tests run: 1, Failures: 0, Errors: 0, Time elapsed: 0.137 sec
    [junit] 
    [junit] Cobertura: Loaded information on 961 classes.
    [junit] Cobertura: Saved information on 961 classes.
    [junit] Testsuite: org.apache.cassandra.gms.GossipDigestTest
    [junit] Tests run: 1, Failures: 0, Errors: 0, Time elapsed: 0.067 sec
    [junit] 
    [junit] Cobertura: Loaded information on 961 classes.
    [junit] Cobertura: Saved information on 961 classes.
    [junit] Testsuite: org.apache.cassandra.hadoop.ColumnFamilyInputFormatTest
    [junit] Tests run: 1, Failures: 0, Errors: 0, Time elapsed: 0.214 sec
    [junit] 
    [junit] Cobertura: Loaded information on 961 classes.
    [junit] Cobertura: Saved information on 961 classes.
    [junit] Testsuite: org.apache.cassandra.io.BloomFilterTrackerTest
    [junit] Tests run: 3, Failures: 0, Errors: 0, Time elapsed: 0.43 sec
    [junit] 
    [junit] Cobertura: Loaded information on 961 classes.
    [junit] Cobertura: Saved information on 961 classes.
    [junit] Testsuite: org.apache.cassandra.io.LazilyCompactedRowTest
    [junit] Tests run: 5, Failures: 0, Errors: 0, Time elapsed: 30.61 sec
    [junit] 
    [junit] Cobertura: Loaded information on 961 classes.
    [junit] Cobertura: Saved information on 961 classes.
    [junit] Testsuite: org.apache.cassandra.io.sstable.LegacySSTableTest
    [junit] Tests run: 1, Failures: 0, Errors: 0, Time elapsed: 3.736 sec
    [junit] 
    [junit] ------------- Standard Error -----------------
    [junit]  WARN 16:15:00,148 Invalid file '.svn' in data directory <https://hudson.apache.org/hudson/job/Cassandra-0.7/ws/cassandra/test/data/legacy-sstables/b/Keyspace1.>
    [junit] ------------- ---------------- ---------------
    [junit] Cobertura: Loaded information on 961 classes.
    [junit] Cobertura: Saved information on 961 classes.
    [junit] Testsuite: org.apache.cassandra.io.sstable.SSTableReaderTest
    [junit] Tests run: 3, Failures: 0, Errors: 0, Time elapsed: 6.113 sec
    [junit] 
    [junit] Cobertura: Loaded information on 961 classes.
    [junit] Cobertura: Saved information on 961 classes.
    [junit] Testsuite: org.apache.cassandra.io.sstable.SSTableTest
    [junit] Tests run: 2, Failures: 0, Errors: 0, Time elapsed: 7.133 sec
    [junit] 
    [junit] Cobertura: Loaded information on 961 classes.
    [junit] Cobertura: Saved information on 961 classes.
    [junit] Testsuite: org.apache.cassandra.io.sstable.SSTableWriterTest
    [junit] Tests run: 1, Failures: 0, Errors: 0, Time elapsed: 1.375 sec
    [junit] 
    [junit] Cobertura: Loaded information on 961 classes.
    [junit] Cobertura: Saved information on 961 classes.
    [junit] Testsuite: org.apache.cassandra.io.util.BufferedRandomAccessFileTest
    [junit] Tests run: 4, Failures: 0, Errors: 0, Time elapsed: 0.823 sec
    [junit] 
    [junit] Cobertura: Loaded information on 961 classes.
    [junit] Cobertura: Saved information on 961 classes.
    [junit] Testsuite: org.apache.cassandra.locator.DynamicEndpointSnitchTest
    [junit] Tests run: 1, Failures: 0, Errors: 0, Time elapsed: 6.248 sec
    [junit] 
    [junit] Cobertura: Loaded information on 961 classes.
    [junit] Cobertura: Saved information on 961 classes.
    [junit] Testsuite: org.apache.cassandra.locator.NetworkTopologyStrategyTest
    [junit] Tests run: 1, Failures: 0, Errors: 0, Time elapsed: 0.52 sec
    [junit] 
    [junit] Cobertura: Loaded information on 961 classes.
    [junit] Cobertura: Saved information on 961 classes.
    [junit] Testsuite: org.apache.cassandra.locator.OldNetworkTopologyStrategyTest
    [junit] Tests run: 3, Failures: 0, Errors: 0, Time elapsed: 0.51 sec
    [junit] 
    [junit] Cobertura: Loaded information on 961 classes.
    [junit] Cobertura: Saved information on 961 classes.
    [junit] Testsuite: org.apache.cassandra.locator.ReplicationStrategyEndpointCacheTest
    [junit] Tests run: 2, Failures: 0, Errors: 0, Time elapsed: 0.816 sec
    [junit] 
    [junit] Cobertura: Loaded information on 961 classes.
    [junit] Cobertura: Saved information on 961 classes.
    [junit] Testsuite: org.apache.cassandra.locator.SimpleStrategyTest
    [junit] Tests run: 4, Failures: 0, Errors: 0, Time elapsed: 0.816 sec
    [junit] 
    [junit] Cobertura: Loaded information on 961 classes.
    [junit] Cobertura: Saved information on 961 classes.
    [junit] Testsuite: org.apache.cassandra.locator.TokenMetadataTest
    [junit] Tests run: 2, Failures: 0, Errors: 0, Time elapsed: 0.514 sec
    [junit] 
    [junit] Cobertura: Loaded information on 961 classes.
    [junit] Cobertura: Saved information on 961 classes.
    [junit] Testsuite: org.apache.cassandra.service.AntiEntropyServiceTest
    [junit] Exception in thread "Thread-5" java.lang.RuntimeException: java.lang.NullPointerException
    [junit] 	at org.apache.cassandra.utils.WrappedRunnable.run(WrappedRunnable.java:34)
    [junit] 	at org.apache.cassandra.streaming.StreamInSession.closeIfFinished(StreamInSession.java:164)
    [junit] 	at org.apache.cassandra.streaming.IncomingStreamReader.read(IncomingStreamReader.java:66)
    [junit] 	at org.apache.cassandra.net.IncomingTcpConnection.run(IncomingTcpConnection.java:75)
    [junit] Caused by: java.lang.NullPointerException
    [junit] 	at org.apache.cassandra.service.AntiEntropyService.completedRequest(AntiEntropyService.java:133)
    [junit] 	at org.apache.cassandra.service.AntiEntropyService$Differencer$Callback.runMayThrow(AntiEntropyService.java:537)
    [junit] 	at org.apache.cassandra.utils.WrappedRunnable.run(WrappedRunnable.java:30)
    [junit] 	... 3 more
    [junit] Tests run: 7, Failures: 0, Errors: 0, Time elapsed: 4.914 sec
    [junit] 
    [junit] ------------- Standard Error -----------------
    [junit]  WARN 16:16:05,863 Generated random token Token(bytes[9d01a389e724febc3a9675a6bff9bf88]).
Random tokens will result in an unbalanced ring; see http://wiki.apache.org/cassandra/Operations
    [junit] Exception in thread "AntiEntropyStage:1" java.lang.AssertionError
    [junit] 	at org.apache.cassandra.locator.TokenMetadata.firstTokenIndex(TokenMetadata.java:392)
    [junit] 	at org.apache.cassandra.locator.TokenMetadata.firstToken(TokenMetadata.java:406)
    [junit] 	at org.apache.cassandra.locator.AbstractReplicationStrategy.getNaturalEndpoints(AbstractReplicationStrategy.java:98)
    [junit] 	at org.apache.cassandra.service.StorageService.constructRangeToEndpointMap(StorageService.java:561)
    [junit] 	at org.apache.cassandra.service.StorageService.getRangeToAddressMap(StorageService.java:536)
    [junit] 	at org.apache.cassandra.service.AntiEntropyService.getNeighbors(AntiEntropyService.java:158)
    [junit] 	at org.apache.cassandra.service.AntiEntropyService.rendezvous(AntiEntropyService.java:182)
    [junit] 	at org.apache.cassandra.service.AntiEntropyService.access$100(AntiEntropyService.java:86)
    [junit] 	at org.apache.cassandra.service.AntiEntropyService$TreeResponseVerbHandler.doVerb(AntiEntropyService.java:659)
    [junit] 	at org.apache.cassandra.net.MessageDeliveryTask.run(MessageDeliveryTask.java:63)
    [junit] 	at java.util.concurrent.ThreadPoolExecutor$Worker.runTask(ThreadPoolExecutor.java:886)
    [junit] 	at java.util.concurrent.ThreadPoolExecutor$Worker.run(ThreadPoolExecutor.java:908)
    [junit] 	at java.lang.Thread.run(Thread.java:619)
    [junit] ------------- ---------------- ---------------
    [junit] Cobertura: Loaded information on 961 classes.
    [junit] Cobertura: Saved information on 961 classes.
    [junit] Testsuite: org.apache.cassandra.service.CassandraServerTest
    [junit] Tests run: 1, Failures: 0, Errors: 0, Time elapsed: 0.455 sec
    [junit] 
    [junit] Cobertura: Loaded information on 961 classes.
    [junit] Cobertura: Saved information on 961 classes.
    [junit] Testsuite: org.apache.cassandra.service.EmbeddedCassandraServiceTest
    [junit] Tests run: 1, Failures: 0, Errors: 0, Time elapsed: 2.099 sec
    [junit] 
    [junit] ------------- Standard Error -----------------
    [junit]  WARN 16:16:17,408 Unable to lock JVM memory (ENOMEM). This can result in part
of the JVM being swapped out, especially with mmapped I/O enabled. Increase RLIMIT_MEMLOCK
or run Cassandra as root.
    [junit]  WARN 16:16:18,588 Generated random token Token(bytes[5589ca784573809a17d802fdd02fb69f]).
Random tokens will result in an unbalanced ring; see http://wiki.apache.org/cassandra/Operations
    [junit] ------------- ---------------- ---------------
    [junit] Cobertura: Loaded information on 961 classes.
    [junit] Cobertura: Saved information on 961 classes.
    [junit] Testsuite: org.apache.cassandra.service.InitClientTest
    [junit] Tests run: 1, Failures: 0, Errors: 0, Time elapsed: 5.517 sec
    [junit] 
    [junit] Cobertura: Loaded information on 961 classes.
    [junit] Cobertura: Saved information on 961 classes.
    [junit] Testsuite: org.apache.cassandra.service.MoveTest
    [junit] Tests run: 6, Failures: 0, Errors: 0, Time elapsed: 3.808 sec
    [junit] 
    [junit] ------------- Standard Error -----------------
    [junit]  WARN 16:16:34,869 Node /127.0.0.3 'leaving' token mismatch. Long network partition?
    [junit] ------------- ---------------- ---------------
    [junit] Cobertura: Loaded information on 961 classes.
    [junit] Cobertura: Saved information on 961 classes.
    [junit] Testsuite: org.apache.cassandra.service.ReadResponseResolverTest
    [junit] Tests run: 5, Failures: 0, Errors: 0, Time elapsed: 0.516 sec
    [junit] 
    [junit] Cobertura: Loaded information on 961 classes.
    [junit] Cobertura: Saved information on 961 classes.
    [junit] Testsuite: org.apache.cassandra.service.RemoveTest
    [junit] Tests run: 5, Failures: 0, Errors: 0, Time elapsed: 3.599 sec
    [junit] 
    [junit] Cobertura: Loaded information on 961 classes.
    [junit] Cobertura: Saved information on 961 classes.
    [junit] Testsuite: org.apache.cassandra.service.StorageProxyTest
    [junit] Tests run: 4, Failures: 0, Errors: 0, Time elapsed: 0.502 sec
    [junit] 
    [junit] Cobertura: Loaded information on 961 classes.
    [junit] Cobertura: Saved information on 961 classes.
    [junit] Testsuite: org.apache.cassandra.service.StorageServiceClientTest
    [junit] Tests run: 1, Failures: 0, Errors: 0, Time elapsed: 5.513 sec
    [junit] 
    [junit] Cobertura: Loaded information on 961 classes.
    [junit] Cobertura: Saved information on 961 classes.
    [junit] Testsuite: org.apache.cassandra.service.StorageServiceServerTest
    [junit] Tests run: 3, Failures: 0, Errors: 0, Time elapsed: 1.455 sec
    [junit] 
    [junit] ------------- Standard Error -----------------
    [junit]  WARN 16:17:04,208 Generated random token Token(bytes[17cf9b7eaba73b550396f360d60d7885]).
Random tokens will result in an unbalanced ring; see http://wiki.apache.org/cassandra/Operations
    [junit] ------------- ---------------- ---------------
    [junit] Cobertura: Loaded information on 961 classes.
    [junit] Cobertura: Saved information on 961 classes.
    [junit] Testsuite: org.apache.cassandra.streaming.BootstrapTest
    [junit] Tests run: 1, Failures: 0, Errors: 0, Time elapsed: 0.696 sec
    [junit] 
    [junit] Cobertura: Loaded information on 961 classes.
    [junit] Cobertura: Saved information on 961 classes.
    [junit] Testsuite: org.apache.cassandra.streaming.StreamingTransferTest
    [junit] Tests run: 2, Failures: 0, Errors: 0, Time elapsed: 2 sec
    [junit] 
    [junit] ------------- Standard Error -----------------
    [junit]  WARN 16:17:12,879 Generated random token Token(bytes[1d37b7b5a3239186f693bbd897d50b35]).
Random tokens will result in an unbalanced ring; see http://wiki.apache.org/cassandra/Operations
    [junit] ------------- ---------------- ---------------
    [junit] Cobertura: Loaded information on 961 classes.
    [junit] Cobertura: Saved information on 961 classes.
    [junit] Testsuite: org.apache.cassandra.tools.SSTableExportTest
    [junit] Tests run: 4, Failures: 0, Errors: 0, Time elapsed: 1.144 sec
    [junit] 
    [junit] Cobertura: Loaded information on 961 classes.
    [junit] Cobertura: Saved information on 961 classes.
    [junit] Testsuite: org.apache.cassandra.tools.SSTableImportTest
    [junit] Tests run: 2, Failures: 0, Errors: 0, Time elapsed: 0.925 sec
    [junit] 
    [junit] Cobertura: Loaded information on 961 classes.
    [junit] Cobertura: Saved information on 961 classes.
    [junit] Testsuite: org.apache.cassandra.utils.BloomFilterTest
    [junit] Tests run: 6, Failures: 0, Errors: 0, Time elapsed: 6.272 sec
    [junit] 
    [junit] Cobertura: Loaded information on 961 classes.
    [junit] Cobertura: Saved information on 961 classes.
    [junit] Testsuite: org.apache.cassandra.utils.BoundedStatsDequeTest
    [junit] Tests run: 1, Failures: 0, Errors: 0, Time elapsed: 0.067 sec
    [junit] 
    [junit] Cobertura: Loaded information on 961 classes.
    [junit] Cobertura: Saved information on 961 classes.
    [junit] Testsuite: org.apache.cassandra.utils.EstimatedHistogramTest
    [junit] Tests run: 1, Failures: 0, Errors: 0, Time elapsed: 0.083 sec
    [junit] 
    [junit] Cobertura: Loaded information on 961 classes.
    [junit] Cobertura: Saved information on 961 classes.
    [junit] Testsuite: org.apache.cassandra.utils.FBUtilitiesTest
    [junit] Tests run: 4, Failures: 0, Errors: 0, Time elapsed: 0.171 sec
    [junit] 
    [junit] Cobertura: Loaded information on 961 classes.
    [junit] Cobertura: Saved information on 961 classes.
    [junit] Testsuite: org.apache.cassandra.utils.FilterTest
    [junit] Tests run: 1, Failures: 0, Errors: 0, Time elapsed: 2.043 sec
    [junit] 
    [junit] Cobertura: Loaded information on 961 classes.
    [junit] Cobertura: Saved information on 961 classes.
    [junit] Testsuite: org.apache.cassandra.utils.MerkleTreeTest
    [junit] Tests run: 14, Failures: 0, Errors: 0, Time elapsed: 0.583 sec
    [junit] 
    [junit] Cobertura: Loaded information on 961 classes.
    [junit] Cobertura: Saved information on 961 classes.

BUILD FAILED
<https://hudson.apache.org/hudson/job/Cassandra-0.7/ws/cassandra/build.xml>:456: The
following error occurred while executing this line:
<https://hudson.apache.org/hudson/job/Cassandra-0.7/ws/cassandra/build.xml>:451: Some
unit test(s) failed.

Total time: 17 minutes 55 seconds
[TASKS] Skipping publisher since build result is FAILURE
Publishing Javadoc
Archiving artifacts
Recording test results
Skipping Cobertura coverage report as build was not UNSTABLE or better ...


Mime
View raw message