incubator-cassandra-dev mailing list archives

Site index · List index
Message view « Date » · « Thread »
Top « Date » · « Thread »
From Apache Hudson Server <hud...@hudson.apache.org>
Subject Build failed in Hudson: Cassandra #616
Date Wed, 08 Dec 2010 02:18:10 GMT
See <https://hudson.apache.org/hudson/job/Cassandra/616/changes>

Changes:

[jbellis] merge from 0.7

[jbellis] r/m empty contrib/redhat dir

[brandonwilliams] nodetool can display compaction stats.  Patch by Edward Capriolo, reviewed
by brandonwilliams for CASSANDRA-1763

[brandonwilliams] Move redhat init script out of contrib.  Patch by Nick Bailey, reviewed
by brandonwilliams for CASSANDRA-1823

------------------------------------------
[...truncated 1624 lines...]
    [junit] Tests run: 5, Failures: 0, Errors: 0, Time elapsed: 4.109 sec
    [junit] 
    [junit] Cobertura: Loaded information on 986 classes.
    [junit] Cobertura: Saved information on 986 classes.
    [junit] Testsuite: org.apache.cassandra.dht.RangeTest
    [junit] Tests run: 12, Failures: 0, Errors: 0, Time elapsed: 0.5 sec
    [junit] 
    [junit] Cobertura: Loaded information on 986 classes.
    [junit] Cobertura: Saved information on 986 classes.
    [junit] Testsuite: org.apache.cassandra.gms.ArrivalWindowTest
    [junit] Tests run: 1, Failures: 0, Errors: 0, Time elapsed: 0.132 sec
    [junit] 
    [junit] Cobertura: Loaded information on 986 classes.
    [junit] Cobertura: Saved information on 986 classes.
    [junit] Testsuite: org.apache.cassandra.gms.GossipDigestTest
    [junit] Tests run: 1, Failures: 0, Errors: 0, Time elapsed: 0.067 sec
    [junit] 
    [junit] Cobertura: Loaded information on 986 classes.
    [junit] Cobertura: Saved information on 986 classes.
    [junit] Testsuite: org.apache.cassandra.hadoop.ColumnFamilyInputFormatTest
    [junit] Tests run: 1, Failures: 0, Errors: 0, Time elapsed: 0.212 sec
    [junit] 
    [junit] Cobertura: Loaded information on 986 classes.
    [junit] Cobertura: Saved information on 986 classes.
    [junit] Testsuite: org.apache.cassandra.io.BloomFilterTrackerTest
    [junit] Tests run: 3, Failures: 0, Errors: 0, Time elapsed: 0.427 sec
    [junit] 
    [junit] Cobertura: Loaded information on 986 classes.
    [junit] Cobertura: Saved information on 986 classes.
    [junit] Testsuite: org.apache.cassandra.io.LazilyCompactedRowTest
    [junit] Tests run: 5, Failures: 0, Errors: 0, Time elapsed: 19.716 sec
    [junit] 
    [junit] Cobertura: Loaded information on 986 classes.
    [junit] Cobertura: Saved information on 986 classes.
    [junit] Testsuite: org.apache.cassandra.io.sstable.LegacySSTableTest
    [junit] Tests run: 1, Failures: 0, Errors: 0, Time elapsed: 3.733 sec
    [junit] 
    [junit] ------------- Standard Error -----------------
    [junit]  WARN 02:14:06,829 Invalid file '.svn' in data directory <https://hudson.apache.org/hudson/job/Cassandra/ws/cassandra/test/data/legacy-sstables/b/Keyspace1.>
    [junit] ------------- ---------------- ---------------
    [junit] Cobertura: Loaded information on 986 classes.
    [junit] Cobertura: Saved information on 986 classes.
    [junit] Testsuite: org.apache.cassandra.io.sstable.SSTableReaderTest
    [junit] Tests run: 3, Failures: 0, Errors: 0, Time elapsed: 5.26 sec
    [junit] 
    [junit] Cobertura: Loaded information on 986 classes.
    [junit] Cobertura: Saved information on 986 classes.
    [junit] Testsuite: org.apache.cassandra.io.sstable.SSTableTest
    [junit] Tests run: 2, Failures: 0, Errors: 0, Time elapsed: 6.953 sec
    [junit] 
    [junit] Cobertura: Loaded information on 986 classes.
    [junit] Cobertura: Saved information on 986 classes.
    [junit] Testsuite: org.apache.cassandra.io.sstable.SSTableWriterTest
    [junit] Tests run: 1, Failures: 0, Errors: 0, Time elapsed: 1.163 sec
    [junit] 
    [junit] Cobertura: Loaded information on 986 classes.
    [junit] Cobertura: Saved information on 986 classes.
    [junit] Testsuite: org.apache.cassandra.io.util.BufferedRandomAccessFileTest
    [junit] Tests run: 4, Failures: 0, Errors: 0, Time elapsed: 0.686 sec
    [junit] 
    [junit] Cobertura: Loaded information on 986 classes.
    [junit] Cobertura: Saved information on 986 classes.
    [junit] Testsuite: org.apache.cassandra.locator.DynamicEndpointSnitchTest
    [junit] Tests run: 1, Failures: 0, Errors: 0, Time elapsed: 6.247 sec
    [junit] 
    [junit] Cobertura: Loaded information on 986 classes.
    [junit] Cobertura: Saved information on 986 classes.
    [junit] Testsuite: org.apache.cassandra.locator.NetworkTopologyStrategyTest
    [junit] Tests run: 1, Failures: 0, Errors: 0, Time elapsed: 0.494 sec
    [junit] 
    [junit] Cobertura: Loaded information on 986 classes.
    [junit] Cobertura: Saved information on 986 classes.
    [junit] Testsuite: org.apache.cassandra.locator.OldNetworkTopologyStrategyTest
    [junit] Tests run: 3, Failures: 0, Errors: 0, Time elapsed: 0.512 sec
    [junit] 
    [junit] Cobertura: Loaded information on 986 classes.
    [junit] Cobertura: Saved information on 986 classes.
    [junit] Testsuite: org.apache.cassandra.locator.ReplicationStrategyEndpointCacheTest
    [junit] Tests run: 2, Failures: 0, Errors: 0, Time elapsed: 0.685 sec
    [junit] 
    [junit] Cobertura: Loaded information on 986 classes.
    [junit] Cobertura: Saved information on 986 classes.
    [junit] Testsuite: org.apache.cassandra.locator.SimpleStrategyTest
    [junit] Tests run: 4, Failures: 0, Errors: 0, Time elapsed: 0.76 sec
    [junit] 
    [junit] Cobertura: Loaded information on 986 classes.
    [junit] Cobertura: Saved information on 986 classes.
    [junit] Testsuite: org.apache.cassandra.locator.TokenMetadataTest
    [junit] Tests run: 2, Failures: 0, Errors: 0, Time elapsed: 0.504 sec
    [junit] 
    [junit] Cobertura: Loaded information on 986 classes.
    [junit] Cobertura: Saved information on 986 classes.
    [junit] Testsuite: org.apache.cassandra.service.AntiEntropyServiceTest
    [junit] Exception in thread "Thread-5" java.lang.RuntimeException: java.lang.NullPointerException
    [junit] 	at org.apache.cassandra.utils.WrappedRunnable.run(WrappedRunnable.java:34)
    [junit] 	at org.apache.cassandra.streaming.StreamInSession.closeIfFinished(StreamInSession.java:164)
    [junit] 	at org.apache.cassandra.streaming.IncomingStreamReader.read(IncomingStreamReader.java:66)
    [junit] 	at org.apache.cassandra.net.IncomingTcpConnection.run(IncomingTcpConnection.java:75)
    [junit] Caused by: java.lang.NullPointerException
    [junit] 	at org.apache.cassandra.service.AntiEntropyService.completedRequest(AntiEntropyService.java:133)
    [junit] 	at org.apache.cassandra.service.AntiEntropyService$Differencer$Callback.runMayThrow(AntiEntropyService.java:537)
    [junit] 	at org.apache.cassandra.utils.WrappedRunnable.run(WrappedRunnable.java:30)
    [junit] 	... 3 more
    [junit] Tests run: 7, Failures: 0, Errors: 0, Time elapsed: 4.861 sec
    [junit] 
    [junit] ------------- Standard Error -----------------
    [junit]  WARN 02:15:10,999 Generated random token Token(bytes[94157f5ab2da2d6b3eb93ea8e653736d]).
Random tokens will result in an unbalanced ring; see http://wiki.apache.org/cassandra/Operations
    [junit] Exception in thread "AntiEntropyStage:1" java.lang.AssertionError
    [junit] 	at org.apache.cassandra.locator.TokenMetadata.firstTokenIndex(TokenMetadata.java:392)
    [junit] 	at org.apache.cassandra.locator.TokenMetadata.firstToken(TokenMetadata.java:406)
    [junit] 	at org.apache.cassandra.locator.AbstractReplicationStrategy.getNaturalEndpoints(AbstractReplicationStrategy.java:98)
    [junit] 	at org.apache.cassandra.service.StorageService.constructRangeToEndpointMap(StorageService.java:561)
    [junit] 	at org.apache.cassandra.service.StorageService.getRangeToAddressMap(StorageService.java:536)
    [junit] 	at org.apache.cassandra.service.AntiEntropyService.getNeighbors(AntiEntropyService.java:158)
    [junit] 	at org.apache.cassandra.service.AntiEntropyService.rendezvous(AntiEntropyService.java:182)
    [junit] 	at org.apache.cassandra.service.AntiEntropyService.access$100(AntiEntropyService.java:86)
    [junit] 	at org.apache.cassandra.service.AntiEntropyService$TreeResponseVerbHandler.doVerb(AntiEntropyService.java:659)
    [junit] 	at org.apache.cassandra.net.MessageDeliveryTask.run(MessageDeliveryTask.java:63)
    [junit] 	at java.util.concurrent.ThreadPoolExecutor$Worker.runTask(ThreadPoolExecutor.java:886)
    [junit] 	at java.util.concurrent.ThreadPoolExecutor$Worker.run(ThreadPoolExecutor.java:908)
    [junit] 	at java.lang.Thread.run(Thread.java:619)
    [junit] ------------- ---------------- ---------------
    [junit] Cobertura: Loaded information on 986 classes.
    [junit] Cobertura: Saved information on 986 classes.
    [junit] Testsuite: org.apache.cassandra.service.CassandraServerTest
    [junit] Tests run: 1, Failures: 0, Errors: 0, Time elapsed: 0.434 sec
    [junit] 
    [junit] Cobertura: Loaded information on 986 classes.
    [junit] Cobertura: Saved information on 986 classes.
    [junit] Testsuite: org.apache.cassandra.service.ConsistencyLevelTest
    [junit] Tests run: 1, Failures: 0, Errors: 0, Time elapsed: 1.183 sec
    [junit] 
    [junit] Cobertura: Loaded information on 986 classes.
    [junit] Cobertura: Saved information on 986 classes.
    [junit] Testsuite: org.apache.cassandra.service.EmbeddedCassandraServiceTest
    [junit] Testsuite: org.apache.cassandra.service.EmbeddedCassandraServiceTest
    [junit] Tests run: 1, Failures: 0, Errors: 1, Time elapsed: 0 sec
    [junit] 
    [junit] Testcase: org.apache.cassandra.service.EmbeddedCassandraServiceTest:BeforeFirstTest:
Caused an ERROR
    [junit] Forked Java VM exited abnormally. Please note the time in the report does not
reflect the time until the VM exit.
    [junit] junit.framework.AssertionFailedError: Forked Java VM exited abnormally. Please
note the time in the report does not reflect the time until the VM exit.
    [junit] 
    [junit] 
    [junit] Test org.apache.cassandra.service.EmbeddedCassandraServiceTest FAILED (crashed)
    [junit] Testsuite: org.apache.cassandra.service.InitClientTest
    [junit] Tests run: 1, Failures: 0, Errors: 0, Time elapsed: 5.501 sec
    [junit] 
    [junit] Cobertura: Loaded information on 986 classes.
    [junit] Cobertura: Saved information on 986 classes.
    [junit] Testsuite: org.apache.cassandra.service.MoveTest
    [junit] Tests run: 6, Failures: 0, Errors: 0, Time elapsed: 3.58 sec
    [junit] 
    [junit] ------------- Standard Error -----------------
    [junit]  WARN 02:15:42,904 Node /127.0.0.3 'leaving' token mismatch. Long network partition?
    [junit] ------------- ---------------- ---------------
    [junit] Cobertura: Loaded information on 986 classes.
    [junit] Cobertura: Saved information on 986 classes.
    [junit] Testsuite: org.apache.cassandra.service.ReadResponseResolverTest
    [junit] Tests run: 5, Failures: 0, Errors: 0, Time elapsed: 0.522 sec
    [junit] 
    [junit] Cobertura: Loaded information on 986 classes.
    [junit] Cobertura: Saved information on 986 classes.
    [junit] Testsuite: org.apache.cassandra.service.RemoveTest
    [junit] Tests run: 5, Failures: 0, Errors: 0, Time elapsed: 3.608 sec
    [junit] 
    [junit] Cobertura: Loaded information on 986 classes.
    [junit] Cobertura: Saved information on 986 classes.
    [junit] Testsuite: org.apache.cassandra.service.StorageProxyTest
    [junit] Tests run: 4, Failures: 0, Errors: 0, Time elapsed: 0.505 sec
    [junit] 
    [junit] Cobertura: Loaded information on 986 classes.
    [junit] Cobertura: Saved information on 986 classes.
    [junit] Testsuite: org.apache.cassandra.service.StorageServiceClientTest
    [junit] Tests run: 1, Failures: 0, Errors: 0, Time elapsed: 5.518 sec
    [junit] 
    [junit] Cobertura: Loaded information on 986 classes.
    [junit] Cobertura: Saved information on 986 classes.
    [junit] Testsuite: org.apache.cassandra.service.StorageServiceServerTest
    [junit] Tests run: 3, Failures: 0, Errors: 0, Time elapsed: 1.461 sec
    [junit] 
    [junit] ------------- Standard Error -----------------
    [junit]  WARN 02:16:11,582 Generated random token Token(bytes[2202617fde7177f03dffe8f3b59fd88f]).
Random tokens will result in an unbalanced ring; see http://wiki.apache.org/cassandra/Operations
    [junit] ------------- ---------------- ---------------
    [junit] Cobertura: Loaded information on 986 classes.
    [junit] Cobertura: Saved information on 986 classes.
    [junit] Testsuite: org.apache.cassandra.streaming.BootstrapTest
    [junit] Tests run: 1, Failures: 0, Errors: 0, Time elapsed: 0.688 sec
    [junit] 
    [junit] Cobertura: Loaded information on 986 classes.
    [junit] Cobertura: Saved information on 986 classes.
    [junit] Testsuite: org.apache.cassandra.streaming.StreamingTransferTest
    [junit] Tests run: 2, Failures: 0, Errors: 0, Time elapsed: 1.894 sec
    [junit] 
    [junit] ------------- Standard Error -----------------
    [junit]  WARN 02:16:20,154 Generated random token Token(bytes[50d6cb74769c84e8f05601ec134fe277]).
Random tokens will result in an unbalanced ring; see http://wiki.apache.org/cassandra/Operations
    [junit] ------------- ---------------- ---------------
    [junit] Cobertura: Loaded information on 986 classes.
    [junit] Cobertura: Saved information on 986 classes.
    [junit] Testsuite: org.apache.cassandra.tools.SSTableExportTest
    [junit] Tests run: 4, Failures: 0, Errors: 0, Time elapsed: 1.19 sec
    [junit] 
    [junit] Cobertura: Loaded information on 986 classes.
    [junit] Cobertura: Saved information on 986 classes.
    [junit] Testsuite: org.apache.cassandra.tools.SSTableImportTest
    [junit] Tests run: 2, Failures: 0, Errors: 0, Time elapsed: 0.869 sec
    [junit] 
    [junit] Cobertura: Loaded information on 986 classes.
    [junit] Cobertura: Saved information on 986 classes.
    [junit] Testsuite: org.apache.cassandra.utils.BloomFilterTest
    [junit] Tests run: 6, Failures: 0, Errors: 0, Time elapsed: 6.315 sec
    [junit] 
    [junit] Cobertura: Loaded information on 986 classes.
    [junit] Cobertura: Saved information on 986 classes.
    [junit] Testsuite: org.apache.cassandra.utils.BoundedStatsDequeTest
    [junit] Tests run: 1, Failures: 0, Errors: 0, Time elapsed: 0.067 sec
    [junit] 
    [junit] Cobertura: Loaded information on 986 classes.
    [junit] Cobertura: Saved information on 986 classes.
    [junit] Testsuite: org.apache.cassandra.utils.EstimatedHistogramTest
    [junit] Tests run: 1, Failures: 0, Errors: 0, Time elapsed: 0.082 sec
    [junit] 
    [junit] Cobertura: Loaded information on 986 classes.
    [junit] Cobertura: Saved information on 986 classes.
    [junit] Testsuite: org.apache.cassandra.utils.FBUtilitiesTest
    [junit] Tests run: 4, Failures: 0, Errors: 0, Time elapsed: 0.171 sec
    [junit] 
    [junit] Cobertura: Loaded information on 986 classes.
    [junit] Cobertura: Saved information on 986 classes.
    [junit] Testsuite: org.apache.cassandra.utils.FilterTest
    [junit] Tests run: 1, Failures: 0, Errors: 0, Time elapsed: 2.037 sec
    [junit] 
    [junit] Cobertura: Loaded information on 986 classes.
    [junit] Cobertura: Saved information on 986 classes.
    [junit] Testsuite: org.apache.cassandra.utils.MerkleTreeTest
    [junit] Tests run: 14, Failures: 0, Errors: 0, Time elapsed: 0.586 sec
    [junit] 
    [junit] Cobertura: Loaded information on 986 classes.
    [junit] Cobertura: Saved information on 986 classes.

BUILD FAILED
<https://hudson.apache.org/hudson/job/Cassandra/ws/cassandra/build.xml>:477: The following
error occurred while executing this line:
<https://hudson.apache.org/hudson/job/Cassandra/ws/cassandra/build.xml>:472: Some unit
test(s) failed.

Total time: 18 minutes 5 seconds
[TASKS] Skipping publisher since build result is FAILURE
Publishing Javadoc
Archiving artifacts
Recording test results
Skipping Cobertura coverage report as build was not UNSTABLE or better ...


Mime
View raw message