incubator-cassandra-dev mailing list archives

Site index · List index
Message view « Date » · « Thread »
Top « Date » · « Thread »
From Apache Hudson Server <hud...@hudson.apache.org>
Subject Build failed in Hudson: Cassandra-0.7 #93
Date Fri, 17 Dec 2010 16:01:55 GMT
See <https://hudson.apache.org/hudson/job/Cassandra-0.7/93/changes>

Changes:

[jbellis] return InvalidRequest when remove ofsubcolumn without supercolumn is requested
patch by thobbs; reviewed by jbellis for CASSANDRA-1866

------------------------------------------
[...truncated 1394 lines...]
    [junit] Testsuite: org.apache.cassandra.db.MultitableTest
    [junit] Tests run: 1, Failures: 0, Errors: 0, Time elapsed: 1.08 sec
    [junit] 
    [junit] Testsuite: org.apache.cassandra.db.NameSortTest
    [junit] Tests run: 3, Failures: 0, Errors: 0, Time elapsed: 2.509 sec
    [junit] 
    [junit] Testsuite: org.apache.cassandra.db.OneCompactionTest
    [junit] Tests run: 2, Failures: 0, Errors: 0, Time elapsed: 1.396 sec
    [junit] 
    [junit] Testsuite: org.apache.cassandra.db.ReadMessageTest
    [junit] Tests run: 2, Failures: 0, Errors: 0, Time elapsed: 0.673 sec
    [junit] 
    [junit] Testsuite: org.apache.cassandra.db.RecoveryManager2Test
    [junit] Tests run: 1, Failures: 0, Errors: 0, Time elapsed: 4.213 sec
    [junit] 
    [junit] Testsuite: org.apache.cassandra.db.RecoveryManager3Test
    [junit] Tests run: 1, Failures: 0, Errors: 0, Time elapsed: 1.039 sec
    [junit] 
    [junit] Testsuite: org.apache.cassandra.db.RecoveryManagerTest
    [junit] Tests run: 2, Failures: 0, Errors: 0, Time elapsed: 1.066 sec
    [junit] 
    [junit] Testsuite: org.apache.cassandra.db.RecoveryManagerTruncateTest
    [junit] Tests run: 1, Failures: 0, Errors: 0, Time elapsed: 0.98 sec
    [junit] 
    [junit] Testsuite: org.apache.cassandra.db.RemoveColumnFamilyTest
    [junit] Tests run: 1, Failures: 0, Errors: 0, Time elapsed: 0.606 sec
    [junit] 
    [junit] Testsuite: org.apache.cassandra.db.RemoveColumnFamilyWithFlush1Test
    [junit] Tests run: 1, Failures: 0, Errors: 0, Time elapsed: 0.805 sec
    [junit] 
    [junit] Testsuite: org.apache.cassandra.db.RemoveColumnFamilyWithFlush2Test
    [junit] Tests run: 1, Failures: 0, Errors: 0, Time elapsed: 0.77 sec
    [junit] 
    [junit] Testsuite: org.apache.cassandra.db.RemoveColumnTest
    [junit] Tests run: 1, Failures: 0, Errors: 0, Time elapsed: 0.803 sec
    [junit] 
    [junit] Testsuite: org.apache.cassandra.db.RemoveSubColumnTest
    [junit] Tests run: 1, Failures: 0, Errors: 0, Time elapsed: 0.822 sec
    [junit] 
    [junit] Testsuite: org.apache.cassandra.db.RemoveSuperColumnTest
    [junit] Tests run: 4, Failures: 0, Errors: 0, Time elapsed: 1.796 sec
    [junit] 
    [junit] Testsuite: org.apache.cassandra.db.RowIterationTest
    [junit] Tests run: 1, Failures: 0, Errors: 0, Time elapsed: 0.666 sec
    [junit] 
    [junit] Testsuite: org.apache.cassandra.db.RowTest
    [junit] Tests run: 4, Failures: 0, Errors: 0, Time elapsed: 2.391 sec
    [junit] 
    [junit] Testsuite: org.apache.cassandra.db.SuperColumnTest
    [junit] Tests run: 1, Failures: 0, Errors: 0, Time elapsed: 0.125 sec
    [junit] 
    [junit] Testsuite: org.apache.cassandra.db.TableTest
    [junit] Tests run: 10, Failures: 0, Errors: 0, Time elapsed: 3.92 sec
    [junit] 
    [junit] Testsuite: org.apache.cassandra.db.TimeSortTest
    [junit] Tests run: 2, Failures: 0, Errors: 0, Time elapsed: 4.701 sec
    [junit] 
    [junit] Testsuite: org.apache.cassandra.db.commitlog.CommitLogHeaderTest
    [junit] Tests run: 2, Failures: 0, Errors: 0, Time elapsed: 0.381 sec
    [junit] 
    [junit] Testsuite: org.apache.cassandra.db.marshal.IntegerTypeTest
    [junit] Tests run: 10, Failures: 0, Errors: 0, Time elapsed: 0.183 sec
    [junit] 
    [junit] Testsuite: org.apache.cassandra.db.marshal.TimeUUIDTypeTest
    [junit] Tests run: 4, Failures: 0, Errors: 0, Time elapsed: 0.067 sec
    [junit] 
    [junit] Testsuite: org.apache.cassandra.db.marshal.TypeCompareTest
    [junit] Tests run: 5, Failures: 0, Errors: 0, Time elapsed: 0.138 sec
    [junit] 
    [junit] Testsuite: org.apache.cassandra.dht.BootStrapperTest
    [junit] Tests run: 4, Failures: 0, Errors: 0, Time elapsed: 1.88 sec
    [junit] 
    [junit] ------------- Standard Error -----------------
    [junit]  WARN 15:58:35,793 Generated random token Token(bytes[7cca2cfb133bfbe01ca908230568b3f1]).
Random tokens will result in an unbalanced ring; see http://wiki.apache.org/cassandra/Operations
    [junit] ------------- ---------------- ---------------
    [junit] Testsuite: org.apache.cassandra.dht.ByteOrderedPartitionerTest
    [junit] Tests run: 5, Failures: 0, Errors: 0, Time elapsed: 0.998 sec
    [junit] 
    [junit] Testsuite: org.apache.cassandra.dht.CollatingOrderPreservingPartitionerTest
    [junit] Tests run: 7, Failures: 0, Errors: 0, Time elapsed: 1.238 sec
    [junit] 
    [junit] Testsuite: org.apache.cassandra.dht.OrderPreservingPartitionerTest
    [junit] Tests run: 6, Failures: 0, Errors: 0, Time elapsed: 1.1 sec
    [junit] 
    [junit] Testsuite: org.apache.cassandra.dht.RandomPartitionerTest
    [junit] Tests run: 5, Failures: 0, Errors: 0, Time elapsed: 0.637 sec
    [junit] 
    [junit] Testsuite: org.apache.cassandra.dht.RangeTest
    [junit] Tests run: 12, Failures: 0, Errors: 0, Time elapsed: 0.382 sec
    [junit] 
    [junit] Testsuite: org.apache.cassandra.gms.ArrivalWindowTest
    [junit] Tests run: 1, Failures: 0, Errors: 0, Time elapsed: 0.113 sec
    [junit] 
    [junit] Testsuite: org.apache.cassandra.gms.GossipDigestTest
    [junit] Tests run: 1, Failures: 0, Errors: 0, Time elapsed: 0.053 sec
    [junit] 
    [junit] Testsuite: org.apache.cassandra.hadoop.ColumnFamilyInputFormatTest
    [junit] Tests run: 1, Failures: 0, Errors: 0, Time elapsed: 0.18 sec
    [junit] 
    [junit] Testsuite: org.apache.cassandra.io.BloomFilterTrackerTest
    [junit] Tests run: 3, Failures: 0, Errors: 0, Time elapsed: 0.326 sec
    [junit] 
    [junit] Testsuite: org.apache.cassandra.io.LazilyCompactedRowTest
    [junit] Tests run: 5, Failures: 0, Errors: 0, Time elapsed: 20.659 sec
    [junit] 
    [junit] Testsuite: org.apache.cassandra.io.sstable.LegacySSTableTest
    [junit] Tests run: 1, Failures: 0, Errors: 0, Time elapsed: 0.816 sec
    [junit] 
    [junit] ------------- Standard Error -----------------
    [junit]  WARN 15:59:11,115 Invalid file '.svn' in data directory <https://hudson.apache.org/hudson/job/Cassandra-0.7/ws/cassandra/test/data/legacy-sstables/b/Keyspace1.>
    [junit] ------------- ---------------- ---------------
    [junit] Testsuite: org.apache.cassandra.io.sstable.SSTableReaderTest
    [junit] Tests run: 3, Failures: 0, Errors: 0, Time elapsed: 4.859 sec
    [junit] 
    [junit] Testsuite: org.apache.cassandra.io.sstable.SSTableTest
    [junit] Tests run: 2, Failures: 0, Errors: 0, Time elapsed: 1.325 sec
    [junit] 
    [junit] Testsuite: org.apache.cassandra.io.sstable.SSTableWriterTest
    [junit] Tests run: 1, Failures: 0, Errors: 0, Time elapsed: 0.893 sec
    [junit] 
    [junit] Testsuite: org.apache.cassandra.io.util.BufferedRandomAccessFileTest
    [junit] Tests run: 4, Failures: 0, Errors: 0, Time elapsed: 0.722 sec
    [junit] 
    [junit] Testsuite: org.apache.cassandra.locator.DynamicEndpointSnitchTest
    [junit] Tests run: 1, Failures: 0, Errors: 0, Time elapsed: 6.153 sec
    [junit] 
    [junit] Testsuite: org.apache.cassandra.locator.NetworkTopologyStrategyTest
    [junit] Tests run: 1, Failures: 0, Errors: 0, Time elapsed: 0.389 sec
    [junit] 
    [junit] Testsuite: org.apache.cassandra.locator.OldNetworkTopologyStrategyTest
    [junit] Tests run: 3, Failures: 0, Errors: 0, Time elapsed: 0.394 sec
    [junit] 
    [junit] Testsuite: org.apache.cassandra.locator.ReplicationStrategyEndpointCacheTest
    [junit] Tests run: 2, Failures: 0, Errors: 0, Time elapsed: 0.587 sec
    [junit] 
    [junit] Testsuite: org.apache.cassandra.locator.SimpleStrategyTest
    [junit] Tests run: 4, Failures: 0, Errors: 0, Time elapsed: 0.489 sec
    [junit] 
    [junit] Testsuite: org.apache.cassandra.locator.TokenMetadataTest
    [junit] Tests run: 2, Failures: 0, Errors: 0, Time elapsed: 0.384 sec
    [junit] 
    [junit] Testsuite: org.apache.cassandra.service.AntiEntropyServiceTest
    [junit] Tests run: 7, Failures: 0, Errors: 0, Time elapsed: 2.481 sec
    [junit] 
    [junit] ------------- Standard Error -----------------
    [junit]  WARN 15:59:36,814 Generated random token Token(bytes[3dfbb52478277484d9d27bb3685d2a1c]).
Random tokens will result in an unbalanced ring; see http://wiki.apache.org/cassandra/Operations
    [junit] Exception in thread "Thread-4" java.lang.RuntimeException: java.lang.NullPointerException
    [junit] 	at org.apache.cassandra.utils.WrappedRunnable.run(WrappedRunnable.java:34)
    [junit] 	at org.apache.cassandra.streaming.StreamInSession.closeIfFinished(StreamInSession.java:164)
    [junit] 	at org.apache.cassandra.streaming.IncomingStreamReader.read(IncomingStreamReader.java:66)
    [junit] 	at org.apache.cassandra.net.IncomingTcpConnection.run(IncomingTcpConnection.java:75)
    [junit] Caused by: java.lang.NullPointerException
    [junit] 	at org.apache.cassandra.service.AntiEntropyService.completedRequest(AntiEntropyService.java:133)
    [junit] 	at org.apache.cassandra.service.AntiEntropyService$Differencer$Callback.runMayThrow(AntiEntropyService.java:537)
    [junit] 	at org.apache.cassandra.utils.WrappedRunnable.run(WrappedRunnable.java:30)
    [junit] 	... 3 more
    [junit] ------------- ---------------- ---------------
    [junit] Testsuite: org.apache.cassandra.service.CassandraServerTest
    [junit] Tests run: 1, Failures: 0, Errors: 0, Time elapsed: 0.327 sec
    [junit] 
    [junit] Testsuite: org.apache.cassandra.service.ConsistencyLevelTest
    [junit] Tests run: 1, Failures: 0, Errors: 0, Time elapsed: 0.851 sec
    [junit] 
    [junit] Testsuite: org.apache.cassandra.service.EmbeddedCassandraServiceTest
    [junit] Tests run: 1, Failures: 0, Errors: 0, Time elapsed: 1.281 sec
    [junit] 
    [junit] ------------- Standard Error -----------------
    [junit]  WARN 15:59:42,764 Unable to lock JVM memory (ENOMEM). This can result in part
of the JVM being swapped out, especially with mmapped I/O enabled. Increase RLIMIT_MEMLOCK
or run Cassandra as root.
    [junit]  WARN 15:59:43,347 Generated random token Token(bytes[202fac6ee9b53392091c210921e9b0d8]).
Random tokens will result in an unbalanced ring; see http://wiki.apache.org/cassandra/Operations
    [junit] ------------- ---------------- ---------------
    [junit] Testsuite: org.apache.cassandra.service.InitClientTest
    [junit] Tests run: 1, Failures: 0, Errors: 0, Time elapsed: 5.392 sec
    [junit] 
    [junit] Testsuite: org.apache.cassandra.service.MoveTest
    [junit] Tests run: 6, Failures: 0, Errors: 0, Time elapsed: 3.253 sec
    [junit] 
    [junit] ------------- Standard Error -----------------
    [junit]  WARN 15:59:53,831 Node /127.0.0.3 'leaving' token mismatch. Long network partition?
    [junit] ------------- ---------------- ---------------
    [junit] Testsuite: org.apache.cassandra.service.ReadResponseResolverTest
    [junit] Tests run: 5, Failures: 0, Errors: 0, Time elapsed: 0.398 sec
    [junit] 
    [junit] Testsuite: org.apache.cassandra.service.RemoveTest
    [junit] Tests run: 5, Failures: 0, Errors: 0, Time elapsed: 3.059 sec
    [junit] 
    [junit] Testsuite: org.apache.cassandra.service.StorageProxyTest
    [junit] Tests run: 4, Failures: 0, Errors: 0, Time elapsed: 0.361 sec
    [junit] 
    [junit] Testsuite: org.apache.cassandra.service.StorageServiceClientTest
    [junit] Tests run: 1, Failures: 0, Errors: 0, Time elapsed: 5.402 sec
    [junit] 
    [junit] Testsuite: org.apache.cassandra.service.StorageServiceServerTest
    [junit] Tests run: 3, Failures: 0, Errors: 0, Time elapsed: 0.919 sec
    [junit] 
    [junit] ------------- Standard Error -----------------
    [junit]  WARN 16:00:08,168 Generated random token Token(bytes[9058168d68b8b43789dbf4ea3345b54a]).
Random tokens will result in an unbalanced ring; see http://wiki.apache.org/cassandra/Operations
    [junit] ------------- ---------------- ---------------
    [junit] Testsuite: org.apache.cassandra.streaming.BootstrapTest
    [junit] Tests run: 1, Failures: 0, Errors: 0, Time elapsed: 0.504 sec
    [junit] 
    [junit] Testsuite: org.apache.cassandra.streaming.StreamingTransferTest
    [junit] Tests run: 2, Failures: 0, Errors: 0, Time elapsed: 1.64 sec
    [junit] 
    [junit] ------------- Standard Error -----------------
    [junit]  WARN 16:00:11,082 Generated random token Token(bytes[74b24b32cc3e6ad7e1d448df98994d6f]).
Random tokens will result in an unbalanced ring; see http://wiki.apache.org/cassandra/Operations
    [junit] ------------- ---------------- ---------------
    [junit] Testsuite: org.apache.cassandra.tools.SSTableExportTest
    [junit] Tests run: 4, Failures: 0, Errors: 1, Time elapsed: 1.09 sec
    [junit] 
    [junit] Testcase: testExportSimpleCf(org.apache.cassandra.tools.SSTableExportTest):	Caused
an ERROR
    [junit] Index: 4, Size: 4
    [junit] java.lang.IndexOutOfBoundsException: Index: 4, Size: 4
    [junit] 	at java.util.ArrayList.RangeCheck(ArrayList.java:547)
    [junit] 	at java.util.ArrayList.get(ArrayList.java:322)
    [junit] 	at org.apache.cassandra.tools.SSTableExportTest.testExportSimpleCf(SSTableExportTest.java:130)
    [junit] 
    [junit] 
    [junit] Test org.apache.cassandra.tools.SSTableExportTest FAILED
    [junit] Testsuite: org.apache.cassandra.tools.SSTableImportTest
    [junit] Tests run: 2, Failures: 0, Errors: 0, Time elapsed: 0.686 sec
    [junit] 
    [junit] Testsuite: org.apache.cassandra.utils.BloomFilterTest
    [junit] Tests run: 6, Failures: 0, Errors: 0, Time elapsed: 0.497 sec
    [junit] 
    [junit] Testsuite: org.apache.cassandra.utils.BoundedStatsDequeTest
    [junit] Tests run: 1, Failures: 0, Errors: 0, Time elapsed: 0.052 sec
    [junit] 
    [junit] Testsuite: org.apache.cassandra.utils.EstimatedHistogramTest
    [junit] Tests run: 1, Failures: 0, Errors: 0, Time elapsed: 0.053 sec
    [junit] 
    [junit] Testsuite: org.apache.cassandra.utils.FBUtilitiesTest
    [junit] Tests run: 4, Failures: 0, Errors: 0, Time elapsed: 0.127 sec
    [junit] 
    [junit] Testsuite: org.apache.cassandra.utils.FilterTest
    [junit] Tests run: 1, Failures: 0, Errors: 0, Time elapsed: 0.22 sec
    [junit] 
    [junit] Testsuite: org.apache.cassandra.utils.MerkleTreeTest
    [junit] Tests run: 14, Failures: 0, Errors: 0, Time elapsed: 0.414 sec
    [junit] 

BUILD FAILED
<https://hudson.apache.org/hudson/job/Cassandra-0.7/ws/cassandra/build.xml>:457: The
following error occurred while executing this line:
<https://hudson.apache.org/hudson/job/Cassandra-0.7/ws/cassandra/build.xml>:452: Some
unit test(s) failed.

Total time: 11 minutes 56 seconds
[TASKS] Skipping publisher since build result is FAILURE
Publishing Javadoc
Archiving artifacts
Recording test results


Mime
View raw message